{
    "id": "journeyOfLove",
    "title_id": "story_template_title_romantic_trip",
    "music": "Resource/music/out.aac",
    "resolution": [2520, 1080],
    "segments": [
        {
            "camera_id": 0,
            "duration": 2.0,
            "shot_mode": "dual_video",
            "twins_video_status": "SWAP",
            "demo_offset": [0, 1.9],
            "audio_offset": 0,
            "algo_scripts": {
            },
            "holder_scripts": {
            }
        },
        {
            "camera_id": 1,
            "duration": 2.4,
            "shot_mode": "single_video",
            "demo_offset": [2.1, 4.2],
            "audio_offset": 2.1,
            "algo_scripts": {
            },
            "holder_scripts": {
            }
        },
        {
            "camera_id": 1,
            "duration": 1.4,
            "shot_mode": "one_take_slow_mode",
            "demo_offset": [4.4, 7.1],
            "audio_offset": 4.4,
            "algo_scripts": {
            },
            "holder_scripts": {
            }
        },
        {
            "camera_id": 0,
            "duration": 2.8,
            "shot_mode": "dual_video",
            "twins_video_status": "SWAP",
            "demo_offset": [7.3, 9.9],
            "audio_offset": 7.3,
            "algo_scripts": {
            },
            "holder_scripts": {
            }
        },
        {
            "camera_id": 0,
            "duration": 3.0,
            "shot_mode": "single_video",
            "demo_offset": [10.1, 12.2],
            "audio_offset": 10.1,
            "algo_scripts": {
            },
            "holder_scripts": {
            }
        },
		{
            "camera_id": 0,
            "duration": 2.4,
            "shot_mode": "dual_video_picture_in_picture",
            "demo_offset": [13, 15.0],
            "audio_offset": 13.0,
            "algo_scripts": {
            },
            "holder_scripts": {
            }
        }
    ]
}