{
    "resId":"nlu_wordSegment_group",
    "domain":"nlu",
    "district":"china",
    "deviceType":"common",
    "productName":"common",
    "romVersion":"common",
    "osVersion":"common",
    "version":"0x01010000",
    "releaseNotes":"",
    "digest":"",
    "fileName":"",
    "ResMetaData":[
        {
            "origin_id":"0x0000000002000001",
            "res_value":"",
            "res_path":"nlu/wordSegment/config/configure.xml",
            "domain":"nlu",
            "data_version":"0x01010000",
            "encrypt_mode":"0"
        },
        {
            "origin_id":"0x0000000002000002",
            "res_value":"",
            "res_path":"nlu/wordSegment/core/addrdict.dat",
            "domain":"nlu",
            "data_version":"0x01010000",
            "encrypt_mode":"0"
        },
        {
            "origin_id":"0x0000000002000003",
            "res_value":"",
            "res_path":"nlu/wordSegment/core/addrdict.pos",
            "domain":"nlu",
            "data_version":"0x01010000",
            "encrypt_mode":"0"
        },
        {
            "origin_id":"0x0000000002000004",
            "res_value":"",
            "res_path":"nlu/wordSegment/core/charset.type",
            "domain":"nlu",
            "data_version":"0x01010000",
            "encrypt_mode":"0"
        },
        {
            "origin_id":"0x0000000002000005",
            "res_value":"",
            "res_path":"nlu/wordSegment/core/coredict.big",
            "domain":"nlu",
            "data_version":"0x01010000",
            "encrypt_mode":"0"
        },
        {
            "origin_id":"0x0000000002000006",
            "res_value":"",
            "res_path":"nlu/wordSegment/core/coredict.dat",
            "domain":"nlu",
            "data_version":"0x01010000",
            "encrypt_mode":"0"
        },
        {
            "origin_id":"0x0000000002000007",
            "res_value":"",
            "res_path":"nlu/wordSegment/core/coredict.tig",
            "domain":"nlu",
            "data_version":"0x01010000",
            "encrypt_mode":"0"
        },
        {
            "origin_id":"0x0000000002000008",
            "res_value":"",
            "res_path":"nlu/wordSegment/core/coredict.uig",
            "domain":"nlu",
            "data_version":"0x01010000",
            "encrypt_mode":"0"
        },
        {
            "origin_id":"0x0000000002000009",
            "res_value":"",
            "res_path":"nlu/wordSegment/core/orgzdict.dat",
            "domain":"nlu",
            "data_version":"0x01010000",
            "encrypt_mode":"0"
        },
        {
            "origin_id":"0x000000000200000a",
            "res_value":"",
            "res_path":"nlu/wordSegment/core/orgzdict.pos",
            "domain":"nlu",
            "data_version":"0x01010000",
            "encrypt_mode":"0"
        },
        {
            "origin_id":"0x000000000200000d",
            "res_value":"",
            "res_path":"nlu/wordSegment/core/wordtype.dat",
            "domain":"nlu",
            "data_version":"0x01010000",
            "encrypt_mode":"0"
        },
        {
            "origin_id":"0x000000000200000e",
            "res_value":"",
            "res_path":"nlu/wordSegment/core/wordtype.pos",
            "domain":"nlu",
            "data_version":"0x01010000",
            "encrypt_mode":"0"
        },
        {
            "origin_id":"0x000000000200000f",
            "res_value":"",
            "res_path":"nlu/wordSegment/english/english.dat",
            "domain":"nlu",
            "data_version":"0x01010000",
            "encrypt_mode":"0"
        },
        {
            "origin_id":"0x0000000002000010",
            "res_value":"",
            "res_path":"nlu/wordSegment/english/english.pos",
            "domain":"nlu",
            "data_version":"0x01010000",
            "encrypt_mode":"0"
        },
        {
            "origin_id":"0x0000000002000011",
            "res_value":"",
            "res_path":"nlu/wordSegment/english/english.ung",
            "domain":"nlu",
            "data_version":"0x01010000",
            "encrypt_mode":"0"
        },
        {
            "origin_id":"0x0000000002000012",
            "res_value":"",
            "res_path":"nlu/wordSegment/english/english.wordlist",
            "domain":"nlu",
            "data_version":"0x01010000",
            "encrypt_mode":"0"
        },
        {
            "origin_id":"0x0000000002000013",
            "res_value":"",
            "res_path":"nlu/wordSegment/english/englishname.dat",
            "domain":"nlu",
            "data_version":"0x01010000",
            "encrypt_mode":"0"
        },
        {
            "origin_id":"0x0000000002000014",
            "res_value":"",
            "res_path":"nlu/wordSegment/english/englishname.pos",
            "domain":"nlu",
            "data_version":"0x01010000",
            "encrypt_mode":"0"
        },
        {
            "origin_id":"0x0000000002000015",
            "res_value":"",
            "res_path":"nlu/wordSegment/english/irrel2regular.map",
            "domain":"nlu",
            "data_version":"0x01010000",
            "encrypt_mode":"0"
        },
        {
            "origin_id":"0x0000000002000016",
            "res_value":"",
            "res_path":"nlu/wordSegment/english/ne.dat",
            "domain":"nlu",
            "data_version":"0x01010000",
            "encrypt_mode":"0"
        },
        {
            "origin_id":"0x0000000002000017",
            "res_value":"",
            "res_path":"nlu/wordSegment/english/ne.pos",
            "domain":"nlu",
            "data_version":"0x01010000",
            "encrypt_mode":"0"
        },
        {
            "origin_id":"0x0000000002000018",
            "res_value":"",
            "res_path":"nlu/wordSegment/english/ne.wordlist",
            "domain":"nlu",
            "data_version":"0x01010000",
            "encrypt_mode":"0"
        },
        {
            "origin_id":"0x0000000002000019",
            "res_value":"",
            "res_path":"nlu/wordSegment/keyword/stopword.dat",
            "domain":"nlu",
            "data_version":"0x01010000",
            "encrypt_mode":"0"
        },
        {
            "origin_id":"0x000000000200001a",
            "res_value":"",
            "res_path":"nlu/wordSegment/ner/address.ctx",
            "domain":"nlu",
            "data_version":"0x01010000",
            "encrypt_mode":"0"
        },
        {
            "origin_id":"0x000000000200001b",
            "res_value":"",
            "res_path":"nlu/wordSegment/ner/address.fsa",
            "domain":"nlu",
            "data_version":"0x01010000",
            "encrypt_mode":"0"
        },
        {
            "origin_id":"0x000000000200001c",
            "res_value":"",
            "res_path":"nlu/wordSegment/ner/address.role",
            "domain":"nlu",
            "data_version":"0x01010000",
            "encrypt_mode":"0"
        },
        {
            "origin_id":"0x000000000200001d",
            "res_value":"",
            "res_path":"nlu/wordSegment/ner/name_role_jp16.dat",
            "domain":"nlu",
            "data_version":"0x01010000",
            "encrypt_mode":"0"
        },
        {
            "origin_id":"0x000000000200001e",
            "res_value":"",
            "res_path":"nlu/wordSegment/ner/name_role_jp16.pos",
            "domain":"nlu",
            "data_version":"0x01010000",
            "encrypt_mode":"0"
        },
        {
            "origin_id":"0x000000000200001f",
            "res_value":"",
            "res_path":"nlu/wordSegment/ner/name_role_jp17.dat",
            "domain":"nlu",
            "data_version":"0x01010000",
            "encrypt_mode":"0"
        },
        {
            "origin_id":"0x0000000002000020",
            "res_value":"",
            "res_path":"nlu/wordSegment/ner/name_role_jp17.pos",
            "domain":"nlu",
            "data_version":"0x01010000",
            "encrypt_mode":"0"
        },
        {
            "origin_id":"0x0000000002000021",
            "res_value":"",
            "res_path":"nlu/wordSegment/ner/name_role_jp18.dat",
            "domain":"nlu",
            "data_version":"0x01010000",
            "encrypt_mode":"0"
        },
        {
            "origin_id":"0x0000000002000022",
            "res_value":"",
            "res_path":"nlu/wordSegment/ner/name_role_jp18.pos",
            "domain":"nlu",
            "data_version":"0x01010000",
            "encrypt_mode":"0"
        },
        {
            "origin_id":"0x0000000002000023",
            "res_value":"",
            "res_path":"nlu/wordSegment/ner/person.ctx",
            "domain":"nlu",
            "data_version":"0x01010000",
            "encrypt_mode":"0"
        },
        {
            "origin_id":"0x0000000002000024",
            "res_value":"",
            "res_path":"nlu/wordSegment/ner/person.fsa",
            "domain":"nlu",
            "data_version":"0x01010000",
            "encrypt_mode":"0"
        },
        {
            "origin_id":"0x0000000002000025",
            "res_value":"",
            "res_path":"nlu/wordSegment/ner/person.role",
            "domain":"nlu",
            "data_version":"0x01010000",
            "encrypt_mode":"0"
        },
        {
            "origin_id":"0x0000000002000026",
            "res_value":"",
            "res_path":"nlu/wordSegment/ner/specific_name_dict.dat",
            "domain":"nlu",
            "data_version":"0x01010000",
            "encrypt_mode":"0"
        },
        {
            "origin_id":"0x0000000002000027",
            "res_value":"",
            "res_path":"nlu/wordSegment/ner/specific_name_dict.pos",
            "domain":"nlu",
            "data_version":"0x01010000",
            "encrypt_mode":"0"
        },
        {
            "origin_id":"0x0000000002000028",
            "res_value":"",
            "res_path":"nlu/wordSegment/pos/coredict.pos",
            "domain":"nlu",
            "data_version":"0x01010000",
            "encrypt_mode":"0"
        },
        {
            "origin_id":"0x0000000002000029",
            "res_value":"",
            "res_path":"nlu/wordSegment/pos/ictpos.map",
            "domain":"nlu",
            "data_version":"0x01010000",
            "encrypt_mode":"0"
        },
        {
            "origin_id":"0x000000000200002a",
            "res_value":"",
            "res_path":"nlu/wordSegment/pos/pos.ctx",
            "domain":"nlu",
            "data_version":"0x01010000",
            "encrypt_mode":"0"
        },
        {
            "origin_id":"0x000000000200002b",
            "res_value":"",
            "res_path":"nlu/wordSegment/sentiment/degree.dat",
            "domain":"nlu",
            "data_version":"0x01010000",
            "encrypt_mode":"0"
        },
        {
            "origin_id":"0x000000000200002c",
            "res_value":"",
            "res_path":"nlu/wordSegment/sentiment/negtive.dat",
            "domain":"nlu",
            "data_version":"0x01010000",
            "encrypt_mode":"0"
        },
        {
            "origin_id":"0x000000000200002d",
            "res_value":"",
            "res_path":"nlu/wordSegment/sentiment/negtive.pos",
            "domain":"nlu",
            "data_version":"0x01010000",
            "encrypt_mode":"0"
        },
        {
            "origin_id":"0x000000000200002e",
            "res_value":"",
            "res_path":"nlu/wordSegment/sentiment/notword.dat",
            "domain":"nlu",
            "data_version":"0x01010000",
            "encrypt_mode":"0"
        },
        {
            "origin_id":"0x000000000200002f",
            "res_value":"",
            "res_path":"nlu/wordSegment/sentiment/positive.dat",
            "domain":"nlu",
            "data_version":"0x01010000",
            "encrypt_mode":"0"
        },
        {
            "origin_id":"0x0000000002000030",
            "res_value":"",
            "res_path":"nlu/wordSegment/sentiment/positive.pos",
            "domain":"nlu",
            "data_version":"0x01010000",
            "encrypt_mode":"0"
        },
        {
            "origin_id":"0x0000000002000031",
            "res_value":"",
            "res_path":"nlu/wordSegment/sentiment/stopword.dat",
            "domain":"nlu",
            "data_version":"0x01010000",
            "encrypt_mode":"0"
        },
        {
            "origin_id":"0x0000000002000032",
            "res_value":"",
            "res_path":"nlu/wordSegment/user/global/staticdct.dat",
            "domain":"nlu",
            "data_version":"0x01010000",
            "encrypt_mode":"0"
        },
        {
            "origin_id":"0x0000000002000033",
            "res_value":"",
            "res_path":"nlu/wordSegment/user/global/staticdct.pos",
            "domain":"nlu",
            "data_version":"0x01010000",
            "encrypt_mode":"0"
        },
        {
            "origin_id":"0x000000000200003d",
            "res_value":"",
            "res_path":"nlu/wordSegment/user/custom/fieldFullUpdate.dat",
            "domain":"nlu",
            "data_version":"0x01010000",
            "encrypt_mode":"0"
        },
        {
            "origin_id":"0x000000000200003e",
            "res_value":"",
            "res_path":"nlu/wordSegment/user/custom/fieldFullUpdate.pos",
            "domain":"nlu",
            "data_version":"0x01010000",
            "encrypt_mode":"0"
        },
        {
            "origin_id":"0x000000000200003f",
            "res_value":"",
            "res_path":"nlu/wordSegment/user/custom/fieldUpdate.dat",
            "domain":"nlu",
            "data_version":"0x01010000",
            "encrypt_mode":"0"
        },
        {
            "origin_id":"0x0000000002000040",
            "res_value":"",
            "res_path":"nlu/wordSegment/user/custom/fieldUpdate.pos",
            "domain":"nlu",
            "data_version":"0x01010000",
            "encrypt_mode":"0"
        },
        {
            "origin_id":"0x0000000002000041",
            "res_value":"",
            "res_path":"nlu/wordSegment/user/custom/location.dat",
            "domain":"nlu",
            "data_version":"0x01010000",
            "encrypt_mode":"0"
        },
        {
            "origin_id":"0x0000000002000042",
            "res_value":"",
            "res_path":"nlu/wordSegment/user/custom/location.pos",
            "domain":"nlu",
            "data_version":"0x01010000",
            "encrypt_mode":"0"
        },
        {
            "origin_id":"0x0000000002000043",
            "res_value":"",
            "res_path":"nlu/wordSegment/user/custom/newWord.dat",
            "domain":"nlu",
            "data_version":"0x01010000",
            "encrypt_mode":"0"
        },
        {
            "origin_id":"0x0000000002000044",
            "res_value":"",
            "res_path":"nlu/wordSegment/user/custom/newWord.pos",
            "domain":"nlu",
            "data_version":"0x01010000",
            "encrypt_mode":"0"
        },
        {
            "origin_id":"0x0000000002000045",
            "res_value":"",
            "res_path":"nlu/wordSegment/user/custom/nonNs.dat",
            "domain":"nlu",
            "data_version":"0x01010000",
            "encrypt_mode":"0"
        },
        {
            "origin_id":"0x0000000002000046",
            "res_value":"",
            "res_path":"nlu/wordSegment/user/custom/nonNs.pos",
            "domain":"nlu",
            "data_version":"0x01010000",
            "encrypt_mode":"0"
        },
        {
            "origin_id":"0x0000000002000047",
            "res_value":"",
            "res_path":"nlu/wordSegment/user/custom/ns.dat",
            "domain":"nlu",
            "data_version":"0x01010000",
            "encrypt_mode":"0"
        },
        {
            "origin_id":"0x0000000002000048",
            "res_value":"",
            "res_path":"nlu/wordSegment/user/custom/ns.pos",
            "domain":"nlu",
            "data_version":"0x01010000",
            "encrypt_mode":"0"
        },
        {
            "origin_id":"0x0000000002000049",
            "res_value":"",
            "res_path":"nlu/wordSegment/user/custom/wordMerge.dat",
            "domain":"nlu",
            "data_version":"0x01010000",
            "encrypt_mode":"0"
        },
        {
            "origin_id":"0x000000000200004a",
            "res_value":"",
            "res_path":"nlu/wordSegment/user/custom/wordMerge.pos",
            "domain":"nlu",
            "data_version":"0x01010000",
            "encrypt_mode":"0"
        },
        {
            "origin_id":"0x00000000020000a8",
            "res_value":"",
            "res_path":"nlu/wordSegment/user/custom/polyphonic.dat",
            "domain":"voice",
            "data_version":"0x01010000",
            "encrypt_mode":"0"
        },
        {
            "origin_id":"0x00000000020000a9",
            "res_value":"",
            "res_path":"nlu/wordSegment/user/custom/polyphonic.pos",
            "domain":"voice",
            "data_version":"0x01010000",
            "encrypt_mode":"0"
        },        {            "origin_id":"0x0000000002001013",            "res_value":"",            "res_path":"nlu/wordSegment/core/common_pron.dat",            "domain":"voice",            "data_version":"0x01010000",            "encrypt_mode":"0"        },        {            "origin_id":"0x0000000002001014",            "res_value":"",            "res_path":"nlu/wordSegment/core/common_pron.pos",            "domain":"voice",            "data_version":"0x01010000",            "encrypt_mode":"0"        },        {            "origin_id":"0x0000000002001015",            "res_value":"",            "res_path":"nlu/wordSegment/core/surname_cn_pron.dat",            "domain":"voice",            "data_version":"0x01010000",            "encrypt_mode":"0"        },        {            "origin_id":"0x0000000002001016",            "res_value":"",            "res_path":"nlu/wordSegment/core/surname_cn_pron.pos",            "domain":"voice",            "data_version":"0x01010000",            "encrypt_mode":"0"        }
    ]
}