{
    "id": "exercise",
    "title_id": "story_template_title_rhythm_moment",
    "music": "Resource/music/out.aac",
	"resolution": [1080, 2520],
    "segments": [
        {
            "camera_id": 1,
            "duration": 3.6,
            "shot_mode": "single_video",
            "demo_offset": [0, 3.4],
            "audio_offset": 0,
            "algo_scripts": {
                "operation_mode": "panning",
                "operation_param": "50,50,50,50"
            },
            "camera_effects": {
                "beauty": "5"
            }
        },
        {
            "camera_id": 0,
            "duration": 2.1,
            "shot_mode": "dual_video",
            "twins_video_status": "NORMAL",
            "demo_offset": [3.8, 5.4],
            "audio_offset": 3.8,
            "algo_scripts": {
                "operation_mode": "panning",
                "operation_param": "50,50,50,50"
            },
            "camera_effects": {
                "beauty": "0"
            }
        },
        {
            "camera_id": 1,
            "duration": 1.6,
            "shot_mode": "one_take_slow_mode",
            "demo_offset": [6, 8.5],
            "audio_offset": 6,
            "algo_scripts": {
                "operation_mode": "panning",
                "operation_param": "50,50,50,50"
            },
            "camera_effects": {
                "beauty": "0"
            }
        },
        {
            "camera_id": 0,
            "duration": 2.6,
            "shot_mode": "single_video",
            "demo_offset": [9.2, 11],
            "audio_offset": 9.2,
            "algo_scripts": {
                "operation_mode": "panning",
                "operation_param": "50,50,50,50"
            },
            "camera_effects": {
                "beauty": "0"
            }
        },
        {
            "camera_id": 0,
            "duration": 3.9,
            "shot_mode": "dual_video",
            "twins_video_status": "NORMAL",
            "demo_offset": [11.6, 15.0],
            "audio_offset": 11.8,
            "algo_scripts": {
                "operation_mode": "panning",
                "operation_param": "50,50,50,50"
            },
            "camera_effects": {
                "beauty": "0"
            }
        }
    ]
}