{
  "beat": [
    160,576,1024,1312,1472,1792,2304,2752,3200,3488,3648,4032,4480,4928,5152,5376,5568,5792,6016,6432,6656,6848,7072,7520,7712,7936,8095,8384,8544,8704,8864,9216,9664,9856,10048,10240,10400,10688,10912,11328,11584,11776,11936,12096,12256,12416,12608,12832,13120,13280,13440,13632,13824,13984,14304,14592,14752,15040,15200,15392,15616,16032,16191,16448,16768,16928,17120,17312,17504,17728,18176,18496,18688,18848,19008,19232,19424,19616,19776,19968,20192,20384,20608,20768,21024,21248,21568,21824,22016,22240,22432,22880,23040,23296,23744,24032,24192,24352,24736,24992,25312,25632,25824,26112,26336,26592,27040,27200,27616,28000
  ],
  "beat_count": 110,
  "downbeat": [
    576,
    3200,
    4928,
    7520,
    10048,
    13280,
    15040,
    16928,
    19424,
    21568,
    22880,
    24032,
    25824,
    27200,
    29952
  ],
  "downbeat_count": 15
}