{
  "beat": [
    480,736,1216,1440,1920,2400,2688,3136,3360,3840,4320,4608,5056,5280,5760,6016,6240,6464,6656,6976,7200,7680,8160,8416,8896,9120,9600,9856,10080,10368,10816,11040,11520,12000,12352,12736,12960,13440,13696,13920,14112,14656,14848,15104,15360,15552,15712,15936,16096,16384,16576,16800,16960,17280,17440,17632,17792,17984,18240,18496,18656,18816,18976,19200,19360,19552,19776,19936,20224,20416,20640,20832,21152,21376,21568,21792,22016,22240,22560,22784,23040,23296,23520,23744,23904,24064,24256,24416,24576,24736,24992,25152,25408,25664,25824,26048,26208,26400,26624,26880,27040,27232,27456,27648,27904,28096,28320,28512,28704,29152,29376
    ],
  "beat_count": 111,
  "downbeat": [
    1920,
    3840,
    5760,
    7680,
    9600,
    11520,
    13440,
    14656,
    16576,
    18656,
    20416,
    23040,
    24256,
    25408,
    27040,
    28704,
    29952
  ],
  "downbeat_count": 17
}