{
    "id": "visited",
    "title_id": "story_template_title_marked",
    "music": "Resource/music/out.aac",
	"resolution": [2520, 1080],
    "segments": [
        {
            "camera_id": 0,
            "duration": 3.3,
            "shot_mode": "normal_video",
            "demo_offset": [0, 3.3],
            "audio_offset": 0,
            "algo_scripts": {
                "operation_mode": "panning",
                "operation_param": "50,50,50,50"
            },
            "camera_effects": {
                "beauty": "0"
            }
        },
        {
            "camera_id": 0,
            "duration": 3.6,
            "shot_mode": "normal_video",
            "demo_offset": [3.3, 6.9],
            "audio_offset": 3.3,
            "algo_scripts": {
                "operation_mode": "panning",
                "operation_param": "50,50,50,50"
            },
            "camera_effects": {
                "beauty": "0"
            }
        },
        {
            "camera_id": 0,
            "duration": 3.6,
            "shot_mode": "normal_video",
            "demo_offset": [6.1, 9.7],
            "audio_offset": 6.1,
            "algo_scripts": {
                "operation_mode": "panning",
                "operation_param": "50,50,50,50"
            },
            "camera_effects": {
                "beauty": "0"
            }
        },
        {
            "camera_id": 0,
            "duration": 5.2,
            "shot_mode": "dual_video",
            "twins_video_status": "NORMAL",
            "demo_offset": [9.7, 14.9],
            "audio_offset": 9.7,
            "algo_scripts": {
                "operation_mode": "panning",
                "operation_param": "50,50,50,50"
            },
            "camera_effects": {
                "beauty": "0"
            }
        }
    ]
}