拍照=pai1zhao4
茄子=qie2zi3
播放音乐=bo1fang4yin1yue4
暂停播放=zan4ting2bo1fang4
休息闹钟=xiu1xi1nao4zhong1
今天吃什么=jin1tian1chi1shen2me5
搜索附近美食=sou1suo3fu4jin4mei3shi2
退出导航=tui4chu1dao3hang2
挂断电话=gua4duan4dian4hua4
打开健康码=da3kai1jian4kang1ma3
关闭数据网络=guan1bi4shu4ju4wang3luo4
播放古典乐=bo1fang4gu3dian3yue4
播放民族乐=bo1fang4min2zu2yue4
播放流行乐=bo1fang4liu2xing2yue4
播放古典音乐=bo1fang4gu3dian3yin1yue4
播放民族音乐=bo1fang4min2zu2yin1yue4
播放流行音乐=bo1fang4liu2xing2yin1yue4
播放热门歌曲=bo1fang4re4men2ge1qu3
开始摄像=kai1shi3she4xiang4
停止摄像=ting2zhi3she4xiang4
摄像头转置=she4xiang4tou2zhuan3zhi4
转置摄像头=zhuan3zhi4she4xiang4tou2
前置摄像头=qian2zhi4she4xiang4tou2
摄像头前置=she4xiang4tou2qian2zhi4
健康码扫一扫=jian4kang1ma3sao3yi1sao3
支付宝扫一扫=zhi1fu4bao3sao3yi1sao3
微信扫一扫=wei1xin4sao3yi1sao3
付款码=fu4kuan3ma3
打开付款码=da3kai1fu4kuan3ma3
支付码=zhi1fu4ma3
打开支付码=da3kai1zhi1fu4ma3
地铁乘车码=di4tie3cheng2che1ma3
公交乘车码=gong1jiao1cheng2che1ma3
关闭长期定位=guan1bi4chang2qi1ding4wei4
开始导航=kai1shi3dao3hang2
导航回家=dao3hang2hui2jia1
接听电话=jie1ting1dian4hua4
打开美颜=da3kai1mei3yan2
开始录像=kai1shi3lu4xiang4
停止录像=ting2zhi3lu4xiang4
关闭美颜=guan1bi4mei3yan2
解锁手机=jie3suo3shou3ji1
锁屏=suo3ping2
手机锁屏=shou3ji1suo3ping2
调大音量=tiao2da4yin1liang4
调高音量=tiao2gao1yin1liang4
调小音量=tiao2xiao3yin1liang4
调低音量=tiao2di1yin1liang4
打开控制中心=da3kai1kong4zhi4zhong1xin1
打开通知中心=da3kai1tong1zhi1zhong1xin1
查看信息=cha2kan4xin4xi1
查看天气=cha2kan4tian1qi4
查看微信=cha2kan4wei1xin4
查看主屏幕=cha2kan4zhu3ping2mu4
查看温度=cha2kan4wen1du4
查看航班信息=cha2kan4hang2ban1xin4xi1
关闭空调=guan1bi4kong1tiao2
打开音乐=da3kai1yin1yue4
暂停音乐=zan4ting2yin1yue4
搜索热榜音乐=sou1suo3re4bang3yin1yue4
打开飞行模式=da3kai1fei1xing2mo2shi4
关闭飞行模式=guan1bi4fei1xing2mo2shi4
打开应用市场=da3kai1ying4yong4shi4chang3
开始匹配=kai1shi3pi3pei4
打开车载模式=da3kai1che1zai4mo2shi4
车载模式=che1zai4mo2shi4
打开云空间=da3kai1yun2kong1jian1
放大光圈=fang4da4guang1quan1
缩小光圈=suo1xiao3guang1quan1
打开收藏=da3kai1shou1cang2
收藏照片=shou1cang2zhao4pian4
打开聚焦=da3kai1ju4jiao1
前往主屏幕=qian2wang3zhu3ping2mu4
返回=fan3hui2
显示语音命令=xian3shi4yu3yin1ming4ling4
显示命令=xian3shi4ming4ling4
显示词条=xian3shi4ci2tiao2
进入睡眠状态=jin4ru4shui4mian2zhuang4tai4
唤醒=huan4xing3
开始录制命令=kai1shi3lu4zhi4ming4ling4
停止录制命令=ting2zhi3lu4zhi4ming4ling4
开始录制手势=kai1shi3lu4zhi4shou3shi4
停止录制手势=ting2zhi3lu4zhi4shou3shi4
显示编号=xian3shi4bian1hao4
持续显示编号=chi2xu4xian3shi4bian1hao4
隐藏编号=yin3cang2bian1hao4
显示名称=xian3shi4ming2cheng1
持续显示名称=chi2xu4xian3shi4ming2cheng1
隐藏名称=yin3cang2ming2cheng1
显示网格=xian3shi4wang3ge2
持续显示网格=chi2xu4xian3shi4wang3ge2
隐藏网格=yin3cang2wang3ge2
全选=quan2xuan3
向下滚动=xiang4xia4gun3dong4
向上滚动=xiang4shang4gun3dong4
滚动到底部=gun3dong4dao4di3bu4
滚动到顶部=gun3dong4dao4ding3bu4
向左滚动=xiang4zuo3gun3dong4
向右滚动=xiang4you4gun3dong4
放大=fang4da4
缩小=suo1xiao3
长按=chang2an4
向下平移=xiang4xia4ping2yi2
向上平移=xiang4shang4ping2yi2
向左平移=xiang4zuo3ping2yi2
向右平移=xiang4you4ping2yi2
双指轻点=shuang1zhi3qing1dian3
双指轻点两下=shuang1zhi3qing1dian3liang3xia4
双指长按=shuang1zhi3chang2an4
双指向下平移=shuang1zhi3xiang4xia4ping2yi2
双指向上平移=shuang1zhi3xiang4shang4ping2yi2
双指向左平移=shuang1zhi3xiang4zuo3ping2yi2
双指向右平移=shuang1zhi3xiang4you4ping2yi2
双指向下轻扫=shuang1zhi3xiang4xia4qing1sao3
双指向上轻扫=shuang1zhi3xiang4shang4qing1sao3
双指向左轻扫=shuang1zhi3xiang4zuo3qing1sao3
双指向右轻扫=shuang1zhi3xiang4you4qing1sao3
向下滚动=xiang4xia4gun3dong4
向上滚动=xiang4shang4gun3dong4
滚动到底部=gun3dong4dao4di3bu4
滚动到顶部=gun3dong4dao4ding3bu4
向左滚动=xiang4zuo3gun3dong4
向右滚动=xiang4you4gun3dong4
放大=fang4da4
缩小=suo1xiao3
轻点一下=qing1dian3yi1xia4
轻点两下=qing1dian3liang3xia4
长按=chang2an4
向下平移=xiang4xia4ping2yi2
向上平移=xiang4shang4ping2yi2
向左平移=xiang4zuo3ping2yi2
向右平移=xiang4you4ping2yi2
向左旋转=xiang4zuo3xuan2zhuan3
向右旋转=xiang4you4xuan2zhuan3
开始拖移=kai1shi3tuo1yi2
拖放=tuo1fang4
轻点并按住=qing1dian3bing4an4zhu4
取消手势=qu3xiao1shou3shi4
表情符号=biao3qing2fu2hao4
插入日期=cha1ru4ri4qi1
换行=huan4hang2
添加到词条=tian1jia1dao4ci2tiao2
听写模式=ting1xie3mo2shi4
命令模式=ming4ling4mo2shi4
上移=shang4yi2
下移=xia4yi2
左移=zuo3yi2
右移=you4yi2
关闭语音控制=guan1bi4yu3yin1kong4zhi4
打开辅助触控=da3kai1fu3zhu4chu4kong4
关闭辅助触控=guan1bi4fu3zhu4chu4kong4
打开色彩滤镜=da3kai1se4cai3lv4jing4
关闭色彩滤镜=guan1bi4se4cai3lv4jing4
打开切换控制=da3kai1qie1huan4kong4zhi4
关闭切换控制=guan1bi4qie1huan4kong4zhi4
打开旁白=da3kai1pang2bai2
关闭旁白=guan1bi4pang2bai2
打开缩放=da3kai1suo1fang4
关闭缩放=guan1bi4suo1fang4
目的地=mu4di4di4
大家好=da4jia1hao3
可见度=ke3jian4du4
卫生间=wei4sheng1jian1
曝光量=bao4guang1liang4
耗电量=bao4guang1liang4
运动量=yun4dong4liang4
常用量=chang2yong4liang4
量尺寸=liang2chi3cun4
降水量=jiang4shui3liang4
降雪量=jiang4xue3liang4
信号源=xin4hao4yuan2
信任度=xin4ren4du4
轴对称=zhou2dui4chen4
对称轴=dui4chen4zhou2
破折号=po4zhe2hao4
创刊号=chuang4kan1hao4
省略号=sheng3lve4hao4
书名号=shu1ming2hao4
感叹号=gan3tan4hao4
惊叹号=jing1tan4hao4
双挂号=shuang1gua4hao4
多棱镜=duo1leng2jing4
三棱镜=san1ling2jing4
长镜头=chang2jing4tou2
单引号=dan1yin3hao4
大幅度=da4fu2du4
昨儿个=zuo2er2ge4
前儿个=qian2er2ge4
今儿个=jin1er2ge4
今日个=jin1ri4ge4
明儿个=ming2er2ge4
大一点=da4yi1dian3
上等=shang4deng3
上手=shang4shou3
上列=shang4lie4
难免=nan2mian3
难点=nan2dian3
难怪=nan4guai4
难关=nan2guan1
难度=nan2du4
更名=geng1ming2
更改=geng1gai3
变更=bian4geng1
作业=zuo4ye4
人工=ren2gong1
带尾=dai4wei3
彻尾=che4wei3
至尾=zhi4wei3
影射=ying3she4
多余=duo1yu2
没有=mei2you3
我的=wo3de5
出去=chu1qu4
的确=di2que4
目的=mu4di4
的士=di2shi4
拜拜=bai4bai4
无语=wu2yu3
给力=gei3li4
无轨=wu2gui3
你好=ni3hao3
快乐=kuai4le4
音乐=yin1yue4
可乐=ke3le4
数数=shu3shu4
会计=kuai4ji4
会议=hui4yi4
草率=cao3shuai4
效率=xiao4lv4
有空=you3kong4
小强=xiao3qiang2
大度=da4du4
大伯=da4bo2
增大=zeng1da4
调大=tiao2da4
调小=tiao2xiao3
调高=tiao2gao1
调低=tiao2di1
调亮=tiao2liang4
调暗=tiao2an4
音量=yin1liang4
曝光=bao4guang1
饱和=bao3he2
亮度=liang4du4
相机=xiang4ji1
相册=xiang4ce4
相片=xiang4pian4
图片=tu2pian4
照片=zhao4pian4
移色=yi2se4
移轴=yi2zhou2
双重=shuang1chong2
调节=tiao2jie2
单反=dan1fan3
色调=se4diao4
调整=tiao2zheng3
照相=zhao4xiang4
强度=qiang2du4
空调=kong1tiao2
模式=mo2shi4
歌曲=ge1qu3
温度=wen1du4
降低=jiang4di1
匹配=pi3pei4
应用=ying4yong4
解锁=jie3suo3
车载=che1zai4
空间=kong1jian1
光圈=guang1quan1
收藏=shou1cang2
跳转=tiao4zhuan3
查看=cha2kan4
合上=he2shang4
影射=ying3she4
上网=shang4wang3
手上=shou3shang4
停着=ting2zhe5
照明=zhao4ming2
免提=mian3ti2
扫地=sao3di4
地热=di4re4
踏地=ta4di4
各地=ge4di4
那样=na4yang4
那里=na4li3
那些=na4xie1
那个=na4ge4
那块=na4kuai4
那边=na4bian1
那么=na4me5
那就=na4jiu4
那时=na4shi2
和好=he2hao3
和气=he2qi4
总和=zong3he2
和平=he2ping2
和声=he2sheng1
和谐=he2xie2
柔和=rou2he2
和蔼=he2ai3
缓和=huan3he2
可怜=ke3lian2
可以=ke3yi3
可怕=ke3pa4
可爱=ke3ai4
可是=ke3shi4
可能=ke3neng2
认可=ren4ke3
宁可=ning4ke3
可恶=ke3wu4
可耻=ke3chi3
可靠=ke3kao4
可惜=ke3xi1
可恨=ke3hen4
可亲=ke3qin1
可敬=ke3jing4
什么=shen2me5
怎么=zen3me5
多么=duo1me5
正好=zheng4hao3
刚好=gang1hao3
更好=geng4hao3
好像=hao3xiang4
看病=kan4bing4
看开=kan4kai1
看书=kan4shu1
观看=guan1kan4
看望=kan4wang4
看来=kan4lai2
偷看=tou1kan4
照看=zhao4kan4
发生=fa1sheng1
发现=fa1xian4
出发=chu1fa1
发芽=fa1ya2
发誓=fa1shi4
触发=chu4fa1
启发=qi3fa1
爆发=bao4fa1
蒸发=zheng1fa1
行动=xing2dong4
步行=bu4xing2
骑车=qi2che1
扫码=sao3ma3
出行=chu1xing2
开车=kai1che1
正常=zheng4chang2
不去=bu4qu4
去过=qu4guo4
学过=xue2guo1
越大=yue4da4
重遇=chong2yu4
还需=hai2xu1
月亮=yue4liang4
运气=yun4qi4
捐给=juan1gei3
卷腹=juan3fu4
等于=deng3yu2
培训=pei2xun4
一举=yi1ju3
一律=yi2lv4
雨中=yu3zhong1
一句=yi2ju4
均为=jun1wei2
并于=bing4yu2
选中=xuan3zhong4
决不=jue2bu4
绝不=jue2bu4
教学=jiao4xue2
读取=du2qu3
调取=diao4qu3
大于=da4yu2
削减=xue1jian3
削弱=xue1ruo4
愉快=yu2kuai4
赠予=zeng4yu3
迫于=po4yu2
选择=xuan3ze2
卷起=juan3qi3
宁愿=ning4yuan4
弯曲=wan1qu1
扭曲=niu3qu1
属于=shu3yu2
角逐=jue2zhu2
查询=cha2xun2
乐于=le4yu2
兴趣=xing4qu4
旋转=xuan2zhuan3
转运=zhuan3yun4
允许=yun2xu3
也许=ye2xu3
教育=jiao4yu4
觉醒=jue2xing3
感觉=gan3jue2
全体=quan2ti3
缺少=que1shao3
相遇=xiang1yu4
区分=qu1fen1
缘分=yuan2fen4
还原=huan2yuan2
好运=hao3yun4
过于=guo4yu2
学会=xue2hui4
地区=di4qu1
地域=di4yu4
需要=xu1yao4
觉得=jue2de5
大约=da4yue1
出去=chu1qu4
挖苦=wa1ku3
明白=ming2bai2
特色=te4se4
按时间先后=an4shi2jian1xian1hou4
截止时间=jie2zhi3shi2jian1
自动调焦=zi4dong4tiao2jiao1
纪录影片=ji4lu4ying3pian4
电影短片=dian4ying3duan3pian4
故事影片=gu4shi4ying3pian1
彩色照片=cai3se4zhao4pian4
电视广播=dian4shi4guang3bo1
电话号码=dian4hua4hao4ma3
从小到大=cong2xiao3dao4da4
合二为一=he2er4wei2yi1
上下左右=shang4xia4zuo3you4
从零开始=cong2ling2kai1shi3
从头再来=cong2tou2zai4lai2
苹果公司=ping2guo3gong1si1
不能同意=bu4neng2tong2yi4
大不相同=da4bu4xiang1tong2
从上到下=cong2shang4dao4xia4
上下一致=shang4xia4yi2zhi4
提出申请=ti2chu1shen1qing3
干了什么=gan4le5shen2me5
看场电影=kan4chang3dian4ying3
声音调低=sheng1yin1tiao2di1
音量调小=yin1liang4tiao2xiao3
长焦镜头=chang2jiao1jing4tou2
自拍模式=zi4pai1mo2shi4
设置目的地=she4zhi4mu4di4di4
广角镜头=guang3jiao3jing4tou2
关闭闹钟=guan1bi4nao4zhong1
关闭闹铃=guan1bi4nao4ling2
停止闹钟=ting2zhi3nao4zhong1
停止闹铃=ting2zhi3nao4ling2
关闭=guan1bi4
稍后提醒=shao1hou4ti2xing3
稍后再响=shao1hou4zai4xiang3
等会再响=deng3hui4zai4xiang3
等下再响=deng3xia4zai4xiang3
等会=deng3hui4
