﻿{
    "order": 4,
    "lockScreenInfo": {
        "templateId": "04_pet_world",
        "templateName": [
            {
                "region": "zh-rCN",
                "name": "萌宠世界"
            },
            {
                "region": "en",
                "name": "Cute pets"
            }
        ],
        "thumbnailSrc": "04_preview_lockscreen.png",
        "originSrc": "04_origin.png",
        "cropSrc": "04_crop.png",
        "decorateType": 2,
        "isDepthOfFieldSupported": true,
        "isDepthOfFieldOpened": true,
        "isDepthOfFieldBlurSupported": false,
        "layers": [
            {
                "id": "layer_origin",
                "type": 0,
                "src": "04_origin.png"
            },
            {
                "id": "layer_color",
                "type": 1,
                "colorPolicy": 1,
                "color": "#FFE6B450"
            },
            {
                "id": "layer_res1",
                "type": 2,
                "src": "04_res1_1.png"
            },
            {
                "id": "layer_timer",
                "type": 3,
                "layout": 0,
                "font": "HonorDigits_RoundVF.ttf",
                "color": "#FF995008",
                "colorPolicy": 4,
                "thickness": 10
            },
            {
                "id": "layer_crop",
                "type": 4,
                "src": "04_crop.png"
            }
        ],
        "styles": [
            "宠物",
            "人物"
        ],
        "decorateReses": [
            {
                "id": "res1",
                "src": "04_res1.png",
                "resLayerMappings": {
                    "layer_res1": "04_res1_1.png"
                }
            },
            {
                "id": "res2",
                "src": "04_res2.png",
                "resLayerMappings": {
                    "layer_res1": "04_res2_1.png"
                }
            },
            {
                "id": "res3",
                "src": "04_res3.png",
                "resLayerMappings": {
                    "layer_res1": "04_res3_1.png"
                }
            },
            {
                "id": "res4",
                "src": "04_res4.png",
                "resLayerMappings": {
                    "layer_res1": "04_res4_1.png"
                }
            },
            {
                "id": "res5",
                "src": "04_res5.png",
                "resLayerMappings": {
                    "layer_res1": "04_res5_1.png"
                }
            },
            {
                "id": "res6",
                "src": "04_res6.png",
                "resLayerMappings": {
                    "layer_res1": "04_res6_1.png"
                }
            },
            {
                "id": "res7",
                "src": "04_res7.png",
                "resLayerMappings": {
                    "layer_res1": "04_res7_1.png"
                }
            }
        ],
        "decorateColors": [
            {
                "mainColor": "#FFE6B450",
                "timerColor": "#FF995008"
            },
            {
                "mainColor": "#FFE6837E",
                "timerColor": "#FF8C2823"
            },
            {
                "mainColor": "#FFE68A5C",
                "timerColor": "#FF803319"
            },
            {
                "mainColor": "#FFE6CD50",
                "timerColor": "#FF995C07"
            },
            {
                "mainColor": "#FFA3BF4D",
                "timerColor": "#FF4F660A"
            },
            {
                "mainColor": "#FF87BF60",
                "timerColor": "#FF30660A"
            },
            {
                "mainColor": "#FF73BF8C",
                "timerColor": "#FF16592D"
            },
            {
                "mainColor": "#FF73BFAC",
                "timerColor": "#FF165949"
            },
            {
                "mainColor": "#FF66B3CC",
                "timerColor": "#FF195366"
            },
            {
                "mainColor": "#FF6C9AD9",
                "timerColor": "#FF1D4173"
            },
            {
                "mainColor": "#FF7787D9",
                "timerColor": "#FF263580"
            },
            {
                "mainColor": "#FF8982D9",
                "timerColor": "#FF2E2680"
            },
            {
                "mainColor": "#FF9F82D9",
                "timerColor": "#FF442680"
            },
            {
                "mainColor": "#FFB582D9",
                "timerColor": "#FF5A2680"
            },
            {
                "mainColor": "#FFCC85CC",
                "timerColor": "#FF802080"
            },
            {
                "mainColor": "#FFD982A9",
                "timerColor": "#FF80204B"
            },
            {
                "mainColor": "#FFBFB38F",
                "timerColor": "#FF655B3D"
            },
            {
                "mainColor": "#FF9D9FA6",
                "timerColor": "#FF393A40"
            }
        ]
    },
    "desktopInfo": {
        "templateId": "04_pet_world",
        "groupImageRes": {
            "src": "04_origin.png"
        }
    }
}