{
    "priority_install": [
        "Framework-common",
        "Framework-manager",
        "Framework-runtime",
        "Framework-ui",
        "Framework-privacy",
        "Framework-kitstore",
        "Framework-webapp"
    ],
    "kits": [
        {
            "version_code": "30700302",
            "kit_type": "sdk",
            "kit_name": "huawei_module_mlkit_imgseg",
            "api_level": "11",
            "pkg_name": "com.huawei.hms.mlkit.imgseg",
            "apk_name": "ML-imgseg.apk",
            "minSdkVersion": "19",
            "kit_lib": "armeabi-v7a,arm64-v8a",
            "dependencies": "huawei_module_dynamicloader,8;hmscore,1",
            "main_entry": ""
        },
        {
            "version_code": "60100200",
            "kit_type": "app",
            "kit_name": "AGCLink",
            "api_level": "2",
            "pkg_name": "com.huawei.hms.agclink",
            "apk_name": "AGCLink.apk",
            "minSdkVersion": "19",
            "dependencies": "fwcom-grs,2;fwcom-util,10;fwui,7;hmscore,14;kpms,14;runtime,25;kams,13",
            "main_entry": "com.huawei.hms.agclink.MainEntry"
        },
        {
            "version_code": "40006301",
            "kit_type": "app",
            "kit_name": "walletkit",
            "api_level": "4",
            "pkg_name": "com.huawei.hms.walletkit",
            "apk_name": "WalletKit.apk",
            "minSdkVersion": "19",
            "kit_lib": "armeabi-v7a,arm64-v8a",
            "dependencies": "huawei_module_quic,-1:weak;fwcom-grs,2;fwcom-util,10;fwui,7;hmscore,14;huawei_module_dynamicloader,10;qoes,1;kpms,14;runtime,25;hwid,16;kams,13;huawei_module_quic_pro,-1:weak",
            "main_entry": "com.huawei.hms.walletkit.MainEntry"
        },
        {
            "version_code": "360302",
            "kit_type": "app",
            "kit_name": "awareness_kit",
            "api_level": "13",
            "pkg_name": "com.huawei.hms.kit.awareness",
            "apk_name": "Awareness.apk",
            "minSdkVersion": "24",
            "dependencies": "fwcom-util,13;fwcom-grs,2;fwui,7;hmscore,10;runtime,25;kpms,14;location,2;nearby,136;measurement,4;kams,13",
            "main_entry": "com.huawei.hms.kit.awareness.entry.MainEntry"
        },
        {
            "version_code": "30700301",
            "kit_type": "sdk",
            "kit_name": "huawei_module_mlkit_tisr",
            "api_level": "3",
            "pkg_name": "com.huawei.hms.mlkit.textimagesuperresolution",
            "apk_name": "ML-tsr.apk",
            "minSdkVersion": "19",
            "kit_lib": "armeabi-v7a,arm64-v8a",
            "dependencies": "huawei_module_dynamicloader,8;hmscore,1",
            "main_entry": ""
        },
        {
            "version_code": "31100300",
            "kit_type": "sdk",
            "kit_name": "huawei_module_mlkit_ocr",
            "api_level": "7",
            "pkg_name": "com.huawei.hms.mlkit.ocr",
            "apk_name": "ML-ocr.apk",
            "minSdkVersion": "19",
            "kit_lib": "armeabi-v7a,arm64-v8a",
            "dependencies": "huawei_module_dynamicloader,10;hmscore,1",
            "main_entry": ""
        },
        {
            "version_code": "60600305",
            "kit_type": "sdk",
            "kit_name": "huawei_module_hwdtm",
            "api_level": "1",
            "pkg_name": "com.huawei.hms.dtm",
            "apk_name": "DTM.apk",
            "minSdkVersion": "19",
            "dependencies": "huawei_module_dynamicloader,10;hmscore,1;push,1",
            "main_entry": ""
        },
        {
            "version_code": "61300300",
            "kit_type": "app",
            "kit_name": "identity",
            "api_level": "3",
            "pkg_name": "com.huawei.hms.identity",
            "apk_name": "Identity.apk",
            "minSdkVersion": "19",
            "kit_lib": "armeabi-v7a,arm64-v8a",
            "dependencies": "huawei_module_networkkit,-1:weak;huawei_module_quic,-1:weak;fwcom-grs,2;fwcom-util,10;fwui,7;hmscore,14;huawei_module_dynamicloader,10;kpms,14;runtime,25;hwid,16;kams,13;huawei_module_quic_pro,-1:weak",
            "main_entry": "com.huawei.hms.identity.MainEntry"
        },
        {
            "version_code": "10109304",
            "kit_type": "app",
            "kit_name": "hbm",
            "api_level": "110",
            "pkg_name": "com.huawei.hms.hbm",
            "apk_name": "hbm.apk",
            "minSdkVersion": "26",
            "dependencies": "fwcom-grs,1;fwcom-util,6;fwui,7;hmscore,12;kpms,11;runtime,22;kams,11;apptouch,3",
            "main_entry": "com.huawei.hms.hbm.entry.MainEntry"
        },
        {
            "version_code": "10600300",
            "kit_type": "sdk",
            "kit_name": "huawei_module_audiokit",
            "api_level": "11",
            "pkg_name": "com.huawei.hms.audiokit",
            "apk_name": "Audio.apk",
            "minSdkVersion": "19",
            "kit_loader": "huawei_module_audiokit:huawei_module_dynamicloader",
            "kit_lib": "armeabi,arm64-v8a",
            "dependencies": "huawei_module_dynamicloader,5",
            "main_entry": ""
        },
        {
            "version_code": "10003309",
            "kit_type": "sdk",
            "kit_name": "huawei_module_imagerender",
            "api_level": "3",
            "pkg_name": "com.huawei.hms.image.render",
            "apk_name": "Image-render.apk",
            "minSdkVersion": "19",
            "dependencies": "fwcom-grs,1;fwcom-util,1;fwui,1;huawei_module_dynamicloader,8;hmscore,6;kpms,3;runtime,9;kams,3;apptouch,1",
            "main_entry": ""
        },
        {
            "version_code": "50002310",
            "kit_type": "app;sdk",
            "kit_name": "panorama;huawei_module_panorama",
            "api_level": "8;8",
            "pkg_name": "com.huawei.hms.panorama",
            "apk_name": "Panorama.apk",
            "minSdkVersion": "19",
            "dependencies": "fwcom-grs,1;fwcom-util,10;fwui,7;huawei_module_dynamicloader,8;hmscore,14;kpms,14;runtime,25;kams,13",
            "main_entry": "com.huawei.hms.panorama.MainEntry;"
        },
        {
            "version_code": "10015304",
            "kit_type": "app;sdk",
            "kit_name": "videokit;huawei_module_videoplayer",
            "api_level": "1;14",
            "pkg_name": "com.huawei.hms.videokit.player",
            "apk_name": "videoplayer.apk",
            "minSdkVersion": "21",
            "kit_loader": "huawei_module_videoplayer:huawei_module_dynamicloader",
            "kit_lib": "armeabi-v7a,arm64-v8a",
            "main_entry": ";"
        },
        {
            "version_code": "61100300",
            "kit_type": "app",
            "kit_name": "wireless",
            "api_level": "3",
            "pkg_name": "com.huawei.hms.wireless",
            "apk_name": "Wireless.apk",
            "minSdkVersion": "24",
            "dependencies": "hmscore,1;hwid,16",
            "main_entry": "com.huawei.hms.wireless.MainEntry"
        },
        {
            "version_code": "60800300",
            "kit_type": "sdk",
            "kit_name": "huawei_module_scene",
            "api_level": "7",
            "pkg_name": "com.huawei.hms.scene",
            "apk_name": "SceneKit.apk",
            "minSdkVersion": "19",
            "kit_lib": "armeabi-v7a,arm64-v8a",
            "dependencies": "huawei_module_dynamicloader,9;hmscore,1;huawei_module_mlkit_face,6",
            "main_entry": ""
        },
        {
            "version_code": "60900325",
            "kit_type": "app",
            "kit_name": "keyring",
            "api_level": "691",
            "pkg_name": "com.huawei.hms.keyring",
            "apk_name": "keyring.apk",
            "minSdkVersion": "24",
            "dependencies": "huawei_module_networkkit,-1:weak;fwcom-util,13;fwcom-grs,2;fwui,7;hmscore,17;huawei_module_dynamicloader,-1:weak;safetydetect,60100005;kpms,14;runtime,25;hwid,16;kams,13",
            "main_entry": "com.huawei.hms.keyring.MainEntry"
        },
        {
            "version_code": "10003308",
            "kit_type": "sdk",
            "kit_name": "huawei_module_imagevision",
            "api_level": "10003301",
            "pkg_name": "com.huawei.hms.image.visionkit",
            "apk_name": "Image-vision.apk",
            "minSdkVersion": "26",
            "dependencies": "huawei_module_dynamicloader,8",
            "main_entry": ""
        },
        {
            "version_code": "61200320",
            "kit_type": "app",
            "kit_name": "findnetwork",
            "api_level": "29",
            "pkg_name": "com.huawei.hms.findnetwork",
            "apk_name": "FindNetwork.apk",
            "minSdkVersion": "23",
            "kit_lib": "armeabi-v7a,arm64-v8a",
            "dependencies": "fwcom-util,13;hmscore,10;runtime,26;hwid,16;nearby,140;keyring,670;measurement,1",
            "main_entry": "com.huawei.hms.findnetwork.MainEntry"
        },
        {
            "version_code": "30700302",
            "kit_type": "sdk",
            "kit_name": "huawei_module_mlkit_label",
            "api_level": "3",
            "pkg_name": "com.huawei.hms.mlkit.label",
            "apk_name": "ML-label.apk",
            "minSdkVersion": "19",
            "kit_lib": "armeabi-v7a,arm64-v8a",
            "dependencies": "huawei_module_dynamicloader,8;hmscore,1",
            "main_entry": ""
        },
        {
            "version_code": "50000300",
            "kit_type": "sdk",
            "kit_name": "huawei_module_quic",
            "api_level": "1",
            "pkg_name": "com.huawei.hms.hquic",
            "apk_name": "hquic.apk",
            "minSdkVersion": "19",
            "kit_lib": "arm64-v8a",
            "main_entry": ""
        },
        {
            "version_code": "130801301",
            "kit_type": "app",
            "kit_name": "hem",
            "api_level": "1",
            "pkg_name": "com.huawei.hms.hem",
            "apk_name": "hemkit.apk",
            "minSdkVersion": "19",
            "dependencies": "qoes,1:weak",
            "main_entry": "com.huawei.hms.hem.MainEntry"
        },
        {
            "version_code": "30700303",
            "kit_type": "sdk",
            "kit_name": "huawei_module_mlkit_scenedetection",
            "api_level": "4",
            "pkg_name": "com.huawei.hms.mlkit.scd",
            "apk_name": "ML-scenedetection.apk",
            "minSdkVersion": "19",
            "kit_lib": "armeabi-v7a,arm64-v8a",
            "dependencies": "huawei_module_dynamicloader,8;hmscore,1",
            "main_entry": ""
        },
        {
            "version_code": "101000303",
            "kit_type": "app",
            "kit_name": "qoes",
            "api_level": "1",
            "pkg_name": "com.huawei.hms.qoes",
            "apk_name": "QoES.apk",
            "minSdkVersion": "19",
            "dependencies": "fwcom-grs,2;fwcom-util,10;fwui,7;hmscore,14;kpms,14;runtime,25;kams,13",
            "main_entry": "com.huawei.hms.qoes.MainEntry"
        },
        {
            "version_code": "60400307",
            "kit_type": "app",
            "kit_name": "consent",
            "api_level": "110",
            "pkg_name": "com.huawei.hms.consent",
            "apk_name": "Consent.apk",
            "minSdkVersion": "19",
            "dependencies": "fwcom-util,13;fwcom-grs,2;tss,-1:weak;fwui,7;hmscore,10;runtime,26;safetydetect,1;kpms,14;measurement,1;kams,13",
            "main_entry": "com.huawei.hms.consent.MainEntry"
        },
        {
            "version_code": "61300300",
            "kit_type": "app",
            "kit_name": "PaymentService",
            "api_level": "2",
            "pkg_name": "com.huawei.hms.paymentservice",
            "apk_name": "PaymentService.apk",
            "minSdkVersion": "19",
            "kit_lib": "x86_64,x86,armeabi-v7a,armeabi,arm64-v8a",
            "dependencies": "huawei_module_quic,-1:weak;fwcom-grs,2;fwcom-util,10;fwui,7;hmscore,17;huawei_module_dynamicloader,10;kpms,14;runtime,25;hwid,16;measurement,4;kams,13;huawei_module_quic_pro,-1:weak",
            "main_entry": "com.huawei.hms.aggr.entry.MainEntry"
        },
        {
            "version_code": "30600301",
            "kit_type": "sdk",
            "kit_name": "huawei_module_mlkit_faceverify",
            "api_level": "3",
            "pkg_name": "com.huawei.hms.mlkit.faceverify",
            "apk_name": "ML-faceverify.apk",
            "minSdkVersion": "19",
            "kit_lib": "armeabi-v7a,arm64-v8a",
            "dependencies": "huawei_module_dynamicloader,8;hmscore,1",
            "main_entry": ""
        },
        {
            "version_code": "10002302",
            "kit_type": "app",
            "kit_name": "airtouch",
            "api_level": "1",
            "pkg_name": "com.huawei.hms.airtouch",
            "apk_name": "AirTouch.apk",
            "minSdkVersion": "19",
            "kit_lib": "armeabi-v7a,arm64-v8a",
            "dependencies": "hmscore,1;qoes,1",
            "main_entry": "com.huawei.hms.airtouch.MainEntry"
        },
        {
            "version_code": "61201300",
            "kit_type": "app",
            "kit_name": "nearby",
            "api_level": "141",
            "pkg_name": "com.huawei.hms.nearby",
            "apk_name": "Nearby.apk",
            "minSdkVersion": "21",
            "kit_lib": "armeabi-v7a,arm64-v8a",
            "dependencies": "fwcom-util,13;fwcom-grs,1;fwui,7;hmscore,10;runtime,23;kpms,12;measurement,1;kams,11;apptouch,3",
            "main_entry": "com.huawei.hms.nearby.MainEntry"
        },
        {
            "version_code": "30700301",
            "kit_type": "sdk",
            "kit_name": "huawei_module_mlkit_imagesuperresolution",
            "api_level": "4",
            "pkg_name": "com.huawei.hms.mlkit.imagesuperresolution",
            "apk_name": "ML-isr.apk",
            "minSdkVersion": "19",
            "kit_lib": "armeabi-v7a,arm64-v8a",
            "dependencies": "huawei_module_dynamicloader,8;hmscore,1",
            "main_entry": ""
        },
        {
            "version_code": "50001310",
            "kit_type": "app",
            "kit_name": "realname",
            "api_level": "1",
            "pkg_name": "com.huawei.hms.realname",
            "apk_name": "RealName-base.apk",
            "minSdkVersion": "19",
            "kit_lib": "armeabi-v7a,arm64-v8a",
            "dependencies": "huawei_module_quic,-1:weak;kitstore,6;fwcom-util,9;hmscore,1;huawei_module_dynamicloader,10;qoes,1;huawei_module_quic_pro,-1:weak",
            "main_entry": "com.huawei.hms.realname.MainEntry"
        },
        {
            "version_code": "30700301",
            "kit_type": "sdk",
            "kit_name": "huawei_module_mlkit_translate",
            "api_level": "3",
            "pkg_name": "com.huawei.hms.mlkit.translate",
            "apk_name": "ML-Translate.apk",
            "minSdkVersion": "19",
            "kit_lib": "armeabi-v7a,arm64-v8a",
            "dependencies": "huawei_module_dynamicloader,8;hmscore,1",
            "main_entry": ""
        },
        {
            "version_code": "61102301",
            "kit_type": "app;loader;sdk",
            "kit_name": "huawei_route_maps;huawei_module_maps;huawei_module_huaweimaps",
            "api_level": "24;24;24",
            "pkg_name": "com.huawei.hms.maps.provider.huawei",
            "apk_name": "Map-HuaweiProvider.apk",
            "minSdkVersion": "19",
            "kit_lib": "armeabi-v7a,arm64-v8a",
            "dependencies": "huawei_module_quic,-1:weak;fwcom-grs,1;fwcom-util,1;fwui,1;huawei_module_dynamicloader,11;hmscore,9;kpms,11;runtime,20;location,1;kams,11;huawei_module_quic_pro,-1:weak;apptouch,3",
            "main_entry": "com.huawei.hms.maps.maproute.hmsclient.MainEntry;;",
            "pre_pkg_name": "com.huawei.hms.maps.maproute"
        }
    ]
}