10
 9,  0,  0.6126687,  0.7441537,  0.7215537,   2.159661, 0, 0, 0,  0.76, 1, 1, 1, 0, 0, 0, 0, 0,
 8,  0,  0.5927578,  0.6949118,  0.7374273,  2.1393405, 0, 0, 0,  0.75, 1, 1, 1, 0, 0, 0, 0, 0,
 7,  0,  0.5623712,  0.6507924,  0.7047022,  2.4826239, 0, 0, 0,  0.73, 1, 1, 1, 0, 0, 0, 0, 0,
 6,  0,  0.6535611,  0.9274498,  0.9498804,  2.4590135, 0, 0, 0,  0.69, 1, 1, 1, 0, 0, 0, 0, 0,
 5,  0,  0.6961181,  1.0191602,  1.1732755,  2.4747329, 0, 0, 0,  0.76, 1, 1, 1, 0, 0, 0, 0, 0,
 4,  0,  0.6709068,  1.0200317,  1.2210374,  3.1023623, 0, 0, 0,  0.64, 1, 1, 1, 0, 0, 0, 0, 0,
 3,  0,  0.4141917,  1.3417667,     1.2833,  4.3133545, 0, 0, 0,  0.42, 1, 1, 1, 0, 0, 0, 0, 0,
 2,  0,  0.4777836,  1.5060983,  1.5132768,  4.0404287, 0, 0, 0,  0.58, 1, 1, 1, 0, 0, 0, 0, 0,
 1,  0,  0.6581698,  1.8796044,   1.857172,  5.0232023, 0, 0, 0,  0.57, 1, 1, 1, 0, 0, 0, 0, 0,
 0,  0,  0.8815347,  2.4433452,  2.6901829,  6.3129455, 0, 0, 0,  0.37, 1, 1, 1, 0, 0, 0, 0, 0,
