[
  {
    "type": "0",
    "description": "全部",
    "captureModels": [
      {
        "name": "com.huawei.camera2.mode.food.FoodMode",
        "resPackageName":"com.huawei.camera2.mode.food",
        "style":"dm",
        "title": "美食",
        "fileSize": "1285",
        "price":"",
        "developer":"荣耀终端有限公司",
        "iconId": "file:///system/cameraplugins/mode/food/food_dm.png",
        "pictureIdList": [
          "file:///system/cameraplugins/mode/food/CN_pic_1_dm.png",
          "file:///system/cameraplugins/mode/food/CN_pic_2_dm.png",
          "file:///system/cameraplugins/mode/food/pic_1_dm.png",
          "file:///system/cameraplugins/mode/food/pic_2_dm.png"
        ],
        "brief": "享受美食带来的视觉盛宴",
        "detail": "美食模式能让食物照片颜色更鲜艳，看起来更诱人",
        "pluginFileId": "/system/cameraplugins/apk/foodmode.apk",
        "pluginResId":"",
        "version": "1469535654821",
        "pluginFileName": "foodmode.apk",
        "pluginResName":"",
        "pluginApiVersion": "[1.0,2]",
        "osgiVersion": "[1.0,2]",
        "supportDeviceModels": "VIE,EVA,NEXT,KNT,MHD"
      },
      {
        "name": "com.huawei.camera2.mode.food.FoodMode",
        "resPackageName":"com.huawei.camera2.mode.food",
        "style":"general",
        "title": "美食",
        "fileSize": "1285",
        "price":"",
        "developer":"荣耀终端有限公司",
        "iconId": "file:///system/cameraplugins/mode/food/food.png",
        "pictureIdList": [
          "file:///system/cameraplugins/mode/food/CN_pic_1.png",
          "file:///system/cameraplugins/mode/food/CN_pic_2.png",
          "file:///system/cameraplugins/mode/food/pic_1.png",
          "file:///system/cameraplugins/mode/food/pic_2.png"
        ],
        "brief": "享受美食带来的视觉盛宴",
        "detail": "美食模式能让食物照片颜色更鲜艳，看起来更诱人",
        "pluginFileId": "/system/cameraplugins/apk/foodmode.apk",
        "pluginResId":"",
        "version": "1469535654821",
        "pluginFileName": "foodmode.apk",
        "pluginResName":"",
        "pluginApiVersion": "[1.0,2]",
        "osgiVersion": "[1.0,2]",
        "supportDeviceModels": "VIE,EVA,NEXT,KNT,MHD"
      },
      {
        "name": "com.huawei.camera2.mode.food.FoodMode",
        "resPackageName":"com.huawei.camera2.mode.food",
        "style":"dark",
        "title": "美食",
        "fileSize": "1285",
        "price":"",
        "developer":"荣耀终端有限公司",
        "iconId": "file:///system/cameraplugins/mode/food/food_dark.png",
        "pictureIdList": [
          "file:///system/cameraplugins/mode/food/CN_pic_1.png",
          "file:///system/cameraplugins/mode/food/CN_pic_2.png",
          "file:///system/cameraplugins/mode/food/pic_1.png",
          "file:///system/cameraplugins/mode/food/pic_2.png"
        ],
        "brief": "享受美食带来的视觉盛宴",
        "detail": "美食模式能让食物照片颜色更鲜艳，看起来更诱人",
        "pluginFileId": "/system/cameraplugins/apk/foodmode.apk",
        "pluginResId":"",
        "version": "1469535654821",
        "pluginFileName": "foodmode.apk",
        "pluginResName":"",
        "pluginApiVersion": "[1.0,2]",
        "osgiVersion": "[1.0,2]",
        "supportDeviceModels": "VIE,EVA,NEXT,KNT,MHD"
      },
      {
        "name": "com.huawei.camera2.mode.watermark.WaterMarkMode",
        "resPackageName":"com.huawei.camera2.mode.watermark",
        "style":"dm",
        "title": "水印",
        "fileSize": "1024",
        "price":"",
        "developer":"荣耀终端有限公司",
        "iconId": "file:///system/cameraplugins/mode/watermark/watermark_dm.png",
        "pictureIdList": [
          "file:///system/cameraplugins/mode/watermark/CN_pic_1_dm.png",
          "file:///system/cameraplugins/mode/watermark/CN_pic_2_dm.png",
          "file:///system/cameraplugins/mode/watermark/pic_1_dm.png",
          "file:///system/cameraplugins/mode/watermark/pic_2_dm.png"
        ],
        "brief": "水印模式",
        "detail": "水印介绍",
        "pluginFileId": "",
        "pluginResId":"",
        "version": "1469535654821",
        "pluginFileName": "watermarkmode.apk",
        "pluginResName":"",
        "pluginApiVersion": "[1.0,2]",
        "osgiVersion": "[1.0,2]",
        "supportDeviceModels": "VIE,EVA,NEXT,MHD"
      },
      {
        "name": "com.huawei.camera2.mode.watermark.WaterMarkMode",
        "resPackageName":"com.huawei.camera2.mode.watermark",
        "style":"general",
        "title": "水印",
        "fileSize": "1024",
        "price":"",
        "developer":"荣耀终端有限公司",
        "iconId": "file:///system/cameraplugins/mode/watermark/watermark.png",
        "pictureIdList": [
          "file:///system/cameraplugins/mode/watermark/CN_pic_1.png",
          "file:///system/cameraplugins/mode/watermark/CN_pic_2.png",
          "file:///system/cameraplugins/mode/watermark/pic_1.png",
          "file:///system/cameraplugins/mode/watermark/pic_2.png"
        ],
        "brief": "水印模式",
        "detail": "水印介绍",
        "pluginFileId": "",
        "pluginResId":"",
        "version": "1469535654821",
        "pluginFileName": "watermarkmode.apk",
        "pluginResName":"",
        "pluginApiVersion": "[1.0,2]",
        "osgiVersion": "[1.0,2]",
        "supportDeviceModels": "VIE,EVA,NEXT,MHD"
      },
      {
        "name": "com.huawei.camera2.mode.watermark.WaterMarkMode",
        "resPackageName":"com.huawei.camera2.mode.watermark",
        "style":"dark",
        "title": "水印",
        "fileSize": "1024",
        "price":"",
        "developer":"荣耀终端有限公司",
        "iconId": "file:///system/cameraplugins/mode/watermark/watermark_dark.png",
        "pictureIdList": [
          "file:///system/cameraplugins/mode/watermark/CN_pic_1.png",
          "file:///system/cameraplugins/mode/watermark/CN_pic_2.png",
          "file:///system/cameraplugins/mode/watermark/pic_1.png",
          "file:///system/cameraplugins/mode/watermark/pic_2.png"
        ],
        "brief": "水印模式",
        "detail": "水印介绍",
        "pluginFileId": "",
        "pluginResId":"",
        "version": "1469535654821",
        "pluginFileName": "watermarkmode.apk",
        "pluginResName":"",
        "pluginApiVersion": "[1.0,2]",
        "osgiVersion": "[1.0,2]",
        "supportDeviceModels": "VIE,EVA,NEXT,MHD"
      },
      {
        "name": "com.huawei.camera2.mode.voicephoto.VoicePhotoMode",
        "resPackageName":"com.huawei.camera2.mode.voicephoto",
        "style":"dm",
        "title": "有声照片",
        "fileSize": "1024",
        "price":"",
        "developer":"荣耀终端有限公司",
        "iconId": "file:///system/cameraplugins/mode/voicephoto/voicephoto_dm.png",
        "pictureIdList": [
          "file:///system/cameraplugins/mode/voicephoto/CN_pic_1_dm.png",
          "file:///system/cameraplugins/mode/voicephoto/CN_pic_2_dm.png",
          "file:///system/cameraplugins/mode/voicephoto/pic_1_dm.png",
          "file:///system/cameraplugins/mode/voicephoto/pic_2_dm.png"
        ],
        "brief": "有声照片",
        "detail": "有声照片介绍",
        "pluginFileId": "",
        "pluginResId":"",
        "version": "1",
        "pluginFileName": "voicephotomode.apk",
        "pluginResName":"",
        "pluginApiVersion": "[1.0,2]",
        "osgiVersion": "[1.0,2]",
        "supportDeviceModels": "VIE,EVA,NEXT,MHD"
      },
      {
        "name": "com.huawei.camera2.mode.voicephoto.VoicePhotoMode",
        "resPackageName":"com.huawei.camera2.mode.voicephoto",
        "style":"general",
        "title": "有声照片",
        "fileSize": "1024",
        "price":"",
        "developer":"荣耀终端有限公司",
        "iconId": "file:///system/cameraplugins/mode/voicephoto/voicephoto.png",
        "pictureIdList": [
          "file:///system/cameraplugins/mode/voicephoto/CN_pic_1.png",
          "file:///system/cameraplugins/mode/voicephoto/CN_pic_2.png",
          "file:///system/cameraplugins/mode/voicephoto/pic_1.png",
          "file:///system/cameraplugins/mode/voicephoto/pic_2.png"
        ],
        "brief": "有声照片",
        "detail": "有声照片介绍",
        "pluginFileId": "",
        "pluginResId":"",
        "version": "1",
        "pluginFileName": "voicephotomode.apk",
        "pluginResName":"",
        "pluginApiVersion": "[1.0,2]",
        "osgiVersion": "[1.0,2]",
        "supportDeviceModels": "VIE,EVA,NEXT,MHD"
      },
      {
        "name": "com.huawei.camera2.mode.voicephoto.VoicePhotoMode",
        "resPackageName":"com.huawei.camera2.mode.voicephoto",
        "style":"dark",
        "title": "有声照片",
        "fileSize": "1024",
        "price":"",
        "developer":"荣耀终端有限公司",
        "iconId": "file:///system/cameraplugins/mode/voicephoto/voicephoto_dark.png",
        "pictureIdList": [
          "file:///system/cameraplugins/mode/voicephoto/CN_pic_1.png",
          "file:///system/cameraplugins/mode/voicephoto/CN_pic_2.png",
          "file:///system/cameraplugins/mode/voicephoto/pic_1.png",
          "file:///system/cameraplugins/mode/voicephoto/pic_2.png"
        ],
        "brief": "有声照片",
        "detail": "有声照片介绍",
        "pluginFileId": "",
        "pluginResId":"",
        "version": "1",
        "pluginFileName": "voicephotomode.apk",
        "pluginResName":"",
        "pluginApiVersion": "[1.0,2]",
        "osgiVersion": "[1.0,2]",
        "supportDeviceModels": "VIE,EVA,NEXT,MHD"
      },
      {
        "name": "com.huawei.camera2.mode.documentrecognition.DocumentRecognitionMode",
        "resPackageName":"com.huawei.camera2.mode.documentrecognition",
        "style":"dm",
        "title": "文档校正",
        "fileSize": "1024",
        "price":"",
        "developer":"荣耀终端有限公司",
        "iconId": "file:///system/cameraplugins/mode/documentrecognition/documentrecognition_dm.png",
        "pictureIdList": [
          "file:///system/cameraplugins/mode/documentrecognition/CN_pic_1_dm.png",
          "file:///system/cameraplugins/mode/documentrecognition/CN_pic_2_dm.png",
          "file:///system/cameraplugins/mode/documentrecognition/pic_1_dm.png",
          "file:///system/cameraplugins/mode/documentrecognition/pic_2_dm.png"
        ],
        "brief": "文档校正",
        "detail": "文档校正介绍",
        "pluginFileId": "",
        "pluginResId":"",
        "version": "1469535654821",
        "pluginFileName": "documentrecognition.apk",
        "pluginResName":"",
        "pluginApiVersion": "[1.0,2]",
        "osgiVersion": "[1.0,2]",
        "supportDeviceModels": "VIE,EVA,NEXT,MHD"
      },
      {
        "name": "com.huawei.camera2.mode.documentrecognition.DocumentRecognitionMode",
        "resPackageName":"com.huawei.camera2.mode.documentrecognition",
        "style":"general",
        "title": "文档校正",
        "fileSize": "1024",
        "price":"",
        "developer":"荣耀终端有限公司",
        "iconId": "file:///system/cameraplugins/mode/documentrecognition/documentrecognition.png",
        "pictureIdList": [
          "file:///system/cameraplugins/mode/documentrecognition/CN_pic_1.png",
          "file:///system/cameraplugins/mode/documentrecognition/CN_pic_2.png",
          "file:///system/cameraplugins/mode/documentrecognition/pic_1.png",
          "file:///system/cameraplugins/mode/documentrecognition/pic_2.png"
        ],
        "brief": "文档校正",
        "detail": "文档校正介绍",
        "pluginFileId": "",
        "pluginResId":"",
        "version": "1469535654821",
        "pluginFileName": "documentrecognition.apk",
        "pluginResName":"",
        "pluginApiVersion": "[1.0,2]",
        "osgiVersion": "[1.0,2]",
        "supportDeviceModels": "VIE,EVA,NEXT,MHD"
      },
      {
        "name": "com.huawei.camera2.mode.documentrecognition.DocumentRecognitionMode",
        "resPackageName":"com.huawei.camera2.mode.documentrecognition",
        "style":"dark",
        "title": "文档校正",
        "fileSize": "1024",
        "price":"",
        "developer":"荣耀终端有限公司",
        "iconId": "file:///system/cameraplugins/mode/documentrecognition/documentrecognition_dark.png",
        "pictureIdList": [
          "file:///system/cameraplugins/mode/documentrecognition/CN_pic_1.png",
          "file:///system/cameraplugins/mode/documentrecognition/CN_pic_2.png",
          "file:///system/cameraplugins/mode/documentrecognition/pic_1.png",
          "file:///system/cameraplugins/mode/documentrecognition/pic_2.png"
        ],
        "brief": "文档校正",
        "detail": "文档校正介绍",
        "pluginFileId": "",
        "pluginResId":"",
        "version": "1469535654821",
        "pluginFileName": "documentrecognition.apk",
        "pluginResName":"",
        "pluginApiVersion": "[1.0,2]",
        "osgiVersion": "[1.0,2]",
        "supportDeviceModels": "VIE,EVA,NEXT,MHD"
      },
      {
        "name": "com.huawei.camera2.mode.makeup.MakeUpMode",
        "resPackageName":"com.huawei.camera2.mode.makeup",
        "style":"dm",
        "title": "美妆",
        "fileSize": "1024",
        "price":"",
        "developer":"荣耀终端有限公司",
        "iconId": "file:///system/cameraplugins/mode/makeup/makeup_dm.png",
        "pictureIdList": [
          "file:///system/cameraplugins/mode/makeup/CN_pic_1_dm.png",
          "file:///system/cameraplugins/mode/makeup/CN_pic_2_dm.png",
          "file:///system/cameraplugins/mode/makeup/pic_1_dm.png",
          "file:///system/cameraplugins/mode/makeup/pic_2_dm.png"
        ],
        "brief": "美妆",
        "detail": "美妆介绍",
        "pluginFileId": "",
        "pluginResId":"",
        "version": "1469535654821",
        "pluginFileName": "makeupmode.apk",
        "pluginResName":"",
        "pluginApiVersion": "[1.0,2]",
        "osgiVersion": "[1.0,2]",
        "supportDeviceModels": "BLN"
      },
      {
        "name": "com.huawei.camera2.mode.makeup.MakeUpMode",
        "resPackageName":"com.huawei.camera2.mode.makeup",
        "style":"general",
        "title": "美妆",
        "fileSize": "1024",
        "price":"",
        "developer":"荣耀终端有限公司",
        "iconId": "file:///system/cameraplugins/mode/makeup/makeup.png",
        "pictureIdList": [
          "file:///system/cameraplugins/mode/makeup/CN_pic_1.png",
          "file:///system/cameraplugins/mode/makeup/CN_pic_2.png",
          "file:///system/cameraplugins/mode/makeup/pic_1.png",
          "file:///system/cameraplugins/mode/makeup/pic_2.png"
        ],
        "brief": "美妆",
        "detail": "美妆介绍",
        "pluginFileId": "",
        "pluginResId":"",
        "version": "1469535654821",
        "pluginFileName": "makupmode.apk",
        "pluginResName":"",
        "pluginApiVersion": "[1.0,2]",
        "osgiVersion": "[1.0,2]",
        "supportDeviceModels": "BLN"
      },
      {
        "name": "com.huawei.camera2.mode.makeup.MakeUpMode",
        "resPackageName":"com.huawei.camera2.mode.makeup",
        "style":"dark",
        "title": "美妆",
        "fileSize": "1024",
        "price":"",
        "developer":"荣耀终端有限公司",
        "iconId": "file:///system/cameraplugins/mode/makeup/makeup_dark.png",
        "pictureIdList": [
          "file:///system/cameraplugins/mode/makeup/CN_pic_1.png",
          "file:///system/cameraplugins/mode/makeup/CN_pic_2.png",
          "file:///system/cameraplugins/mode/makeup/pic_1.png",
          "file:///system/cameraplugins/mode/makeup/pic_2.png"
        ],
        "brief": "美妆",
        "detail": "美妆介绍",
        "pluginFileId": "",
        "pluginResId":"",
        "version": "1469535654821",
        "pluginFileName": "makupmode.apk",
        "pluginResName":"",
        "pluginApiVersion": "[1.0,2]",
        "osgiVersion": "[1.0,2]",
        "supportDeviceModels": "BLN"
      }
    ]
  }
]