{
	"include_cols": [
		"rtt",
		"dlinkPktNum",
		"dlinkPktLen",
		"uplinkPktNum",
		"uplinkPktLen",
		"dlinkRetransRate",
		"uplinkRetransRate",
		"sockNum",
		"synNum",
		"wifiTxLinkSpeed",
		"wifiRxLinkSpeed",
		"wifiRssi",
		"wifiUpLinkPkgLossRate"
	],
	"base_cols": [
		"wifiTxLinkSpeed"
	],
	"window_cols": [
		[
			"dlinkPktNum",
			10,
			"mean"
		],
		[
			"sockNum",
			10,
			"mean"
		],
		[
			"dlinkPktLen",
			20,
			"mean"
		],
		[
			"uplinkPktLen",
			20,
			"mean"
		],
		[
			"dlinkPktLen",
			30,
			"mean"
		],
		[
			"rtt",
			50,
			"mean"
		],
		[
			"uplinkRetransRate",
			50,
			"mean"
		],
		[
			"sockNum",
			50,
			"mean"
		],
		[
			"wifiUpLinkPkgLossRate",
			50,
			"mean"
		],
		[
			"rtt",
			90,
			"mean"
		],
		[
			"dlinkPktNum",
			90,
			"mean"
		],
		[
			"dlinkPktLen",
			90,
			"mean"
		],
		[
			"dlinkRetransRate",
			90,
			"mean"
		],
		[
			"sockNum",
			90,
			"mean"
		],
		[
			"dlinkRetransRate",
			40,
			"mad"
		],
		[
			"synNum",
			40,
			"mad"
		],
		[
			"rtt",
			80,
			"mad"
		],
		[
			"dlinkPktNum",
			80,
			"mad"
		],
		[
			"dlinkPktNum",
			90,
			"mad"
		],
		[
			"dlinkPktLen",
			90,
			"mad"
		],
		[
			"dlinkRetransRate",
			90,
			"mad"
		],
		[
			"uplinkRetransRate",
			90,
			"mad"
		],
		[
			"sockNum",
			90,
			"mad"
		],
		[
			"dlinkPktNum",
			15,
			"max"
		],
		[
			"dlinkPktLen",
			15,
			"max"
		],
		[
			"wifiRxLinkSpeed",
			15,
			"max"
		],
		[
			"rtt",
			25,
			"max"
		],
		[
			"dlinkPktLen",
			25,
			"max"
		],
		[
			"wifiRssi",
			25,
			"max"
		],
		[
			"dlinkPktNum",
			40,
			"max"
		],
		[
			"dlinkPktLen",
			40,
			"max"
		],
		[
			"rtt",
			50,
			"max"
		],
		[
			"uplinkPktNum",
			50,
			"max"
		],
		[
			"dlinkPktLen",
			60,
			"max"
		],
		[
			"uplinkPktLen",
			60,
			"max"
		],
		[
			"dlinkRetransRate",
			60,
			"max"
		],
		[
			"rtt",
			20,
			"std"
		],
		[
			"dlinkRetransRate",
			30,
			"std"
		],
		[
			"synNum",
			30,
			"std"
		],
		[
			"wifiUpLinkPkgLossRate",
			30,
			"std"
		],
		[
			"uplinkPktLen",
			80,
			"std"
		],
		[
			"dlinkRetransRate",
			80,
			"std"
		],
		[
			"dlinkPktLen",
			90,
			"std"
		],
		[
			"sockNum",
			90,
			"std"
		],
		[
			"synNum",
			90,
			"std"
		],
		[
			"uplinkRetransRate",
			10,
			"var"
		],
		[
			"uplinkRetransRate",
			20,
			"var"
		]
	],
	"ewm_cols": [
		[
			"dlinkPktLen",
			0.1,
			"mean"
		],
		[
			"synNum",
			0.1,
			"mean"
		]
	]
}