#,version,,,,,,,,,,,,,,,,,,,,,,,,,,,,,,,,,,,
2021,5,26,1,,,,,,,,,,,,,,,,,,,,,,,,,,,,,,,,,
#,row_col_num,,,,,,,,,,,,,,,,,,,,,,,,,,,,,,,,,,,
37,17,,,,,,,,,,,,,,,,,,,,,,,,,,,,,,,,,,,
#,freq_noise,,,,,,,,,,,,,,,,,,,,,,,,,,,,,,,,,,,
-500,500,,,,,,,,,,,,,,,,,,,,,,,,,,,,,,,,,,,
#,raw_max,,,,,,,,,,,,,,,,,,,,,,,,,,,,,,,,,,,
10142,10228,9968,9915,10174,10153,10142,9979,10144,10244,10059,10237,10159,10126,10167,10129,9931,,,,,,,,,,,,,,,,,,,,
9933,9804,9561,9674,9862,9984,9985,9874,9913,10053,9909,9931,9967,9892,9938,9874,10022,,,,,,,,,,,,,,,,,,,,
9765,9784,9811,9812,9795,9789,9782,9799,9795,9782,9792,9784,9784,9789,9784,9783,9802,,,,,,,,,,,,,,,,,,,,
9790,9798,9819,9822,9802,9807,9801,9819,9817,9804,9812,9805,9806,9810,9805,9805,9825,,,,,,,,,,,,,,,,,,,,
9823,9829,9848,9852,9834,9840,9832,9850,9848,9835,9843,9836,9836,9840,9835,9835,9854,,,,,,,,,,,,,,,,,,,,
9840,9846,9864,9868,9850,9855,9849,9867,9864,9852,9860,9853,9853,9856,9852,9850,9867,,,,,,,,,,,,,,,,,,,,
9858,9861,9879,9883,9866,9872,9865,9882,9880,9868,9876,9868,9868,9871,9866,9865,9879,,,,,,,,,,,,,,,,,,,,
9874,9878,9896,9901,9883,9888,9883,9900,9896,9884,9892,9885,9885,9886,9882,9879,9894,,,,,,,,,,,,,,,,,,,,
9894,9897,9914,9919,9903,9907,9901,9916,9914,9903,9912,9903,9903,9904,9900,9897,9909,,,,,,,,,,,,,,,,,,,,
9909,9912,9928,9932,9914,9920,9914,9930,9926,9915,9922,9915,9915,9918,9912,9910,9921,,,,,,,,,,,,,,,,,,,,
9926,9928,9945,9948,9930,9934,9928,9943,9940,9930,9937,9930,9930,9932,9928,9926,9936,,,,,,,,,,,,,,,,,,,,
9921,9924,9940,9943,9925,9931,9924,9938,9934,9925,9932,9925,9925,9927,9924,9922,9931,,,,,,,,,,,,,,,,,,,,
9931,9975,9973,9949,9930,9936,9932,9962,9940,9930,9937,9930,9931,9933,9931,9928,9937,,,,,,,,,,,,,,,,,,,,
9942,9962,9961,9961,9943,9946,9942,9956,9951,9940,9949,9942,9944,9945,9943,9942,9948,,,,,,,,,,,,,,,,,,,,
9950,9952,9970,9969,9951,9956,9950,9964,9960,9950,9958,9950,9952,9954,9951,9950,9955,,,,,,,,,,,,,,,,,,,,
9949,9952,9966,9968,9949,9954,9949,9961,9956,9946,9956,9948,9949,9950,9949,9948,9952,,,,,,,,,,,,,,,,,,,,
9963,9966,9979,9981,9962,9967,9961,9973,9968,9958,9967,9960,9961,9962,9961,9961,9964,,,,,,,,,,,,,,,,,,,,
9967,9968,9979,9980,9961,9966,9958,9970,9967,9957,9966,9957,9960,9961,9960,9960,9962,,,,,,,,,,,,,,,,,,,,
9975,9969,9980,9982,9962,9966,9958,9970,9966,9956,9964,9957,9960,9961,9961,9960,9961,,,,,,,,,,,,,,,,,,,,
9964,9967,9979,9981,9961,9966,9958,9968,9964,9956,9966,9957,9960,9961,9961,9960,9956,,,,,,,,,,,,,,,,,,,,
9967,9969,9980,9981,9961,9967,9960,9970,9966,9957,9967,9957,9961,9962,9962,9961,9960,,,,,,,,,,,,,,,,,,,,
9960,9961,9972,9973,9952,9958,9951,9961,9956,9949,9958,9949,9952,9954,9952,9952,9948,,,,,,,,,,,,,,,,,,,,
9954,9955,9966,9967,9946,9951,9945,9955,9950,9942,9951,9943,9945,9945,9948,9946,9942,,,,,,,,,,,,,,,,,,,,
9952,9954,9964,9966,9945,9951,9944,9952,9948,9940,9949,9940,9944,9944,9950,9944,9937,,,,,,,,,,,,,,,,,,,,
9945,9945,9956,9958,9938,9944,9936,9944,9938,9931,9939,9932,9936,9936,9939,9936,9931,,,,,,,,,,,,,,,,,,,,
9960,9960,9969,9972,9951,9957,9949,9956,9949,9943,9952,9944,9948,9946,9951,9949,9939,,,,,,,,,,,,,,,,,,,,
9969,9969,9979,9981,9961,9966,9958,9964,9957,9952,9962,9952,9956,9957,9958,9958,9951,,,,,,,,,,,,,,,,,,,,
9981,9979,9990,9991,9972,9976,9968,9975,9968,9966,9973,9978,9967,9969,9997,9970,9992,,,,,,,,,,,,,,,,,,,,
9979,9978,9987,9990,9969,9974,9966,9972,9966,9961,9970,9961,9967,9972,9970,9972,9968,,,,,,,,,,,,,,,,,,,,
9998,9996,10004,10006,9985,9990,9981,9988,9982,9978,9987,9980,9986,9987,9988,9992,9991,,,,,,,,,,,,,,,,,,,,
9998,9996,10004,10005,9985,9988,9981,9988,9981,9978,9988,9981,9988,9988,9990,9994,9997,,,,,,,,,,,,,,,,,,,,
10020,10017,10024,10026,10006,10010,10003,10009,10003,9998,10008,10004,10010,10010,10014,10018,10024,,,,,,,,,,,,,,,,,,,,
10028,10024,10033,10034,10015,10020,10010,10016,10010,10005,10018,10012,10018,10018,10021,10032,10044,,,,,,,,,,,,,,,,,,,,
10041,10040,10050,10051,10032,10035,10027,10032,10026,10021,10036,10029,10038,10034,10038,10050,10071,,,,,,,,,,,,,,,,,,,,
10024,10027,10038,10040,10021,10026,10017,10023,10017,10016,10028,10020,10026,10023,10029,10044,10080,,,,,,,,,,,,,,,,,,,,
10040,10045,10056,10058,10040,10046,10039,10046,10041,10040,10050,10041,10046,10044,10053,10071,10135,,,,,,,,,,,,,,,,,,,,
10268,10173,10238,10125,10329,10082,10322,10198,10185,10202,10224,10263,10242,10314,10201,10321,10096,,,,,,,,,,,,,,,,,,,,
#,raw_min,,,,,,,,,,,,,,,,,,,,,,,,,,,,,,,,,,,
6761,6819,6645,6610,6783,6768,6761,6652,6763,6829,6706,6824,6772,6751,6778,6752,6620,,,,,,,,,,,,,,,,,,,,
6622,6536,6374,6449,6575,6656,6656,6583,6608,6702,6606,6620,6644,6595,6625,6583,6681,,,,,,,,,,,,,,,,,,,,
6510,6523,6540,6541,6530,6526,6521,6532,6530,6521,6528,6523,6523,6526,6523,6522,6535,,,,,,,,,,,,,,,,,,,,
6527,6532,6546,6548,6535,6538,6534,6546,6544,6536,6541,6536,6537,6540,6536,6536,6550,,,,,,,,,,,,,,,,,,,,
6548,6552,6565,6568,6556,6560,6555,6567,6565,6556,6562,6557,6557,6560,6556,6556,6569,,,,,,,,,,,,,,,,,,,,
6560,6564,6576,6579,6567,6570,6566,6578,6576,6568,6573,6568,6568,6571,6568,6567,6578,,,,,,,,,,,,,,,,,,,,
6572,6574,6586,6588,6577,6581,6576,6588,6587,6579,6584,6579,6579,6580,6577,6576,6586,,,,,,,,,,,,,,,,,,,,
6583,6585,6597,6600,6588,6592,6588,6600,6597,6589,6595,6590,6590,6591,6588,6586,6596,,,,,,,,,,,,,,,,,,,,
6596,6598,6609,6612,6602,6604,6600,6611,6609,6602,6608,6602,6602,6603,6600,6598,6606,,,,,,,,,,,,,,,,,,,,
6606,6608,6619,6621,6609,6613,6609,6620,6617,6610,6615,6610,6610,6612,6608,6607,6614,,,,,,,,,,,,,,,,,,,,
6617,6619,6630,6632,6620,6623,6619,6628,6627,6620,6624,6620,6620,6621,6619,6617,6624,,,,,,,,,,,,,,,,,,,,
6614,6616,6627,6628,6616,6620,6616,6625,6623,6616,6621,6616,6616,6618,6616,6615,6620,,,,,,,,,,,,,,,,,,,,
6620,6650,6648,6632,6620,6624,6621,6641,6627,6620,6624,6620,6620,6622,6620,6619,6624,,,,,,,,,,,,,,,,,,,,
6628,6641,6640,6640,6628,6631,6628,6637,6634,6627,6632,6628,6629,6630,6628,6628,6632,,,,,,,,,,,,,,,,,,,,
6633,6635,6647,6646,6634,6637,6633,6643,6640,6633,6639,6633,6635,6636,6634,6633,6636,,,,,,,,,,,,,,,,,,,,
6632,6635,6644,6645,6632,6636,6632,6640,6637,6631,6637,6632,6632,6633,6632,6632,6635,,,,,,,,,,,,,,,,,,,,
6642,6644,6652,6654,6641,6644,6640,6648,6645,6639,6644,6640,6640,6641,6640,6640,6643,,,,,,,,,,,,,,,,,,,,
6644,6645,6652,6653,6640,6644,6639,6647,6644,6638,6644,6638,6640,6640,6640,6640,6641,,,,,,,,,,,,,,,,,,,,
6650,6646,6653,6655,6641,6644,6639,6647,6644,6637,6643,6638,6640,6640,6640,6640,6640,,,,,,,,,,,,,,,,,,,,
6643,6644,6652,6654,6640,6644,6639,6645,6643,6637,6644,6638,6640,6640,6640,6640,6637,,,,,,,,,,,,,,,,,,,,
6644,6646,6653,6654,6640,6644,6640,6647,6644,6638,6644,6638,6640,6641,6641,6640,6640,,,,,,,,,,,,,,,,,,,,
6640,6640,6648,6648,6635,6639,6634,6640,6637,6632,6639,6632,6635,6636,6635,6635,6632,,,,,,,,,,,,,,,,,,,,
6636,6636,6644,6644,6631,6634,6630,6636,6633,6628,6634,6628,6630,6630,6632,6631,6628,,,,,,,,,,,,,,,,,,,,
6635,6636,6643,6644,6630,6634,6629,6635,6632,6627,6632,6627,6629,6629,6633,6629,6624,,,,,,,,,,,,,,,,,,,,
6630,6630,6637,6639,6625,6629,6624,6629,6625,6620,6626,6621,6624,6624,6626,6624,6620,,,,,,,,,,,,,,,,,,,,
6640,6640,6646,6648,6634,6638,6632,6637,6632,6628,6635,6629,6632,6631,6634,6632,6626,,,,,,,,,,,,,,,,,,,,
6646,6646,6652,6654,6640,6644,6639,6643,6638,6635,6641,6635,6637,6638,6639,6639,6634,,,,,,,,,,,,,,,,,,,,
6654,6652,6660,6660,6648,6651,6645,6650,6645,6644,6648,6652,6644,6646,6664,6647,6661,,,,,,,,,,,,,,,,,,,,
6652,6652,6658,6660,6646,6649,6644,6648,6644,6640,6647,6640,6644,6648,6647,6648,6645,,,,,,,,,,,,,,,,,,,,
6665,6664,6669,6671,6656,6660,6654,6659,6655,6652,6658,6653,6657,6658,6659,6661,6660,,,,,,,,,,,,,,,,,,,,
6665,6664,6669,6670,6656,6659,6654,6659,6654,6652,6659,6654,6659,6659,6660,6663,6664,,,,,,,,,,,,,,,,,,,,
6680,6678,6683,6684,6671,6673,6668,6672,6668,6665,6672,6669,6673,6673,6676,6679,6683,,,,,,,,,,,,,,,,,,,,
6685,6683,6688,6689,6676,6680,6673,6677,6673,6670,6679,6675,6679,6679,6680,6688,6696,,,,,,,,,,,,,,,,,,,,
6694,6693,6700,6700,6688,6690,6684,6688,6684,6680,6691,6686,6692,6689,6692,6700,6714,,,,,,,,,,,,,,,,,,,,
6683,6684,6692,6693,6680,6684,6678,6682,6678,6677,6685,6680,6684,6682,6686,6696,6720,,,,,,,,,,,,,,,,,,,,
6693,6696,6704,6705,6693,6697,6692,6697,6694,6693,6700,6694,6697,6696,6702,6714,6756,,,,,,,,,,,,,,,,,,,,
6845,6782,6825,6750,6886,6721,6881,6799,6790,6801,6816,6842,6828,6876,6800,6880,6731,,,,,,,,,,,,,,,,,,,,
#,raw_row_delta_max,,,,,,,,,,,,,,,,,,,,,,,,,,,,,,,,,,,
800,1200,1000,1200,850,800,800,800,800,800,800,800,800,800,800,800,800,,,,,,,,,,,,,,,,,,,,
600,600,600,600,600,600,600,600,600,600,600,600,600,600,600,600,600,,,,,,,,,,,,,,,,,,,,
350,350,350,350,350,350,350,350,350,350,350,350,350,350,350,350,350,,,,,,,,,,,,,,,,,,,,
350,350,350,350,350,350,350,350,350,350,350,350,350,350,350,350,350,,,,,,,,,,,,,,,,,,,,
350,350,350,350,350,350,350,350,350,350,350,350,350,350,350,350,350,,,,,,,,,,,,,,,,,,,,
350,350,350,350,350,350,350,350,350,350,350,350,350,350,350,350,350,,,,,,,,,,,,,,,,,,,,
350,350,350,350,350,350,350,350,350,350,350,350,350,350,350,350,350,,,,,,,,,,,,,,,,,,,,
350,350,350,350,350,350,350,350,350,350,350,350,350,350,350,350,350,,,,,,,,,,,,,,,,,,,,
350,350,350,350,350,350,350,350,350,350,350,350,350,350,350,350,350,,,,,,,,,,,,,,,,,,,,
350,350,350,350,350,350,350,350,350,350,350,350,350,350,350,350,350,,,,,,,,,,,,,,,,,,,,
350,350,350,350,350,350,350,350,350,350,350,350,350,350,350,350,350,,,,,,,,,,,,,,,,,,,,
350,350,350,350,350,350,350,350,350,350,350,350,350,350,350,350,350,,,,,,,,,,,,,,,,,,,,
350,350,350,350,350,350,350,350,350,350,350,350,350,350,350,350,350,,,,,,,,,,,,,,,,,,,,
350,350,350,350,350,350,350,350,350,350,350,350,350,350,350,350,350,,,,,,,,,,,,,,,,,,,,
350,350,350,350,350,350,350,350,350,350,350,350,350,350,350,350,350,,,,,,,,,,,,,,,,,,,,
350,350,350,350,350,350,350,350,350,350,350,350,350,350,350,350,350,,,,,,,,,,,,,,,,,,,,
350,350,350,350,350,350,350,350,350,350,350,350,350,350,350,350,350,,,,,,,,,,,,,,,,,,,,
350,350,350,350,350,350,350,350,350,350,350,350,350,350,350,350,350,,,,,,,,,,,,,,,,,,,,
350,350,350,350,350,350,350,350,350,350,350,350,350,350,350,350,350,,,,,,,,,,,,,,,,,,,,
350,350,350,350,350,350,350,350,350,350,350,350,350,350,350,350,350,,,,,,,,,,,,,,,,,,,,
350,350,350,350,350,350,350,350,350,350,350,350,350,350,350,350,350,,,,,,,,,,,,,,,,,,,,
350,350,350,350,350,350,350,350,350,350,350,350,350,350,350,350,350,,,,,,,,,,,,,,,,,,,,
350,350,350,350,350,350,350,350,350,350,350,350,350,350,350,350,350,,,,,,,,,,,,,,,,,,,,
350,350,350,350,350,350,350,350,350,350,350,350,350,350,350,350,350,,,,,,,,,,,,,,,,,,,,
350,350,350,350,350,350,350,350,350,350,350,350,350,350,350,350,350,,,,,,,,,,,,,,,,,,,,
350,350,350,350,350,350,350,350,350,350,350,350,350,350,350,350,350,,,,,,,,,,,,,,,,,,,,
350,350,350,350,350,350,350,350,350,350,350,350,350,350,350,350,350,,,,,,,,,,,,,,,,,,,,
350,350,350,350,350,350,350,350,350,350,350,350,350,350,350,350,350,,,,,,,,,,,,,,,,,,,,
350,350,350,350,350,350,350,350,350,350,350,350,350,350,350,350,350,,,,,,,,,,,,,,,,,,,,
350,350,350,350,350,350,350,350,350,350,350,350,350,350,350,350,350,,,,,,,,,,,,,,,,,,,,
350,350,350,350,350,350,350,350,350,350,350,350,350,350,350,350,350,,,,,,,,,,,,,,,,,,,,
350,350,350,350,350,350,350,350,350,350,350,350,350,350,350,350,350,,,,,,,,,,,,,,,,,,,,
350,350,350,350,350,350,350,350,350,350,350,350,350,350,350,350,350,,,,,,,,,,,,,,,,,,,,
350,350,350,350,350,350,350,350,350,350,350,350,350,350,350,350,350,,,,,,,,,,,,,,,,,,,,
350,350,350,350,350,350,350,350,350,350,350,350,350,350,350,350,350,,,,,,,,,,,,,,,,,,,,
800,800,800,800,800,800,800,800,800,800,800,800,800,800,800,800,800,,,,,,,,,,,,,,,,,,,,
#,raw_row_delta_min,,,,,,,,,,,,,,,,,,,,,,,,,,,,,,,,,,,
-800,-1200,-1000,-1200,-850,-800,-800,-800,-800,-800,-800,-800,-800,-800,-800,-800,-800,,,,,,,,,,,,,,,,,,,,
-600,-600,-600,-600,-600,-600,-600,-600,-600,-600,-600,-600,-600,-600,-600,-600,-600,,,,,,,,,,,,,,,,,,,,
-350,-350,-350,-350,-350,-350,-350,-350,-350,-350,-350,-350,-350,-350,-350,-350,-350,,,,,,,,,,,,,,,,,,,,
-350,-350,-350,-350,-350,-350,-350,-350,-350,-350,-350,-350,-350,-350,-350,-350,-350,,,,,,,,,,,,,,,,,,,,
-350,-350,-350,-350,-350,-350,-350,-350,-350,-350,-350,-350,-350,-350,-350,-350,-350,,,,,,,,,,,,,,,,,,,,
-350,-350,-350,-350,-350,-350,-350,-350,-350,-350,-350,-350,-350,-350,-350,-350,-350,,,,,,,,,,,,,,,,,,,,
-350,-350,-350,-350,-350,-350,-350,-350,-350,-350,-350,-350,-350,-350,-350,-350,-350,,,,,,,,,,,,,,,,,,,,
-350,-350,-350,-350,-350,-350,-350,-350,-350,-350,-350,-350,-350,-350,-350,-350,-350,,,,,,,,,,,,,,,,,,,,
-350,-350,-350,-350,-350,-350,-350,-350,-350,-350,-350,-350,-350,-350,-350,-350,-350,,,,,,,,,,,,,,,,,,,,
-350,-350,-350,-350,-350,-350,-350,-350,-350,-350,-350,-350,-350,-350,-350,-350,-350,,,,,,,,,,,,,,,,,,,,
-350,-350,-350,-350,-350,-350,-350,-350,-350,-350,-350,-350,-350,-350,-350,-350,-350,,,,,,,,,,,,,,,,,,,,
-350,-350,-350,-350,-350,-350,-350,-350,-350,-350,-350,-350,-350,-350,-350,-350,-350,,,,,,,,,,,,,,,,,,,,
-350,-350,-350,-350,-350,-350,-350,-350,-350,-350,-350,-350,-350,-350,-350,-350,-350,,,,,,,,,,,,,,,,,,,,
-350,-350,-350,-350,-350,-350,-350,-350,-350,-350,-350,-350,-350,-350,-350,-350,-350,,,,,,,,,,,,,,,,,,,,
-350,-350,-350,-350,-350,-350,-350,-350,-350,-350,-350,-350,-350,-350,-350,-350,-350,,,,,,,,,,,,,,,,,,,,
-350,-350,-350,-350,-350,-350,-350,-350,-350,-350,-350,-350,-350,-350,-350,-350,-350,,,,,,,,,,,,,,,,,,,,
-350,-350,-350,-350,-350,-350,-350,-350,-350,-350,-350,-350,-350,-350,-350,-350,-350,,,,,,,,,,,,,,,,,,,,
-350,-350,-350,-350,-350,-350,-350,-350,-350,-350,-350,-350,-350,-350,-350,-350,-350,,,,,,,,,,,,,,,,,,,,
-350,-350,-350,-350,-350,-350,-350,-350,-350,-350,-350,-350,-350,-350,-350,-350,-350,,,,,,,,,,,,,,,,,,,,
-350,-350,-350,-350,-350,-350,-350,-350,-350,-350,-350,-350,-350,-350,-350,-350,-350,,,,,,,,,,,,,,,,,,,,
-350,-350,-350,-350,-350,-350,-350,-350,-350,-350,-350,-350,-350,-350,-350,-350,-350,,,,,,,,,,,,,,,,,,,,
-350,-350,-350,-350,-350,-350,-350,-350,-350,-350,-350,-350,-350,-350,-350,-350,-350,,,,,,,,,,,,,,,,,,,,
-350,-350,-350,-350,-350,-350,-350,-350,-350,-350,-350,-350,-350,-350,-350,-350,-350,,,,,,,,,,,,,,,,,,,,
-350,-350,-350,-350,-350,-350,-350,-350,-350,-350,-350,-350,-350,-350,-350,-350,-350,,,,,,,,,,,,,,,,,,,,
-350,-350,-350,-350,-350,-350,-350,-350,-350,-350,-350,-350,-350,-350,-350,-350,-350,,,,,,,,,,,,,,,,,,,,
-350,-350,-350,-350,-350,-350,-350,-350,-350,-350,-350,-350,-350,-350,-350,-350,-350,,,,,,,,,,,,,,,,,,,,
-350,-350,-350,-350,-350,-350,-350,-350,-350,-350,-350,-350,-350,-350,-350,-350,-350,,,,,,,,,,,,,,,,,,,,
-350,-350,-350,-350,-350,-350,-350,-350,-350,-350,-350,-350,-350,-350,-350,-350,-350,,,,,,,,,,,,,,,,,,,,
-350,-350,-350,-350,-350,-350,-350,-350,-350,-350,-350,-350,-350,-350,-350,-350,-350,,,,,,,,,,,,,,,,,,,,
-350,-350,-350,-350,-350,-350,-350,-350,-350,-350,-350,-350,-350,-350,-350,-350,-350,,,,,,,,,,,,,,,,,,,,
-350,-350,-350,-350,-350,-350,-350,-350,-350,-350,-350,-350,-350,-350,-350,-350,-350,,,,,,,,,,,,,,,,,,,,
-350,-350,-350,-350,-350,-350,-350,-350,-350,-350,-350,-350,-350,-350,-350,-350,-350,,,,,,,,,,,,,,,,,,,,
-350,-350,-350,-350,-350,-350,-350,-350,-350,-350,-350,-350,-350,-350,-350,-350,-350,,,,,,,,,,,,,,,,,,,,
-350,-350,-350,-350,-350,-350,-350,-350,-350,-350,-350,-350,-350,-350,-350,-350,-350,,,,,,,,,,,,,,,,,,,,
-350,-350,-350,-350,-350,-350,-350,-350,-350,-350,-350,-350,-350,-350,-350,-350,-350,,,,,,,,,,,,,,,,,,,,
-800,-800,-800,-800,-800,-800,-800,-800,-800,-800,-800,-800,-800,-800,-800,-800,-800,,,,,,,,,,,,,,,,,,,,
#,raw_col_delta_max,,,,,,,,,,,,,,,,,,,,,,,,,,,,,,,,,,,
800,1000,600,1000,500,500,500,500,500,500,500,500,500,500,500,800,,,,,,,,,,,,,,,,,,,,,
600,1000,600,1000,400,400,400,400,400,400,400,400,400,400,400,400,,,,,,,,,,,,,,,,,,,,,
300,300,300,300,300,300,300,300,300,300,300,300,300,300,300,300,,,,,,,,,,,,,,,,,,,,,
300,300,300,300,300,300,300,300,300,300,300,300,300,300,300,300,,,,,,,,,,,,,,,,,,,,,
300,300,300,300,300,300,300,300,300,300,300,300,300,300,300,300,,,,,,,,,,,,,,,,,,,,,
300,300,300,300,300,300,300,300,300,300,300,300,300,300,300,300,,,,,,,,,,,,,,,,,,,,,
300,300,300,300,300,300,300,300,300,300,300,300,300,300,300,300,,,,,,,,,,,,,,,,,,,,,
300,300,300,300,300,300,300,300,300,300,300,300,300,300,300,300,,,,,,,,,,,,,,,,,,,,,
300,300,300,300,300,300,300,300,300,300,300,300,300,300,300,300,,,,,,,,,,,,,,,,,,,,,
300,300,300,300,300,300,300,300,300,300,300,300,300,300,300,300,,,,,,,,,,,,,,,,,,,,,
300,300,300,300,300,300,300,300,300,300,300,300,300,300,300,300,,,,,,,,,,,,,,,,,,,,,
300,300,300,300,300,300,300,300,300,300,300,300,300,300,300,300,,,,,,,,,,,,,,,,,,,,,
300,300,300,300,300,300,300,300,300,300,300,300,300,300,300,300,,,,,,,,,,,,,,,,,,,,,
300,300,300,300,300,300,300,300,300,300,300,300,300,300,300,300,,,,,,,,,,,,,,,,,,,,,
300,300,300,300,300,300,300,300,300,300,300,300,300,300,300,300,,,,,,,,,,,,,,,,,,,,,
300,300,300,300,300,300,300,300,300,300,300,300,300,300,300,300,,,,,,,,,,,,,,,,,,,,,
300,300,300,300,300,300,300,300,300,300,300,300,300,300,300,300,,,,,,,,,,,,,,,,,,,,,
300,300,300,300,300,300,300,300,300,300,300,300,300,300,300,300,,,,,,,,,,,,,,,,,,,,,
300,300,300,300,300,300,300,300,300,300,300,300,300,300,300,300,,,,,,,,,,,,,,,,,,,,,
300,300,300,300,300,300,300,300,300,300,300,300,300,300,300,300,,,,,,,,,,,,,,,,,,,,,
300,300,300,300,300,300,300,300,300,300,300,300,300,300,300,300,,,,,,,,,,,,,,,,,,,,,
300,300,300,300,300,300,300,300,300,300,300,300,300,300,300,300,,,,,,,,,,,,,,,,,,,,,
300,300,300,300,300,300,300,300,300,300,300,300,300,300,300,300,,,,,,,,,,,,,,,,,,,,,
300,300,300,300,300,300,300,300,300,300,300,300,300,300,300,300,,,,,,,,,,,,,,,,,,,,,
300,300,300,300,300,300,300,300,300,300,300,300,300,300,300,300,,,,,,,,,,,,,,,,,,,,,
300,300,300,300,300,300,300,300,300,300,300,300,300,300,300,300,,,,,,,,,,,,,,,,,,,,,
300,300,300,300,300,300,300,300,300,300,300,300,300,300,300,300,,,,,,,,,,,,,,,,,,,,,
300,300,300,300,300,300,300,300,300,300,300,300,300,300,300,300,,,,,,,,,,,,,,,,,,,,,
300,300,300,300,300,300,300,300,300,300,300,300,300,300,300,300,,,,,,,,,,,,,,,,,,,,,
300,300,300,300,300,300,300,300,300,300,300,300,300,300,300,300,,,,,,,,,,,,,,,,,,,,,
300,300,300,300,300,300,300,300,300,300,300,300,300,300,300,300,,,,,,,,,,,,,,,,,,,,,
300,300,300,300,300,300,300,300,300,300,300,300,300,300,300,300,,,,,,,,,,,,,,,,,,,,,
300,300,300,300,300,300,300,300,300,300,300,300,300,300,300,300,,,,,,,,,,,,,,,,,,,,,
300,300,300,300,300,300,300,300,300,300,300,300,300,300,300,300,,,,,,,,,,,,,,,,,,,,,
300,300,300,300,300,300,300,300,300,300,300,300,300,300,300,300,,,,,,,,,,,,,,,,,,,,,
300,300,300,300,300,300,300,300,300,300,300,300,300,300,300,300,,,,,,,,,,,,,,,,,,,,,
800,500,500,500,500,500,500,500,500,500,500,500,500,500,500,800,,,,,,,,,,,,,,,,,,,,,
#,raw_col_delta_min,,,,,,,,,,,,,,,,,,,,,,,,,,,,,,,,,,,
-800,-1000,-600,-1000,-500,-500,-500,-500,-500,-500,-500,-500,-500,-500,-500,-800,,,,,,,,,,,,,,,,,,,,,
-600,-1000,-600,-1000,-400,-400,-400,-400,-400,-400,-400,-400,-400,-400,-400,-400,,,,,,,,,,,,,,,,,,,,,
-300,-300,-300,-300,-300,-300,-300,-300,-300,-300,-300,-300,-300,-300,-300,-300,,,,,,,,,,,,,,,,,,,,,
-300,-300,-300,-300,-300,-300,-300,-300,-300,-300,-300,-300,-300,-300,-300,-300,,,,,,,,,,,,,,,,,,,,,
-300,-300,-300,-300,-300,-300,-300,-300,-300,-300,-300,-300,-300,-300,-300,-300,,,,,,,,,,,,,,,,,,,,,
-300,-300,-300,-300,-300,-300,-300,-300,-300,-300,-300,-300,-300,-300,-300,-300,,,,,,,,,,,,,,,,,,,,,
-300,-300,-300,-300,-300,-300,-300,-300,-300,-300,-300,-300,-300,-300,-300,-300,,,,,,,,,,,,,,,,,,,,,
-300,-300,-300,-300,-300,-300,-300,-300,-300,-300,-300,-300,-300,-300,-300,-300,,,,,,,,,,,,,,,,,,,,,
-300,-300,-300,-300,-300,-300,-300,-300,-300,-300,-300,-300,-300,-300,-300,-300,,,,,,,,,,,,,,,,,,,,,
-300,-300,-300,-300,-300,-300,-300,-300,-300,-300,-300,-300,-300,-300,-300,-300,,,,,,,,,,,,,,,,,,,,,
-300,-300,-300,-300,-300,-300,-300,-300,-300,-300,-300,-300,-300,-300,-300,-300,,,,,,,,,,,,,,,,,,,,,
-300,-300,-300,-300,-300,-300,-300,-300,-300,-300,-300,-300,-300,-300,-300,-300,,,,,,,,,,,,,,,,,,,,,
-300,-300,-300,-300,-300,-300,-300,-300,-300,-300,-300,-300,-300,-300,-300,-300,,,,,,,,,,,,,,,,,,,,,
-300,-300,-300,-300,-300,-300,-300,-300,-300,-300,-300,-300,-300,-300,-300,-300,,,,,,,,,,,,,,,,,,,,,
-300,-300,-300,-300,-300,-300,-300,-300,-300,-300,-300,-300,-300,-300,-300,-300,,,,,,,,,,,,,,,,,,,,,
-300,-300,-300,-300,-300,-300,-300,-300,-300,-300,-300,-300,-300,-300,-300,-300,,,,,,,,,,,,,,,,,,,,,
-300,-300,-300,-300,-300,-300,-300,-300,-300,-300,-300,-300,-300,-300,-300,-300,,,,,,,,,,,,,,,,,,,,,
-300,-300,-300,-300,-300,-300,-300,-300,-300,-300,-300,-300,-300,-300,-300,-300,,,,,,,,,,,,,,,,,,,,,
-300,-300,-300,-300,-300,-300,-300,-300,-300,-300,-300,-300,-300,-300,-300,-300,,,,,,,,,,,,,,,,,,,,,
-300,-300,-300,-300,-300,-300,-300,-300,-300,-300,-300,-300,-300,-300,-300,-300,,,,,,,,,,,,,,,,,,,,,
-300,-300,-300,-300,-300,-300,-300,-300,-300,-300,-300,-300,-300,-300,-300,-300,,,,,,,,,,,,,,,,,,,,,
-300,-300,-300,-300,-300,-300,-300,-300,-300,-300,-300,-300,-300,-300,-300,-300,,,,,,,,,,,,,,,,,,,,,
-300,-300,-300,-300,-300,-300,-300,-300,-300,-300,-300,-300,-300,-300,-300,-300,,,,,,,,,,,,,,,,,,,,,
-300,-300,-300,-300,-300,-300,-300,-300,-300,-300,-300,-300,-300,-300,-300,-300,,,,,,,,,,,,,,,,,,,,,
-300,-300,-300,-300,-300,-300,-300,-300,-300,-300,-300,-300,-300,-300,-300,-300,,,,,,,,,,,,,,,,,,,,,
-300,-300,-300,-300,-300,-300,-300,-300,-300,-300,-300,-300,-300,-300,-300,-300,,,,,,,,,,,,,,,,,,,,,
-300,-300,-300,-300,-300,-300,-300,-300,-300,-300,-300,-300,-300,-300,-300,-300,,,,,,,,,,,,,,,,,,,,,
-300,-300,-300,-300,-300,-300,-300,-300,-300,-300,-300,-300,-300,-300,-300,-300,,,,,,,,,,,,,,,,,,,,,
-300,-300,-300,-300,-300,-300,-300,-300,-300,-300,-300,-300,-300,-300,-300,-300,,,,,,,,,,,,,,,,,,,,,
-300,-300,-300,-300,-300,-300,-300,-300,-300,-300,-300,-300,-300,-300,-300,-300,,,,,,,,,,,,,,,,,,,,,
-300,-300,-300,-300,-300,-300,-300,-300,-300,-300,-300,-300,-300,-300,-300,-300,,,,,,,,,,,,,,,,,,,,,
-300,-300,-300,-300,-300,-300,-300,-300,-300,-300,-300,-300,-300,-300,-300,-300,,,,,,,,,,,,,,,,,,,,,
-300,-300,-300,-300,-300,-300,-300,-300,-300,-300,-300,-300,-300,-300,-300,-300,,,,,,,,,,,,,,,,,,,,,
-300,-300,-300,-300,-300,-300,-300,-300,-300,-300,-300,-300,-300,-300,-300,-300,,,,,,,,,,,,,,,,,,,,,
-300,-300,-300,-300,-300,-300,-300,-300,-300,-300,-300,-300,-300,-300,-300,-300,,,,,,,,,,,,,,,,,,,,,
-300,-300,-300,-300,-300,-300,-300,-300,-300,-300,-300,-300,-300,-300,-300,-300,,,,,,,,,,,,,,,,,,,,,
-800,-500,-500,-500,-500,-500,-500,-500,-500,-500,-500,-500,-500,-500,-500,-800,,,,,,,,,,,,,,,,,,,,,
,,,,,,,,,,,,,,,,,,,,,,,,,,,,,,,,,,,,
#,line_max,,,,,,,,,,,,,,,,,,,,,,,,,,,,,,,,,,,
46516,46363,46207,46316,46149,45964,45918,45148,45410,45628,45726,45658,45739,45299,45560,45411,45411,,,,,,,,,,,,,,,,,,,,
45763,45985,46138,46117,45941,45882,45712,45673,45802,45838,45868,46076,46103,45991,46040,46131,46016,45894,45945,45794,45831,45879,45824,45568,45666,45739,45679,45836,45725,45703,45777,45759,45815,45796,45824,45787,45507
,,,,,,,,,,,,,,,,,,,,,,,,,,,,,,,,,,,,
,,,,,,,,,,,,,,,,,,,,,,,,,,,,,,,,,,,,
#,line_min,,,,,,,,,,,,,,,,,,,,,,,,,,,,,,,,,,,
19935,19870,19803,19849,19778,19699,19679,19349,19461,19555,19597,19567,19602,19414,19525,19462,19462,,,,,,,,,,,,,,,,,,,,
19612,19708,19773,19764,19689,19663,19591,19574,19629,19645,19657,19747,19758,19710,19731,19770,19721,19669,19690,19626,19642,19662,19639,19529,19571,19602,19576,19644,19596,19587,19618,19611,19635,19627,19639,19623,19503
,,,,,,,,,,,,,,,,,,,,,,,,,,,,,,,,,,,,
,,,,,,,,,,,,,,,,,,,,,,,,,,,,,,,,,,,,
,,,,,,,,,,,,,,,,,,,,,,,,,,,,,,,,,,,,
,,,,,,,,,,,,,,,,,,,,,,,,,,,,,,,,,,,,
,,,,,,,,,,,,,,,,,,,,,,,,,,,,,,,,,,,,
,,,,,,,,,,,,,,,,,,,,,,,,,,,,,,,,,,,,
,,,,,,,,,,,,,,,,,,,,,,,,,,,,,,,,,,,,
,,,,,,,,,,,,,,,,,,,,,,,,,,,,,,,,,,,,
,,,,,,,,,,,,,,,,,,,,,,,,,,,,,,,,,,,,
,,,,,,,,,,,,,,,,,,,,,,,,,,,,,,,,,,,,
,,,,,,,,,,,,,,,,,,,,,,,,,,,,,,,,,,,,
,,,,,,,,,,,,,,,,,,,,,,,,,,,,,,,,,,,,
,,,,,,,,,,,,,,,,,,,,,,,,,,,,,,,,,,,,
,,,,,,,,,,,,,,,,,,,,,,,,,,,,,,,,,,,,
,,,,,,,,,,,,,,,,,,,,,,,,,,,,,,,,,,,,
