10
 9,  0, 0, 0, 0,  1038, 0, 0, 0, 0, 1, 1, 1, 0, 0, 0, 0, 0,
 8,  0, 0, 0, 0,  1037, 0, 0, 0, 0, 1, 1, 1, 0, 0, 0, 0, 0,
 7,  0, 0, 0, 0,  1037, 0, 0, 0, 0, 1, 1, 1, 0, 0, 0, 0, 0,
 6,  0, 0, 0, 0,  1018, 0, 0, 0, 0, 1, 1, 1, 0, 0, 0, 0, 0,
 5,  0, 0, 0, 0,   914, 0, 0, 0, 0, 1, 1, 1, 0, 0, 0, 0, 0,
 4,  0, 0, 0, 0,   846, 0, 0, 0, 0, 1, 1, 1, 0, 0, 0, 0, 0,
 3,  0, 0, 0, 0,   758, 0, 0, 0, 0, 1, 1, 1, 0, 0, 0, 0, 0,
 2,  0, 0, 0, 0,   667, 0, 0, 0, 0, 1, 1, 1, 0, 0, 0, 0, 0,
 1,  0, 0, 0, 0,   576, 0, 0, 0, 0, 1, 1, 1, 0, 0, 0, 0, 0,
 0,  0, 0, 0, 0,   479, 0, 0, 0, 0, 1, 1, 1, 0, 0, 0, 0, 0,
