{
    "id": "makeUp",
    "title_id": "story_template_title_happy_moment",
    "music": "Resource/music/out.aac",
    "resolution": [2520, 1080],
    "segments": [
        {
            "camera_id": 1,
            "duration": 2.8,
            "demo_offset": [0, 2.0],
            "shot_mode": "single_video",
            "audio_offset": 0,
            "algo_scripts": {
            },
            "camera_effects": {
            }
        },
        {
            "camera_id": 0,
            "duration": 4.3,
            "shot_mode": "dual_video",
            "twins_video_status": "NORMAL",
            "demo_offset": [3.0, 6.0],
            "audio_offset": 3.0,
            "algo_scripts": {
            },
            "camera_effects": {
                "beauty": "5"
            }
        },
        {
            "camera_id": 0,
            "duration": 2.5,
            "shot_mode": "dual_video_picture_in_picture",
            "demo_offset": [6.2, 8.3],
            "audio_offset": 6.2,
            "algo_scripts": {
            },
            "camera_effects": {
                "beauty": "5"
            }
        },
		{
            "camera_id": 1,
            "duration": 16,
            "shot_mode": "single_video",
            "dynamic_record_speed": 4.0,
            "demo_offset": [9.0, 12.3],
            "audio_offset": 9.0,
            "algo_scripts": {
            },
            "camera_effects": {
                "beauty": "5"
            }
        },
        {
            "camera_id": 1,
            "duration": 2.4,
            "shot_mode": "single_video",
            "demo_offset": [12.7, 15.0],
            "audio_offset": 12.7,
            "algo_scripts": {
            },
            "camera_effects": {
                "beauty": "5"
            }
        }
    ]
}