{
    "imports" : [
        "/system_ext/lib64/libhwfilter_mtk.so"
    ],

    "filters" :
    [
        {
            "id" : "ppsource",
            "type" : "ppsource"
        },

        {
            "id" : "sync",
            "type" : "sync"
        },

        {
            "id" : "jpeg",
            "type" : "mtk_filter_jpeg"
        },

        {
            "id" : "writer",
            "type" : "filewriter"
        },

        {
            "id" : "thumbnail",
            "type" : "quickthumbnail"
        },

        {
            "id" : "notifier",
            "type" : "thumbnail-notifier"
        },

        {
            "id" : "peek",
            "type" : "peek"
        },

        {
            "id" : "peekMeta",
            "type" : "peek"
        },

        {
            "id" : "DualBokehPp",
            "type" : "DualBokehPp"
        },

        {
            "id" : "RefocusPp",
            "type" : "RefocusPp"
        }
    ],

    "connections" :
    [
        {
            "from" :
            {
                "filter" : "ppsource",
                "port" : "out0"
            },

            "to" :
            {
                "filter" : "sync",
                "port" : "in0"
            }
        },

        {
            "from" :
            {
                "filter" : "ppsource",
                "port" : "out1"
            },

            "to" :
            {
                "filter" : "sync",
                "port" : "in1"
            }
        },

        {
            "from" :
            {
                "filter" : "sync",
                "port" : "out1"
            },

            "to" :
            {
                "filter" : "DualBokehPp",
                "port" : "inSecond"
            }
        },

        {
            "from" :
            {
                "filter" : "ppsource",
                "port" : "out_meta"
            },

            "to" :
            {
                "filter" : "sync",
                "port" : "in2"
            }
        },

        {
            "from" :
            {
                "filter" : "sync",
                "port" : "out0"
            },

            "to" :
            {
                "filter" : "peek",
                "port" : "in"
            }
        },

        {
            "from" :
            {
                "filter" : "sync",
                "port" : "out2"
            },

            "to" :
            {
                "filter" : "peekMeta",
                "port" : "in"
            }
        },

        {
            "from" :
            {
                "filter" : "peek",
                "port" : "out"
            },

            "to" :
            {
                "filter" : "DualBokehPp",
                "port" : "inMain"
            }
        },

        {
            "from" :
            {
                "filter" : "DualBokehPp",
                "port" : "OutDestyuv"
            },

            "to" :
            {
                "filter" : "RefocusPp",
                "port" : "inMain"
            }
        },

        {
            "from" :
            {
                "filter" : "RefocusPp",
                "port" : "OutDestyuv"
            },

            "to" :
            {
                "filter" : "jpeg",
                "port" : "inMain"
            }
        },

        {
            "from" :
            {
                "filter" : "peekMeta",
                "port" : "out"
            },

            "to" :
            {
                "filter" : "DualBokehPp",
                "port" : "inMeta"
            }
        },

        {
            "from" :
            {
                "filter" : "DualBokehPp",
                "port" : "OutMeta"
            },

            "to" :
            {
                "filter" : "RefocusPp",
                "port" : "inMeta"
            }
        },

        {
            "from" :
            {
                "filter" : "RefocusPp",
                "port" : "OutMeta"
            },

            "to" :
            {
                "filter" : "jpeg",
                "port" : "inMeta"
            }
        },

        {
            "from" :
            {
                "filter" : "jpeg",
                "port" : "jpeg"
            },

            "to" :
            {
                "filter" : "writer",
                "port" : "in"
            }
        },

        {
            "from" :
            {
                "filter" : "peek",
                "port" : "peek0"
            },

            "to" :
            {
                "filter" : "thumbnail",
                "port" : "inMain"
            }
        },

        {
            "from" :
            {
                "filter" : "peekMeta",
                "port" : "peek0"
            },

            "to" :
            {
                "filter" : "thumbnail",
                "port" : "inMeta"
            }
        },

        {
            "from" :
            {
                "filter" : "thumbnail",
                "port" : "outThumbnail"
            },

            "to" :
            {
                "filter" : "notifier",
                "port" : "in"
            }
        }
    ]
}

