#wt rockytwonfc AK09915 2022-09-20 Average
HPRMS0 = 150
HPRMS1 = 83
HPRMS2 = 119
HPRMS3 = 53
HPRMS4 = 214
HPRMS5 = 94
HPRMS6 = 0
HPRMS7 = 86
HPRMS8 = 210
HPRMS9 = 56
HPRMS10 = 226
HPRMS11 = 76
HPRMS12 = 143
HPRMS13 = 117
HPRMS14 = 0
HPRMS15 = 200
HPRMS16 = 254
HPRMS17 = 11
HPRMS18 = 160
HPRMS19 = 199
HPRMS20 = 188
HPRMS21 = 250
HPRMS22 = 243
HPRMS23 = 149
HPRMS24 = 16
HPRMS25 = 130
HPRMS26 = 116
