{
    "FULLHDR": {
        "FRONT_MAIN_1": {
            "HEAD_INFO": {
                "TRIGGER_GAIN_1": 50,
                "TRIGGER_GAIN_2": 80,
                "TRIGGER_GAIN_3": 100,
                "TRIGGER_GAIN_4": 115,
                "TRIGGER_GAIN_5": 140,
                "TRIGGER_GAIN_6": 160
            },
            "PROFILE_1": {
                "HDR_PYR_LIGHT_PROTECT_THRES": 240,
                "HDR_PYR_DARK_PROTECT_THRES": 20,
                "HDR_FACE_PYR_DARKEN_RATIO": 0.0,
                "FHF_FACE_LOW_CORRECTION_STRENGTH": 0.0,
                "FHF_FACE_TWO_FUSION_GF_SIZE": 15,
                "HDR_FACE_WALL_OVER_EXPO_THRES": 230,
                "HDR_FACE_PYR_LIGHT_PROTECT_THRES": 200,
                "HDR_FACE_PYR_DARK_PROTECT_THRES": 100,
                "HFS_UNDER_EXPOSURE_AREA": 0.15,
                "HFS_OVER_EXPOSURE_AREA": 0.0001,
                "HFS_UNDER_EXPOSURE_THRES": 25,
                "HFS_OVER_EXPOSURE_THRES": 200,
                "HFS_FACE_UNDER_EXPOSURE_AREA": 0.15,
                "HFS_FACE_OVER_EXPOSURE_AREA": 0.0001,
                "HFS_FACE_UNDER_EXPOSURE_THRES": 25,
                "HFS_FACE_OVER_EXPOSURE_THRES": 200,
                "HGD_FIRST_THRESHOLD": 0.4,
                "HGD_DILATE_SIZE": 15,
                "HGD_GAUSSIAN_WINDOW_SIZE": 15,
                "HGD_RESIZE_SCALE": 8,
                "ALIGN_MOVE_THRES": 200,
                "FLOW_MOVE_THRES": 8,
                "FLOW_DIF_THRES": 4,
                "FHF_TWO_FUSION_GF_SIZE": 18,
                "FHF_BLEND_RESIZE_SCALE": 6,
                "HDR_WALL_OVER_EXPO_THRES": 250,
                "FHF_BODY_MASK_GF_SIZE": 5,
                "HF_BODY_MASK_BLEND_RATIO": 0.5,
                "TM_CONTRAST_DEGREE": 0.8,
                "TM_SATURATION_ADJUST_RATIO": 0.0,
                "TM_HL_SATURATION_ADJUST_RATIO": 0.0,
                "TM_BRIGHTAREA_DETAILS_ENHANCE_RATIO": 1.0,
                "TM_DARKAREA_DETAILS_ENHANCE_RATIO": 0.95,
                "TM_FACE_CONTRAST_DEGREE": 0.8,
                "TM_FACE_BRIGHTAREA_DETAILS_ENHANCE_RATIO": 1.0,
                "TM_FACE_DARKAREA_DETAILS_ENHANCE_RATIO": 1.0,
                "FHF_FACE_FOREGROUND_BRIGHTEN_RATIO": 1.0,
                "FUSION_INTENSITY": 0.23,
                "YDENOISE_HF": 0.2,
                "YDENOISE_MF": 0.1,
                "YDENOISE_LF": 0.1,
                "UVDENOISE_INTENSITY": 0.2,
                "SHARPEN_INTENSITY": 0.42,
                "SHARPEN_DETAIL": 10.0,
                "H_RATIO": 0.39,
                "M_RATIO": 0.1,
                "W_RATIO": 0.05,
                "B_RATIO": 0.05
            },
            "PROFILE_2": {
                "HDR_FACE_PYR_DARKEN_RATIO": 0.0,
                "FHF_FACE_LOW_CORRECTION_STRENGTH": 0.0,
                "FHF_FACE_TWO_FUSION_GF_SIZE": 15,
                "HDR_FACE_WALL_OVER_EXPO_THRES": 250,
                "HDR_FACE_PYR_LIGHT_PROTECT_THRES": 240,
                "HDR_FACE_PYR_DARK_PROTECT_THRES": 100,
                "FHF_BODY_MASK_GF_SIZE": 5,
                "HF_BODY_MASK_BLEND_RATIO": 0.5,
                "TM_FACE_CONTRAST_DEGREE": 0.8,
                "TM_FACE_BRIGHTAREA_DETAILS_ENHANCE_RATIO": 1.0,
                "TM_FACE_DARKAREA_DETAILS_ENHANCE_RATIO": 1.0,
                "FHF_FACE_FOREGROUND_BRIGHTEN_RATIO": 1.0
            },
            "PROFILE_3": {
                "HDR_FACE_PYR_DARKEN_RATIO": 0.0,
                "FHF_FACE_LOW_CORRECTION_STRENGTH": 0.0,
                "FHF_FACE_TWO_FUSION_GF_SIZE": 15,
                "HDR_FACE_WALL_OVER_EXPO_THRES": 245,
                "FHF_WHITE_WALL_LIGHTEN_RATIO": 1.0,
                "FHF_WHALL_EXPO_FLAG": 220,
                "HDR_FACE_PYR_LIGHT_PROTECT_THRES": 220,
                "HDR_FACE_PYR_DARK_PROTECT_THRES": 90,
                "FHF_BODY_MASK_GF_SIZE": 5,
                "HF_BODY_MASK_BLEND_RATIO": 0.5,
                "TM_FACE_CONTRAST_DEGREE": 0.8,
                "TM_FACE_BRIGHTAREA_DETAILS_ENHANCE_RATIO": 0.8,
                "TM_FACE_DARKAREA_DETAILS_ENHANCE_RATIO": 1.0,
                "FHF_FACE_FOREGROUND_BRIGHTEN_RATIO": 1.0
            },
            "PROFILE_4": {
                "HDR_FACE_PYR_DARKEN_RATIO": 0.0,
                "FHF_FACE_LOW_CORRECTION_STRENGTH": 0.0,
                "FHF_FACE_TWO_FUSION_GF_SIZE": 15,
                "HDR_FACE_WALL_OVER_EXPO_THRES": 245,
                "FHF_WHITE_WALL_LIGHTEN_RATIO": 1.0,
                "FHF_WHALL_EXPO_FLAG": 220,
                "HDR_FACE_PYR_LIGHT_PROTECT_THRES": 220,
                "HDR_FACE_PYR_DARK_PROTECT_THRES": 65,
                "FHF_BODY_MASK_GF_SIZE": 5,
                "HF_BODY_MASK_BLEND_RATIO": 0.7,
                "TM_FACE_CONTRAST_DEGREE": 0.8,
                "TM_FACE_BRIGHTAREA_DETAILS_ENHANCE_RATIO": 0.8,
                "TM_FACE_DARKAREA_DETAILS_ENHANCE_RATIO": 1.0,
                "FHF_FACE_FOREGROUND_BRIGHTEN_RATIO": 1.0
            },
            "PROFILE_5": {
                "HDR_FACE_PYR_DARKEN_RATIO": 0.0,
                "FHF_FACE_LOW_CORRECTION_STRENGTH": 0.0,
                "FHF_FACE_TWO_FUSION_GF_SIZE": 15,
                "HDR_FACE_WALL_OVER_EXPO_THRES": 245,
                "FHF_WHITE_WALL_LIGHTEN_RATIO": 1.0,
                "FHF_WHALL_EXPO_FLAG": 220,
                "HDR_FACE_PYR_LIGHT_PROTECT_THRES": 220,
                "HDR_FACE_PYR_DARK_PROTECT_THRES": 65,
                "FHF_BODY_MASK_GF_SIZE": 5,
                "HF_BODY_MASK_BLEND_RATIO": 0.7,
                "TM_FACE_CONTRAST_DEGREE": 0.8,
                "TM_FACE_BRIGHTAREA_DETAILS_ENHANCE_RATIO": 0.8,
                "TM_FACE_DARKAREA_DETAILS_ENHANCE_RATIO": 1.0,
                "FHF_FACE_FOREGROUND_BRIGHTEN_RATIO": 1.0
            },
            "PROFILE_6": {
                "HDR_FACE_PYR_DARKEN_RATIO": 0.0,
                "FHF_FACE_LOW_CORRECTION_STRENGTH": 0.0,
                "FHF_FACE_TWO_FUSION_GF_SIZE": 15,
                "HDR_FACE_WALL_OVER_EXPO_THRES": 245,
                "FHF_WHITE_WALL_LIGHTEN_RATIO": 1.0,
                "FHF_WHALL_EXPO_FLAG": 220,
                "HDR_FACE_PYR_LIGHT_PROTECT_THRES": 220,
                "HDR_FACE_PYR_DARK_PROTECT_THRES": 65,
                "FHF_BODY_MASK_GF_SIZE": 10,
                "HF_BODY_MASK_BLEND_RATIO": 0.7,
                "TM_FACE_CONTRAST_DEGREE": 0.8,
                "TM_FACE_BRIGHTAREA_DETAILS_ENHANCE_RATIO": 0.8,
                "TM_FACE_DARKAREA_DETAILS_ENHANCE_RATIO": 1.0,
                "FHF_FACE_FOREGROUND_BRIGHTEN_RATIO": 1.0
            }
        },
        "REAR_MAIN_1": {
            "HEAD_INFO": {
                "TRIGGER_GAIN_1": 50,
                "TRIGGER_GAIN_2": 60,
                "TRIGGER_GAIN_3": 70,
                "TRIGGER_GAIN_4": 85,
                "TRIGGER_GAIN_5": 100,
                "TRIGGER_GAIN_6": 115
            },
            "PROFILE_1": {
                "HFS_UNDER_EXPOSURE_AREA": 0.8,
                "HFS_OVER_EXPOSURE_AREA": 1e-06,
                "HFS_UNDER_EXPOSURE_THRES": 20,
                "HFS_OVER_EXPOSURE_THRES": 180,
                "HFS_FACE_UNDER_EXPOSURE_AREA": 0.6,
                "HFS_FACE_OVER_EXPOSURE_AREA": 1e-05,
                "HFS_FACE_UNDER_EXPOSURE_THRES": 80,
                "HFS_FACE_OVER_EXPOSURE_THRES": 230,
                "HFS_VAL_EDGE_THRESH": 1e-05,
                "HDR_PYR_LIGHTEN_RATIO": 0.0,
                "HDR_PYR_DARKEN_RATIO": 0.0,
                "HGD_FIRST_THRESHOLD": 0.7,
                "HGD_DILATE_SIZE": 15,
                "HGD_GAUSSIAN_WINDOW_SIZE": 15,
                "HGD_RESIZE_SCALE": 8,
                "ALIGN_MOVE_THRES": 200,
                "FLOW_MOVE_THRES": 8,
                "FLOW_DIF_THRES": 4,
                "FHF_TWO_FUSION_GF_SIZE": 15,
                "HDR_WALL_OVER_EXPO_THRES": 252,
                "HDR_PYR_LIGHT_PROTECT_THRES": 200,
                "HDR_PYR_DARK_PROTECT_THRES": 35,
                "FHF_LOW_CORRECTION_STRENGTH": 0.0,
                "FHF_FACE_LOW_CORRECTION_STRENGTH": 0.8,
                "HDR_FACE_PYR_LIGHTEN_RATIO": 0.0,
                "HDR_FACE_PYR_DARKEN_RATIO": 0.0,
                "FHF_FACE_TWO_FUSION_GF_SIZE": 15,
                "HDR_FACE_WALL_OVER_EXPO_THRES": 250,
                "FHF_WHITE_WALL_LIGHTEN_RATIO": 1.0,
                "FHF_WHALL_EXPO_FLAG": 250,
                "HDR_FACE_PYR_LIGHT_PROTECT_THRES": 200,
                "HDR_FACE_PYR_DARK_PROTECT_THRES": 90,
                "FHF_BODY_MASK_GF_SIZE": 10,
                "HF_BODY_MASK_BLEND_RATIO": 1.0,
                "FHF_COLOR_ADJUST_STRENGTH": 0.0,
                "TM_SATURATION_ADJUST_RATIO": 0.0,
                "TM_HL_SATURATION_ADJUST_RATIO": 0.0,
                "TM_CONTRAST_DEGREE": 0.5,
                "TM_BRIGHTAREA_DETAILS_ENHANCE_RATIO": 0.5,
                "TM_DARKAREA_DETAILS_ENHANCE_RATIO": 1.0,
                "FHF_FOREGROUND_BRIGHTEN_RATIO": 1.0,
                "TM_FACE_CONTRAST_DEGREE": 0.4,
                "TM_FACE_SATURATION_ADJUST_RATIO": 0.0,
                "TM_FACE_HL_SATURATION_ADJUST_RATIO": 0.0,
                "TM_FACE_BRIGHTAREA_DETAILS_ENHANCE_RATIO": 1.0,
                "TM_FACE_DARKAREA_DETAILS_ENHANCE_RATIO": 0.95,
                "FHF_FACE_FOREGROUND_BRIGHTEN_RATIO": 1.0,
                "FUSION_INTENSITY": 0.23,
                "YDENOISE_HF": 0.2,
                "YDENOISE_MF": 0.1,
                "YDENOISE_LF": 0.1,
                "UVDENOISE_INTENSITY": 0.2,
                "SHARPEN_INTENSITY": 0.42
            },
            "PROFILE_2": {
                "HFS_UNDER_EXPOSURE_AREA": 0.1,
                "HFS_OVER_EXPOSURE_AREA": 1e-06,
                "HFS_UNDER_EXPOSURE_THRES": 25,
                "HFS_OVER_EXPOSURE_THRES": 160,
                "HFS_FACE_UNDER_EXPOSURE_AREA": 0.5,
                "HFS_FACE_OVER_EXPOSURE_AREA": 0.001,
                "HFS_FACE_UNDER_EXPOSURE_THRES": 40,
                "HFS_FACE_OVER_EXPOSURE_THRES": 220,
                "HFS_VAL_EDGE_THRESH": 1e-05,
                "HDR_FACE_PYR_LIGHT_PROTECT_THRES": 210,
                "HDR_FACE_PYR_DARK_PROTECT_THRES": 130,
                "HDR_FACE_PYR_LIGHTEN_RATIO": 0.0,
                "HDR_FACE_PYR_DARKEN_RATIO": 0.1,
                "FHF_FACE_TWO_FUSION_GF_SIZE": 15,
                "HDR_FACE_WALL_OVER_EXPO_THRES": 245,
                "FHF_WHITE_WALL_LIGHTEN_RATIO": 1.0,
                "FHF_WHALL_EXPO_FLAG": 250,
                "TM_SATURATION_ADJUST_RATIO": 0.0,
                "TM_HL_SATURATION_ADJUST_RATIO": 0.0,
                "TM_CONTRAST_DEGREE": 0.6,
                "TM_BRIGHTAREA_DETAILS_ENHANCE_RATIO": 1.0,
                "TM_DARKAREA_DETAILS_ENHANCE_RATIO": 0.9,
                "FHF_FOREGROUND_BRIGHTEN_RATIO": 1.0,
                "TM_FACE_CONTRAST_DEGREE": 0.4,
                "TM_FACE_SATURATION_ADJUST_RATIO": 0.0,
                "TM_FACE_HL_SATURATION_ADJUST_RATIO": 0.0,
                "TM_FACE_BRIGHTAREA_DETAILS_ENHANCE_RATIO": 0.9,
                "TM_FACE_DARKAREA_DETAILS_ENHANCE_RATIO": 0.82,
                "FHF_FACE_FOREGROUND_BRIGHTEN_RATIO": 1.0
            },
            "PROFILE_3": {
                "HFS_UNDER_EXPOSURE_AREA": 0.001,
                "HFS_OVER_EXPOSURE_AREA": 1e-06,
                "HFS_UNDER_EXPOSURE_THRES": 25,
                "HFS_OVER_EXPOSURE_THRES": 200,
                "HFS_FACE_UNDER_EXPOSURE_AREA": 0.5,
                "HFS_FACE_OVER_EXPOSURE_AREA": 0.001,
                "HFS_FACE_UNDER_EXPOSURE_THRES": 40,
                "HFS_FACE_OVER_EXPOSURE_THRES": 230,
                "HFS_VAL_EDGE_THRESH": 1e-05,
                "HDR_PYR_LIGHT_PROTECT_THRES": 200,
                "HDR_PYR_DARK_PROTECT_THRES": 45,
                "HDR_FACE_PYR_DARKEN_RATIO": 0.0,
                "FHF_FACE_TWO_FUSION_GF_SIZE": 15,
                "HDR_FACE_WALL_OVER_EXPO_THRES": 200,
                "FHF_WHITE_WALL_LIGHTEN_RATIO": 1.0,
                "FHF_WHALL_EXPO_FLAG": 250,
                "HDR_FACE_PYR_LIGHT_PROTECT_THRES": 220,
                "HDR_FACE_PYR_DARK_PROTECT_THRES": 130,
                "TM_SATURATION_ADJUST_RATIO": 0.0,
                "TM_HL_SATURATION_ADJUST_RATIO": 0.0,
                "TM_CONTRAST_DEGREE": 0.6,
                "TM_BRIGHTAREA_DETAILS_ENHANCE_RATIO": 0.3,
                "TM_DARKAREA_DETAILS_ENHANCE_RATIO": 1.0,
                "FHF_FOREGROUND_BRIGHTEN_RATIO": 1.0,
                "TM_FACE_CONTRAST_DEGREE": 0.4,
                "TM_FACE_SATURATION_ADJUST_RATIO": 0.0,
                "TM_FACE_HL_SATURATION_ADJUST_RATIO": 0.0,
                "TM_FACE_BRIGHTAREA_DETAILS_ENHANCE_RATIO": 1.0,
                "TM_FACE_DARKAREA_DETAILS_ENHANCE_RATIO": 0.8,
                "FHF_FACE_FOREGROUND_BRIGHTEN_RATIO": 1.0
            },
            "PROFILE_4": {
                "HFS_UNDER_EXPOSURE_AREA": 0.04,
                "HFS_OVER_EXPOSURE_AREA": 1e-05,
                "HFS_UNDER_EXPOSURE_THRES": 20,
                "HFS_OVER_EXPOSURE_THRES": 200,
                "HFS_FACE_UNDER_EXPOSURE_AREA": 0.5,
                "HFS_FACE_OVER_EXPOSURE_AREA": 0.001,
                "HFS_FACE_UNDER_EXPOSURE_THRES": 70,
                "HFS_FACE_OVER_EXPOSURE_THRES": 220,
                "HFS_VAL_EDGE_THRESH": 1e-05,
                "HDR_PYR_LIGHT_PROTECT_THRES": 200,
                "HDR_PYR_DARK_PROTECT_THRES": 80,
                "HDR_FACE_PYR_LIGHTEN_RATIO": 0.0,
                "HDR_FACE_PYR_DARKEN_RATIO": 0.0,
                "FHF_FACE_TWO_FUSION_GF_SIZE": 15,
                "HDR_FACE_WALL_OVER_EXPO_THRES": 250,
                "FHF_WHITE_WALL_LIGHTEN_RATIO": 1.0,
                "FHF_WHALL_EXPO_FLAG": 250,
                "HDR_FACE_PYR_LIGHT_PROTECT_THRES": 230,
                "HDR_FACE_PYR_DARK_PROTECT_THRES": 100,
                "TM_SATURATION_ADJUST_RATIO": 0.0,
                "TM_HL_SATURATION_ADJUST_RATIO": 0.0,
                "TM_CONTRAST_DEGREE": 0.5,
                "TM_BRIGHTAREA_DETAILS_ENHANCE_RATIO": 0.5,
                "TM_DARKAREA_DETAILS_ENHANCE_RATIO": 0.83,
                "FHF_FOREGROUND_BRIGHTEN_RATIO": 1.0,
                "TM_FACE_CONTRAST_DEGREE": 0.3,
                "TM_FACE_SATURATION_ADJUST_RATIO": 0.0,
                "TM_FACE_HL_SATURATION_ADJUST_RATIO": 0.0,
                "TM_FACE_BRIGHTAREA_DETAILS_ENHANCE_RATIO": 0.8,
                "TM_FACE_DARKAREA_DETAILS_ENHANCE_RATIO": 0.9,
                "FHF_FACE_FOREGROUND_BRIGHTEN_RATIO": 1.0
            },
            "PROFILE_5": {
                "HFS_UNDER_EXPOSURE_AREA": 0.001,
                "HFS_OVER_EXPOSURE_AREA": 1e-05,
                "HFS_UNDER_EXPOSURE_THRES": 60,
                "HFS_OVER_EXPOSURE_THRES": 200,
                "HFS_FACE_UNDER_EXPOSURE_AREA": 0.5,
                "HFS_FACE_OVER_EXPOSURE_AREA": 0.001,
                "HFS_FACE_UNDER_EXPOSURE_THRES": 70,
                "HFS_FACE_OVER_EXPOSURE_THRES": 220,
                "HFS_VAL_EDGE_THRESH": 1e-05,
                "HDR_PYR_LIGHT_PROTECT_THRES": 200,
                "HDR_PYR_DARK_PROTECT_THRES": 80,
                "HDR_FACE_PYR_LIGHTEN_RATIO": 0.0,
                "HDR_FACE_PYR_DARKEN_RATIO": 0.0,
                "FHF_FACE_TWO_FUSION_GF_SIZE": 15,
                "HDR_FACE_WALL_OVER_EXPO_THRES": 250,
                "FHF_WHITE_WALL_LIGHTEN_RATIO": 1.0,
                "FHF_WHALL_EXPO_FLAG": 250,
                "HDR_FACE_PYR_LIGHT_PROTECT_THRES": 230,
                "HDR_FACE_PYR_DARK_PROTECT_THRES": 100,
                "TM_SATURATION_ADJUST_RATIO": 0.0,
                "TM_HL_SATURATION_ADJUST_RATIO": 0.0,
                "TM_CONTRAST_DEGREE": 0.5,
                "TM_BRIGHTAREA_DETAILS_ENHANCE_RATIO": 0.8,
                "TM_DARKAREA_DETAILS_ENHANCE_RATIO": 0.9,
                "FHF_FOREGROUND_BRIGHTEN_RATIO": 1.0,
                "TM_FACE_CONTRAST_DEGREE": 0.5,
                "TM_FACE_SATURATION_ADJUST_RATIO": 0.0,
                "TM_FACE_HL_SATURATION_ADJUST_RATIO": 0.0,
                "TM_FACE_BRIGHTAREA_DETAILS_ENHANCE_RATIO": 0.8,
                "TM_FACE_DARKAREA_DETAILS_ENHANCE_RATIO": 0.9,
                "FHF_FACE_FOREGROUND_BRIGHTEN_RATIO": 1.0
            },
            "PROFILE_6": {
                "HFS_UNDER_EXPOSURE_AREA": 0.001,
                "HFS_OVER_EXPOSURE_AREA": 1e-05,
                "HFS_UNDER_EXPOSURE_THRES": 60,
                "HFS_OVER_EXPOSURE_THRES": 200,
                "HFS_FACE_UNDER_EXPOSURE_AREA": 0.5,
                "HFS_FACE_OVER_EXPOSURE_AREA": 0.001,
                "HFS_FACE_UNDER_EXPOSURE_THRES": 70,
                "HFS_FACE_OVER_EXPOSURE_THRES": 220,
                "HFS_VAL_EDGE_THRESH": 1e-05,
                "HDR_PYR_LIGHT_PROTECT_THRES": 200,
                "HDR_PYR_DARK_PROTECT_THRES": 80,
                "HDR_FACE_PYR_LIGHTEN_RATIO": 0.0,
                "HDR_FACE_PYR_DARKEN_RATIO": 0.0,
                "FHF_FACE_TWO_FUSION_GF_SIZE": 15,
                "HDR_FACE_WALL_OVER_EXPO_THRES": 250,
                "FHF_WHITE_WALL_LIGHTEN_RATIO": 1.0,
                "FHF_WHALL_EXPO_FLAG": 250,
                "HDR_FACE_PYR_LIGHT_PROTECT_THRES": 240,
                "HDR_FACE_PYR_DARK_PROTECT_THRES": 120,
                "TM_SATURATION_ADJUST_RATIO": 0.0,
                "TM_HL_SATURATION_ADJUST_RATIO": 0.0,
                "TM_CONTRAST_DEGREE": 0.5,
                "TM_BRIGHTAREA_DETAILS_ENHANCE_RATIO": 0.9,
                "TM_DARKAREA_DETAILS_ENHANCE_RATIO": 0.9,
                "FHF_FOREGROUND_BRIGHTEN_RATIO": 1.0,
                "TM_FACE_CONTRAST_DEGREE": 0.5,
                "TM_FACE_SATURATION_ADJUST_RATIO": 0.0,
                "TM_FACE_HL_SATURATION_ADJUST_RATIO": 0.0,
                "TM_FACE_BRIGHTAREA_DETAILS_ENHANCE_RATIO": 0.4,
                "TM_FACE_DARKAREA_DETAILS_ENHANCE_RATIO": 1.0,
                "FHF_FACE_FOREGROUND_BRIGHTEN_RATIO": 1.0
            }
        },
        "REAR_WIDE_1": {
            "HEAD_INFO": {
                "TRIGGER_GAIN_1": 50,
                "TRIGGER_GAIN_2": 80,
                "TRIGGER_GAIN_3": 100,
                "TRIGGER_GAIN_4": 115,
                "TRIGGER_GAIN_5": 140,
                "TRIGGER_GAIN_6": 160
            },
            "PROFILE_1": {
                "HFS_UNDER_EXPOSURE_AREA": 0.8,
                "HFS_OVER_EXPOSURE_AREA": 1e-06,
                "HFS_UNDER_EXPOSURE_THRES": 20,
                "HFS_OVER_EXPOSURE_THRES": 180,
                "HFS_FACE_UNDER_EXPOSURE_AREA": 0.5,
                "HFS_FACE_OVER_EXPOSURE_AREA": 0.001,
                "HFS_FACE_UNDER_EXPOSURE_THRES": 40,
                "HFS_FACE_OVER_EXPOSURE_THRES": 210,
                "HFS_VAL_EDGE_THRESH": 1e-05,
                "HDR_PYR_LIGHTEN_RATIO": 0.0,
                "HDR_PYR_DARKEN_RATIO": 0.0,
                "HGD_FIRST_THRESHOLD": 0.7,
                "HGD_DILATE_SIZE": 15,
                "HGD_GAUSSIAN_WINDOW_SIZE": 15,
                "ALIGN_MOVE_THRES": 200,
                "FLOW_MOVE_THRES": 20,
                "FLOW_DIF_THRES": 10,
                "FHF_TWO_FUSION_GF_SIZE": 15,
                "HDR_WALL_OVER_EXPO_THRES": 252,
                "HDR_PYR_LIGHT_PROTECT_THRES": 180,
                "HDR_PYR_DARK_PROTECT_THRES": 45,
                "FHF_LOW_CORRECTION_STRENGTH": 0.0,
                "FHF_FACE_LOW_CORRECTION_STRENGTH": 0.8,
                "HDR_FACE_PYR_LIGHTEN_RATIO": 0.0,
                "HDR_FACE_PYR_DARKEN_RATIO": 0.35,
                "FHF_FACE_TWO_FUSION_GF_SIZE": 15,
                "HDR_FACE_WALL_OVER_EXPO_THRES": 230,
                "FHF_WHITE_WALL_LIGHTEN_RATIO": 1.0,
                "FHF_WHALL_EXPO_FLAG": 250,
                "HDR_FACE_PYR_LIGHT_PROTECT_THRES": 210,
                "HDR_FACE_PYR_DARK_PROTECT_THRES": 100,
                "FHF_BODY_MASK_GF_SIZE": 10,
                "HF_BODY_MASK_BLEND_RATIO": 1.0,
                "FHF_COLOR_ADJUST_STRENGTH": 0.3,
                "TM_SATURATION_ADJUST_RATIO": 0.0,
                "TM_HL_SATURATION_ADJUST_RATIO": 0.0,
                "TM_CONTRAST_DEGREE": 0.5,
                "TM_BRIGHTAREA_DETAILS_ENHANCE_RATIO": 0.7,
                "TM_DARKAREA_DETAILS_ENHANCE_RATIO": 1.0,
                "FHF_FOREGROUND_BRIGHTEN_RATIO": 1.0,
                "TM_FACE_CONTRAST_DEGREE": 0.6,
                "TM_FACE_SATURATION_ADJUST_RATIO": 0.0,
                "TM_FACE_HL_SATURATION_ADJUST_RATIO": 0.0,
                "TM_FACE_BRIGHTAREA_DETAILS_ENHANCE_RATIO": 0.6,
                "TM_FACE_DARKAREA_DETAILS_ENHANCE_RATIO": 0.9,
                "FHF_FACE_FOREGROUND_BRIGHTEN_RATIO": 1.0,
                "FUSION_INTENSITY": 0.23,
                "YDENOISE_HF": 0.2,
                "YDENOISE_MF": 0.1,
                "YDENOISE_LF": 0.1,
                "UVDENOISE_INTENSITY": 0.2,
                "SHARPEN_INTENSITY": 0.42
            },
            "PROFILE_2": {
                "HFS_UNDER_EXPOSURE_AREA": 0.1,
                "HFS_OVER_EXPOSURE_AREA": 1e-06,
                "HFS_UNDER_EXPOSURE_THRES": 25,
                "HFS_OVER_EXPOSURE_THRES": 160,
                "HFS_FACE_UNDER_EXPOSURE_AREA": 0.5,
                "HFS_FACE_OVER_EXPOSURE_AREA": 0.001,
                "HFS_FACE_UNDER_EXPOSURE_THRES": 40,
                "HFS_FACE_OVER_EXPOSURE_THRES": 220,
                "HFS_VAL_EDGE_THRESH": 1e-05,
                "HDR_FACE_PYR_LIGHT_PROTECT_THRES": 220,
                "HDR_FACE_PYR_DARK_PROTECT_THRES": 110,
                "HDR_FACE_PYR_LIGHTEN_RATIO": 0.0,
                "HDR_FACE_PYR_DARKEN_RATIO": 0.1,
                "FHF_FACE_TWO_FUSION_GF_SIZE": 15,
                "HDR_FACE_WALL_OVER_EXPO_THRES": 245,
                "FHF_WHITE_WALL_LIGHTEN_RATIO": 1.0,
                "FHF_WHALL_EXPO_FLAG": 250,
                "TM_SATURATION_ADJUST_RATIO": 0.0,
                "TM_HL_SATURATION_ADJUST_RATIO": 0.0,
                "TM_CONTRAST_DEGREE": 0.6,
                "TM_BRIGHTAREA_DETAILS_ENHANCE_RATIO": 1.0,
                "TM_DARKAREA_DETAILS_ENHANCE_RATIO": 0.9,
                "FHF_FOREGROUND_BRIGHTEN_RATIO": 1.0,
                "TM_FACE_CONTRAST_DEGREE": 0.5,
                "TM_FACE_BRIGHTAREA_DETAILS_ENHANCE_RATIO": 0.8,
                "TM_FACE_DARKAREA_DETAILS_ENHANCE_RATIO": 0.9,
                "FHF_FACE_FOREGROUND_BRIGHTEN_RATIO": 1.0
            },
            "PROFILE_3": {
                "HFS_UNDER_EXPOSURE_AREA": 0.001,
                "HFS_OVER_EXPOSURE_AREA": 1e-06,
                "HFS_UNDER_EXPOSURE_THRES": 25,
                "HFS_OVER_EXPOSURE_THRES": 140,
                "HFS_FACE_UNDER_EXPOSURE_AREA": 0.5,
                "HFS_FACE_OVER_EXPOSURE_AREA": 0.001,
                "HFS_FACE_UNDER_EXPOSURE_THRES": 40,
                "HFS_FACE_OVER_EXPOSURE_THRES": 200,
                "HFS_VAL_EDGE_THRESH": 1e-05,
                "HDR_PYR_LIGHT_PROTECT_THRES": 200,
                "HDR_PYR_DARK_PROTECT_THRES": 45,
                "HDR_FACE_PYR_DARKEN_RATIO": 0.0,
                "FHF_FACE_TWO_FUSION_GF_SIZE": 15,
                "HDR_FACE_WALL_OVER_EXPO_THRES": 240,
                "FHF_WHITE_WALL_LIGHTEN_RATIO": 1.0,
                "FHF_WHALL_EXPO_FLAG": 250,
                "HDR_FACE_PYR_LIGHT_PROTECT_THRES": 240,
                "HDR_FACE_PYR_DARK_PROTECT_THRES": 100,
                "TM_SATURATION_ADJUST_RATIO": 0.0,
                "TM_HL_SATURATION_ADJUST_RATIO": 0.0,
                "TM_CONTRAST_DEGREE": 0.6,
                "TM_BRIGHTAREA_DETAILS_ENHANCE_RATIO": 0.3,
                "TM_DARKAREA_DETAILS_ENHANCE_RATIO": 1.0,
                "FHF_FOREGROUND_BRIGHTEN_RATIO": 1.0,
                "TM_FACE_CONTRAST_DEGREE": 0.5,
                "TM_FACE_BRIGHTAREA_DETAILS_ENHANCE_RATIO": 0.7,
                "TM_FACE_DARKAREA_DETAILS_ENHANCE_RATIO": 0.9,
                "FHF_FACE_FOREGROUND_BRIGHTEN_RATIO": 1.0
            },
            "PROFILE_4": {
                "HFS_UNDER_EXPOSURE_AREA": 0.5,
                "HFS_OVER_EXPOSURE_AREA": 1e-05,
                "HFS_UNDER_EXPOSURE_THRES": 20,
                "HFS_OVER_EXPOSURE_THRES": 200,
                "HFS_FACE_UNDER_EXPOSURE_AREA": 0.5,
                "HFS_FACE_OVER_EXPOSURE_AREA": 0.001,
                "HFS_FACE_UNDER_EXPOSURE_THRES": 70,
                "HFS_FACE_OVER_EXPOSURE_THRES": 220,
                "HFS_VAL_EDGE_THRESH": 1e-05,
                "HDR_PYR_LIGHT_PROTECT_THRES": 240,
                "HDR_PYR_DARK_PROTECT_THRES": 100,
                "HDR_FACE_PYR_LIGHTEN_RATIO": 1.0,
                "HDR_FACE_PYR_DARKEN_RATIO": 0.0,
                "FHF_FACE_TWO_FUSION_GF_SIZE": 15,
                "HDR_FACE_WALL_OVER_EXPO_THRES": 250,
                "FHF_WHITE_WALL_LIGHTEN_RATIO": 1.0,
                "FHF_WHALL_EXPO_FLAG": 250,
                "HDR_FACE_PYR_LIGHT_PROTECT_THRES": 240,
                "HDR_FACE_PYR_DARK_PROTECT_THRES": 110,
                "TM_SATURATION_ADJUST_RATIO": 0.0,
                "TM_HL_SATURATION_ADJUST_RATIO": 0.0,
                "TM_CONTRAST_DEGREE": 0.5,
                "TM_BRIGHTAREA_DETAILS_ENHANCE_RATIO": 1.0,
                "TM_DARKAREA_DETAILS_ENHANCE_RATIO": 0.9,
                "FHF_FOREGROUND_BRIGHTEN_RATIO": 1.0,
                "TM_FACE_CONTRAST_DEGREE": 0.5,
                "TM_FACE_BRIGHTAREA_DETAILS_ENHANCE_RATIO": 0.8,
                "TM_FACE_DARKAREA_DETAILS_ENHANCE_RATIO": 1.0,
                "FHF_FACE_FOREGROUND_BRIGHTEN_RATIO": 1.0
            },
            "PROFILE_5": {
                "HFS_UNDER_EXPOSURE_AREA": 0.5,
                "HFS_OVER_EXPOSURE_AREA": 1e-05,
                "HFS_UNDER_EXPOSURE_THRES": 60,
                "HFS_OVER_EXPOSURE_THRES": 200,
                "HFS_FACE_UNDER_EXPOSURE_AREA": 0.5,
                "HFS_FACE_OVER_EXPOSURE_AREA": 0.001,
                "HFS_FACE_UNDER_EXPOSURE_THRES": 70,
                "HFS_FACE_OVER_EXPOSURE_THRES": 220,
                "HFS_VAL_EDGE_THRESH": 1e-05,
                "HDR_PYR_LIGHT_PROTECT_THRES": 240,
                "HDR_PYR_DARK_PROTECT_THRES": 100,
                "HDR_FACE_PYR_LIGHTEN_RATIO": 0.0,
                "HDR_FACE_PYR_DARKEN_RATIO": 0.0,
                "FHF_FACE_TWO_FUSION_GF_SIZE": 15,
                "HDR_FACE_WALL_OVER_EXPO_THRES": 250,
                "FHF_WHITE_WALL_LIGHTEN_RATIO": 1.0,
                "FHF_WHALL_EXPO_FLAG": 250,
                "HDR_FACE_PYR_LIGHT_PROTECT_THRES": 240,
                "HDR_FACE_PYR_DARK_PROTECT_THRES": 110,
                "TM_SATURATION_ADJUST_RATIO": 0.0,
                "TM_HL_SATURATION_ADJUST_RATIO": 0.0,
                "TM_CONTRAST_DEGREE": 0.5,
                "TM_BRIGHTAREA_DETAILS_ENHANCE_RATIO": 1.0,
                "TM_DARKAREA_DETAILS_ENHANCE_RATIO": 0.9,
                "FHF_FOREGROUND_BRIGHTEN_RATIO": 1.0,
                "TM_FACE_CONTRAST_DEGREE": 0.5,
                "TM_FACE_BRIGHTAREA_DETAILS_ENHANCE_RATIO": 0.7,
                "TM_FACE_DARKAREA_DETAILS_ENHANCE_RATIO": 0.9,
                "FHF_FACE_FOREGROUND_BRIGHTEN_RATIO": 1.0
            },
            "PROFILE_6": {
                "HFS_UNDER_EXPOSURE_AREA": 0.001,
                "HFS_OVER_EXPOSURE_AREA": 1e-05,
                "HFS_UNDER_EXPOSURE_THRES": 60,
                "HFS_OVER_EXPOSURE_THRES": 200,
                "HFS_FACE_UNDER_EXPOSURE_AREA": 0.5,
                "HFS_FACE_OVER_EXPOSURE_AREA": 0.001,
                "HFS_FACE_UNDER_EXPOSURE_THRES": 70,
                "HFS_FACE_OVER_EXPOSURE_THRES": 220,
                "HFS_VAL_EDGE_THRESH": 1e-05,
                "HDR_PYR_LIGHT_PROTECT_THRES": 240,
                "HDR_PYR_DARK_PROTECT_THRES": 100,
                "HDR_FACE_PYR_LIGHTEN_RATIO": 0.0,
                "HDR_FACE_PYR_DARKEN_RATIO": 0.0,
                "FHF_FACE_TWO_FUSION_GF_SIZE": 15,
                "HDR_FACE_WALL_OVER_EXPO_THRES": 250,
                "FHF_WHITE_WALL_LIGHTEN_RATIO": 1.0,
                "FHF_WHALL_EXPO_FLAG": 250,
                "HDR_FACE_PYR_LIGHT_PROTECT_THRES": 240,
                "HDR_FACE_PYR_DARK_PROTECT_THRES": 100,
                "TM_SATURATION_ADJUST_RATIO": 0.0,
                "TM_HL_SATURATION_ADJUST_RATIO": 0.0,
                "TM_CONTRAST_DEGREE": 0.5,
                "TM_BRIGHTAREA_DETAILS_ENHANCE_RATIO": 1.0,
                "TM_DARKAREA_DETAILS_ENHANCE_RATIO": 0.9,
                "FHF_FOREGROUND_BRIGHTEN_RATIO": 1.0,
                "TM_FACE_CONTRAST_DEGREE": 0.5,
                "TM_FACE_BRIGHTAREA_DETAILS_ENHANCE_RATIO": 0.6,
                "TM_FACE_DARKAREA_DETAILS_ENHANCE_RATIO": 1.0,
                "FHF_FACE_FOREGROUND_BRIGHTEN_RATIO": 1.0
            }
        }
    }
}