{
	"include_cols": [
		"dlinkUdpPktNum",
		"dlinkUdpPktLen",
		"uplinkUdpPktNum",
		"uplinkUdpPktLen"
	],
	"base_cols": [
		"dlinkUdpPktNum",
		"dlinkUdpPktLen",
		"uplinkUdpPktNum",
		"uplinkUdpPktLen"
	],
	"window_cols": [
		[
			"dlinkUdpPktNum",
			5,
			"mean"
		],
		[
			"dlinkUdpPktLen",
			5,
			"mean"
		],
		[
			"uplinkUdpPktNum",
			5,
			"mean"
		],
		[
			"uplinkUdpPktLen",
			5,
			"mean"
		],
		[
			"dlinkUdpPktNum",
			10,
			"mean"
		],
		[
			"dlinkUdpPktLen",
			10,
			"mean"
		],
		[
			"uplinkUdpPktNum",
			10,
			"mean"
		],
		[
			"uplinkUdpPktLen",
			10,
			"mean"
		],
		[
			"dlinkUdpPktNum",
			10,
			"max"
		],
		[
			"dlinkUdpPktLen",
			10,
			"max"
		],
		[
			"uplinkUdpPktNum",
			10,
			"max"
		],
		[
			"uplinkUdpPktLen",
			10,
			"max"
		],
		[
			"dlinkUdpPktNum",
			10,
			"min"
		],
		[
			"dlinkUdpPktLen",
			10,
			"min"
		],
		[
			"uplinkUdpPktNum",
			10,
			"min"
		],
		[
			"uplinkUdpPktLen",
			10,
			"min"
		],
		[
			"dlinkUdpPktNum",
			10,
			"mad"
		],
		[
			"dlinkUdpPktLen",
			10,
			"mad"
		],
		[
			"uplinkUdpPktNum",
			10,
			"mad"
		],
		[
			"uplinkUdpPktLen",
			10,
			"mad"
		]
	]
}