﻿{
    "order": 1,
    "lockScreenInfo": {
        "templateId": "10_double_illusion",
        "templateName": [
            {
                "region": "zh-rCN",
                "name": "双重幻境"
            },
            {
                "region": "en",
                "name": "Composite effect"
            }
        ],
        "thumbnailSrc": "10_preview_lockscreen.png",
        "originSrc": "10_origin.png",
        "cropSrc": "10_crop1.png",
        "decorateType": 3,
        "isDepthOfFieldSupported": true,
        "isDepthOfFieldOpened": true,
        "isDepthOfFieldBlurSupported": false,
        "layers": [
            {
                "id": "layer_origin",
                "type": 0,
                "src": "10_origin.png"
            },
            {
                "id": "layer_color",
                "type": 1,
                "colorPolicy": 1,
                "color": "#FFB8D1D9"
            },
            {
                "id": "layer_timer",
                "type": 3,
                "layout": 0,
                "font": "HonorDigits_InlineVF.ttf",
                "color": "#FF1B4A59",
                "colorPolicy": 4,
                "thickness": 10
            },
            {
                "id": "layer_crop",
                "type": 4,
                "src": "10_crop1.png"
            },
            {
                "id": "layer_overlay",
                "type": 5,
                "src": "10_src25.png"
            }
        ],
        "styles": [
            "双重幻境",
            "人物",
            "宠物"
        ],
        "overlayDecoReses": [
            {
                "colorId": "color01",
                "overlays": [
                    "10_src1.png",
                    "10_src2.png",
                    "10_src3.png"
                ]
            },
            {
                "colorId": "color02",
                "overlays": [
                    "10_src4.png",
                    "10_src5.png",
                    "10_src6.png"
                ]
            },
            {
                "colorId": "color03",
                "overlays": [
                    "10_src7.png",
                    "10_src8.png",
                    "10_src9.png"
                ]
            },
            {
                "colorId": "color04",
                "overlays": [
                    "10_src10.png",
                    "10_src11.png",
                    "10_src12.png"
                ]
            },
            {
                "colorId": "color05",
                "overlays": [
                    "10_src13.png",
                    "10_src14.png",
                    "10_src15.png"
                ]
            },
            {
                "colorId": "color06",
                "overlays": [
                    "10_src16.png",
                    "10_src17.png",
                    "10_src18.png"
                ]
            },
            {
                "colorId": "color07",
                "overlays": [
                    "10_src19.png",
                    "10_src20.png",
                    "10_src21.png"
                ]
            },
            {
                "colorId": "color08",
                "overlays": [
                    "10_src22.png",
                    "10_src23.png",
                    "10_src24.png"
                ]
            },
            {
                "colorId": "color09",
                "overlays": [
                    "10_src25.png",
                    "10_src26.png",
                    "10_src27.png"
                ]
            },
            {
                "colorId": "color10",
                "overlays": [
                    "10_src28.png",
                    "10_src29.png",
                    "10_src30.png"
                ]
            },
            {
                "colorId": "color11",
                "overlays": [
                    "10_src31.png",
                    "10_src32.png",
                    "10_src33.png"
                ]
            },
            {
                "colorId": "color12",
                "overlays": [
                    "10_src34.png",
                    "10_src35.png",
                    "10_src36.png"
                ]
            },
            {
                "colorId": "color13",
                "overlays": [
                    "10_src37.png",
                    "10_src38.png",
                    "10_src39.png"
                ]
            },
            {
                "colorId": "color14",
                "overlays": [
                    "10_src40.png",
                    "10_src41.png",
                    "10_src42.png"
                ]
            },
            {
                "colorId": "color15",
                "overlays": [
                    "10_src43.png",
                    "10_src44.png",
                    "10_src45.png"
                ]
            },
            {
                "colorId": "color16",
                "overlays": [
                    "10_src46.png",
                    "10_src47.png",
                    "10_src48.png"
                ]
            },
            {
                "colorId": "color17",
                "overlays": [
                    "10_src49.png",
                    "10_src50.png",
                    "10_src51.png"
                ]
            },
            {
                "colorId": "color18",
                "overlays": [
                    "10_src52.png",
                    "10_src53.png",
                    "10_src54.png"
                ]
            }
        ],
        "portraitDecoReses": [
            {
                "id": "portrait_res1",
                "src": "10_res1.png",
                "colorId": "color09",
                "originSrc": "10_origin.png",
                "cropSrc": "10_crop1.png"
            },
            {
                "id": "portrait_res2",
                "src": "10_res2.png",
                "colorId": "color05",
                "originSrc": "10_origin2.png",
                "cropSrc": "10_crop2.png"
            },
            {
                "id": "portrait_res3",
                "src": "10_res3.png",
                "colorId": "color01",
                "originSrc": "10_origin3.png",
                "cropSrc": "10_crop3.png"
            }
        ],
        "decorateColors": [
            {
                "id": "color01",
                "mainColor": "#FFD9B0AD",
                "timerColor": "#FF591E1B"
            },
            {
                "id": "color02",
                "mainColor": "#FFD9BCAD",
                "timerColor": "#FF59301B"
            },
            {
                "id": "color03",
                "mainColor": "#FFD9C7AD",
                "timerColor": "#FF59301B"
            },
            {
                "id": "color04",
                "mainColor": "#FFD9D2AD",
                "timerColor": "#FF59441B"
            },
            {
                "id": "color05",
                "mainColor": "#FFCED9AD",
                "timerColor": "#FF4A591B"
            },
            {
                "id": "color06",
                "mainColor": "#FFBFD9AD",
                "timerColor": "#FF35591B"
            },
            {
                "id": "color07",
                "mainColor": "#FFB8D9C3",
                "timerColor": "#FF1B5930"
            },
            {
                "id": "color08",
                "mainColor": "#FFB8D9D1",
                "timerColor": "#FF1B594A"
            },
            {
                "id": "color09",
                "mainColor": "#FFB8D1D9",
                "timerColor": "#FF1B4A59"
            },
            {
                "id": "color10",
                "mainColor": "#FFB8C6D9",
                "timerColor": "#FF1B3559"
            },
            {
                "id": "color11",
                "mainColor": "#FFB8BED9",
                "timerColor": "#FF1B2559"
            },
            {
                "id": "color12",
                "mainColor": "#FFBBB8D9",
                "timerColor": "#FF201B59"
            },
            {
                "id": "color13",
                "mainColor": "#FFC3B8D9",
                "timerColor": "#FF301B59"
            },
            {
                "id": "color14",
                "mainColor": "#FFCBB8D9",
                "timerColor": "#FF3F1B59"
            },
            {
                "id": "color15",
                "mainColor": "#FFD9B8D9",
                "timerColor": "#FF591B59"
            },
            {
                "id": "color16",
                "mainColor": "#FFD9B8C7",
                "timerColor": "#FF591B37"
            },
            {
                "id": "color17",
                "mainColor": "#FFBFB699",
                "timerColor": "#FF403820",
                "colorMatchType": 1
            },
            {
                "id": "color18",
                "mainColor": "#FFD0D2D9",
                "timerColor": "#FF2E2F33",
                "colorMatchType": 2
            }
        ]
    },
    "desktopInfo": {
        "templateId": "10_double_illusion",
        "groupImageRes": {
            "src": "10_origin.png"
        }
    }
}