{
  "beat": [
    0,256,576,800,960,1280,1504,1792,2048,2272,2592,2816,3040,3232,3616,3904,4160,4320,4512,4864,5024,5248,5440,5600,5760,6016,6304,6560,6752,6944,7104,7328,7552,7840,8256,8480,8736,8992,9216,9536,9920,10080,10496,10688,10848,11008,11168,11424,11584,11776,11936,12160,12320,12704,12864,13088,13280,13472,13632,13824,14016,14272,14432,14592,14752,14912,15136,15360,15520,15712,15872,16032,16256,16512,16672,16864,17024,17216,17408,17600,17760,17952,18144,18336,18496,18656,18880,19040,19200,19456,19648,19904,20064,20224,20416,20576,20736,20896,21056,21216,21376,21536,21760,21920,22112,22336,22528,22720,22976,23136,23360,23616,23872,24064,24384,24544,24704,24864,25024,25184,25536,25728,25920,26112,26304,26496,26656,26912,27104,27264,27520,27712,27872,28128,28352,28544,30038
    ],
  "beat_count": 137,
  "downbeat": [
    0,
    576,
    1504,
    2816,
    3904,
    6752,
    9536,
    10688,
    11776,
    12864,
    15136,
    17952,
    18880,
    21216,
    24064,
    26912,
    29952,
    30038
    ],
  "downbeat_count": 18
}