{
  "beat": [
    0,192,1248,1472,1696,2528,2848,3680,3968,4160,4960,5120,6112,6496,7264,7424,7648,7936,8576,8768,8928,9120,9824,11008,11232,11456,12288,12608,13440,13632,13984,14176,14400,14560,14720,14912,15072,15872,16128,16416,17152,17344,17600,18048,18304,18528,18688,18944,19584,19744,20032,20736,20928,21248,22016,22368,22560,22816,23168,23328,23520,23840,24448,24640,24864,25088,25632,25856,26144,26880,27072,27328,28160,28448,28608,29344,29600,29824,30023
    ],
  "beat_count": 79,
  "downbeat": [
    0,
    2528,
    6112,
    12288,
    17152,
    20736,
    26880,
    30023
    ],
  "downbeat_count": 8
}