长流	CMD
我	CMD
了	CMD
有	CMD
吗	CMD
不	CMD
今天	CMD
要听	CMD
公司	CMD
不想	CMD
学校	CMD
有没	CMD
深圳	CMD
车站	CMD
有人	CMD
之	CMD
预报	CMD
机票	CMD
坐	CMD
我吗	CMD
两	CMD
笨蛋	CMD
每	CMD
还在	CMD
主人	CMD
三年	CMD
学习	CMD
问	CMD
剧	CMD
节日	CMD
百度	CMD
天天	CMD
永远	CMD
最后	CMD
汽车	CMD
网	CMD
周	CMD
新闻	CMD
服务	CMD
生	CMD
有空	CMD
零零	CMD
办法	CMD
起	CMD
光棍	CMD
成都	CMD
昨晚	CMD
每天	CMD
高兴	CMD
听听	CMD
卖	CMD
感冒	CMD
陪我	CMD
不着	CMD
县	CMD
笑	CMD
老师	CMD
生气	CMD
他们	CMD
中心	CMD
不在	CMD
死	CMD
跟我	CMD
理我	CMD
了呢	CMD
机会	CMD
人都	CMD
把我	CMD
视频	CMD
关闭	CMD
成	CMD
最新	CMD
猪	CMD
提前	CMD
收	CMD
女孩	CMD
样子	CMD
我只	CMD
五十	CMD
功能	CMD
还要	CMD
总	CMD
我叫	CMD
清楚	CMD
其实	CMD
飞	CMD
李	CMD
不过	CMD
到我	CMD
武汉	CMD
机器	CMD
睡着	CMD
冷	CMD
推荐	CMD
反正	CMD
价格	CMD
祝福	CMD
爱我	CMD
空间	CMD
对我	CMD
西安	CMD
查找	CMD
地	CMD
离	CMD
人民	CMD
网站	CMD
聪明	CMD
可不	CMD
多久	CMD
宝宝	CMD
我很	CMD
刚刚	CMD
公交	CMD
考	CMD
新年	CMD
没事	CMD
元旦	CMD
移动	CMD
为我	CMD
我没	CMD
安全	CMD
送	CMD
十二	CMD
时	CMD
地址	CMD
翻	CMD
心	CMD
重庆	CMD
也没	CMD
消息	CMD
四川	CMD
本来	CMD
错	CMD
黄色	CMD
关于	CMD
全	CMD
我吧	CMD
喝	CMD
病	CMD
女生	CMD
取消	CMD
算	CMD
能不	CMD
会儿	CMD
日	CMD
交	CMD
要我	CMD
西	CMD
突然	CMD
寂寞	CMD
来自	CMD
书	CMD
活动	CMD
内容	CMD
肚子	CMD
室	CMD
节目	CMD
不知	CMD
真心	CMD
同学	CMD
讨厌	CMD
美	CMD
其	CMD
结果	CMD
至	CMD
美国	CMD
先	CMD
笨	CMD
石	CMD
发生	CMD
希	CMD
麻烦	CMD
快递	CMD
真的很	CMD
忘记	CMD
原来	CMD
都在	CMD
方式	CMD
太多	CMD
多长	CMD
直接	CMD
不接	CMD
想吃	CMD
也要	CMD
早晨	CMD
药	CMD
东	CMD
不说	CMD
发货	CMD
然后	CMD
重要	CMD
市场	CMD
那就	CMD
蛋	CMD
颜色	CMD
局	CMD
姐姐	CMD
情	CMD
金	CMD
我妈	CMD
我做	CMD
如	CMD
工资	CMD
前	CMD
自动	CMD
东莞	CMD
关掉	CMD
城	CMD
睡吧	CMD
眼睛	CMD
管理	CMD
科技	CMD
毕业	CMD
专业	CMD
我到	CMD
很多	CMD
演唱	CMD
非常	CMD
求	CMD
发送	CMD
就算	CMD
聊聊	CMD
河南	CMD
鬼	CMD
园	CMD
减肥	CMD
股票	CMD
平平	CMD
活	CMD
作业	CMD
删除	CMD
表	CMD
春节	CMD
有关	CMD
会不	CMD
联通	CMD
色球	CMD
距离	CMD
见面	CMD
我买	CMD
旅游	CMD
未来	CMD
卓	CMD
性	CMD
只要	CMD
着	CMD
滨	CMD
厉害	CMD
半	CMD
们	CMD
那些	CMD
交通	CMD
办公	CMD
IPHONE	CMD
变成	CMD
说不	CMD
温度	CMD
有多	CMD
头	CMD
冬至	CMD
计算	CMD
懂	CMD
地铁	CMD
厕所	CMD
汽	CMD
浏览	CMD
疼	CMD
全部	CMD
体育	CMD
不就	CMD
所谓	CMD
餐馆	CMD
解决	CMD
关心	CMD
主席	CMD
公园	CMD
亚	CMD
力	CMD
代表	CMD
教	CMD
国	CMD
中央	CMD
治疗	CMD
过我	CMD
都要	CMD
分	CMD
痛	CMD
比赛	CMD
不得	CMD
合适	CMD
木	CMD
不对	CMD
凤凰	CMD
正常	CMD
兴趣	CMD
胡	CMD
香港	CMD
饿	CMD
事吧	CMD
周围	CMD
肯德	CMD
明星	CMD
南昌	CMD
昨	CMD
公	CMD
赶紧	CMD
日语	CMD
输入	CMD
密码	CMD
工程	CMD
不睡	CMD
面	CMD
故	CMD
今日	CMD
人不	CMD
浙江	CMD
等我	CMD
合肥	CMD
属于	CMD
八岁	CMD
习近平	CMD
就没	CMD
欺负	CMD
国庆	CMD
有些	CMD
姑娘	CMD
南	CMD
就在	CMD
左右	CMD
早起	CMD
酒	CMD
实在	CMD
房子	CMD
看来	CMD
贵阳	CMD
星雨	CMD
能否	CMD
祝您	CMD
不同	CMD
逼	CMD
网吧	CMD
斗	CMD
江南	CMD
请我	CMD
虽然	CMD
费	CMD
农历	CMD
决定	CMD
我用	CMD
单位	CMD
很久	CMD
装	CMD
表白	CMD
称呼	CMD
乱	CMD
会在	CMD
不够	CMD
道为	CMD
购物	CMD
有雨	CMD
要到	CMD
次	CMD
贵州	CMD
赚钱	CMD
没吃	CMD
约会	CMD
人体	CMD
万	CMD
精神	CMD
父亲	CMD
诺基	CMD
滚	CMD
植物	CMD
摩托	CMD
站到	CMD
香	CMD
僵尸	CMD
山西	CMD
洛阳	CMD
寝室	CMD
控制	CMD
亲亲	CMD
相	CMD
老子	CMD
卫生	CMD
寻找	CMD
窝里	CMD
晓得	CMD
升起	CMD
试	CMD
提	CMD
转弯	CMD
楼主	CMD
更新	CMD
白天	CMD
地震	CMD
二三	CMD
几年	CMD
主	CMD
识别	CMD
作用	CMD
海口	CMD
都市	CMD
着呢	CMD
运会	CMD
富	CMD
泉州	CMD
都说	CMD
社	CMD
不爱	CMD
篮球	CMD
长得	CMD
我爸	CMD
军	CMD
长途	CMD
朱	CMD
徐州	CMD
主义	CMD
破	CMD
子座	CMD
最爱	CMD
等着	CMD
客运	CMD
要买	CMD
特	CMD
春	CMD
发来	CMD
愉快	CMD
规则	CMD
远	CMD
另	CMD
存在	CMD
智商	CMD
我玩	CMD
浪费	CMD
星星	CMD
浪漫	CMD
实验	CMD
舍	CMD
比我	CMD
孤单	CMD
式	CMD
饭吃	CMD
年级	CMD
看书	CMD
门票	CMD
培训	CMD
块	CMD
忙完	CMD
用卡	CMD
秀	CMD
脾气	CMD
喊我	CMD
产品	CMD
数据	CMD
升	CMD
不冷	CMD
集团	CMD
码	CMD
往	CMD
梦想	CMD
说明	CMD
题	CMD
减	CMD
身高	CMD
诚	CMD
人说	CMD
酒吧	CMD
姓名	CMD
MP	CMD
生人	CMD
复习	CMD
评论	CMD
美容	CMD
普通	CMD
使	CMD
快速	CMD
性格	CMD
维修	CMD
说呢	CMD
派	CMD
陕西	CMD
脑子	CMD
周边	CMD
特曼	CMD
没说	CMD
离我	CMD
既然	CMD
事件	CMD
草	CMD
经验	CMD
猪肉	CMD
他在	CMD
感动	CMD
元	CMD
福利	CMD
想买	CMD
五六	CMD
公主	CMD
空	CMD
唐诗	CMD
皇帝	CMD
夫妻	CMD
不如	CMD
泽东	CMD
老鼠	CMD
躺在	CMD
人类	CMD
属	CMD
不和	CMD
米	CMD
互	CMD
乖	CMD
叫做	CMD
主持	CMD
未	CMD
货	CMD
后面	CMD
他说	CMD
子都	CMD
咋办	CMD
彩	CMD
恭喜	CMD
直	CMD
玉	CMD
完美	CMD
LOVE	CMD
处女	CMD
红烧	CMD
人呢	CMD
零五	CMD
要发	CMD
陌	CMD
五百	CMD
人和	CMD
校区	CMD
骂	CMD
幽默	CMD
身	CMD
面积	CMD
动听	CMD
他不	CMD
炒	CMD
牛肉	CMD
企业	CMD
王菲	CMD
玩吧	CMD
相片	CMD
高铁	CMD
十年	CMD
机里	CMD
东北	CMD
蓝	CMD
快快	CMD
明明	CMD
科学	CMD
二百	CMD
宽带	CMD
才不	CMD
几次	CMD
名单	CMD
套	CMD
认真	CMD
也会	CMD
古代	CMD
傻子	CMD
没到	CMD
自由	CMD
催眠	CMD
分享	CMD
狮	CMD
九七	CMD
很不	CMD
游记	CMD
招	CMD
名叫	CMD
会吗	CMD
检查	CMD
汇	CMD
又没	CMD
物流	CMD
躺	CMD
觉	CMD
分数	CMD
嘞	CMD
数	CMD
郭	CMD
认	CMD
九五	CMD
最炫	CMD
可惜	CMD
挂	CMD
失败	CMD
天水	CMD
喜不	CMD
纸	CMD
场	CMD
我饿	CMD
专卖	CMD
康	CMD
军训	CMD
牙	CMD
商城	CMD
郑	CMD
百科	CMD
任	CMD
喝多	CMD
光	CMD
脱	CMD
租	CMD
七日	CMD
领	CMD
愚人	CMD
勇士	CMD
书记	CMD
气冷	CMD
寄	CMD
对面	CMD
节课	CMD
原	CMD
见到	CMD
诺	CMD
秦	CMD
四级	CMD
假期	CMD
粉	CMD
悲伤	CMD
就想	CMD
五日	CMD
满	CMD
想过	CMD
六十	CMD
哇	CMD
随时	CMD
指	CMD
骗	CMD
抱	CMD
缘分	CMD
客气	CMD
动漫	CMD
郁闷	CMD
让人	CMD
利亚	CMD
男女	CMD
到来	CMD
专用	CMD
云	CMD
有看	CMD
丢	CMD
流氓	CMD
脑	CMD
并	CMD
不及	CMD
绝对	CMD
要跟	CMD
粥	CMD
骗我	CMD
找找	CMD
腊八	CMD
要再	CMD
就像	CMD
怕	CMD
加入	CMD
添加	CMD
送我	CMD
脚	CMD
切都	CMD
经过	CMD
有在	CMD
乡	CMD
二七	CMD
D	CMD
频道	CMD
晕	CMD
都能	CMD
蓝牙	CMD
介意	CMD
四五	CMD
清理	CMD
报告	CMD
不该	CMD
羊	CMD
兔子	CMD
梅	CMD
姨妈	CMD
养	CMD
佛山	CMD
失眠	CMD
六九	CMD
晚睡	CMD
抢	CMD
再过	CMD
能让	CMD
猪头	CMD
生病	CMD
杀	CMD
终极	CMD
日期	CMD
服装	CMD
理	CMD
生产	CMD
六日	CMD
状况	CMD
克	CMD
我心	CMD
何必	CMD
避孕	CMD
来说	CMD
常州	CMD
桌面	CMD
舞	CMD
果	CMD
各位	CMD
材料	CMD
按	CMD
二五	CMD
经历	CMD
葡萄	CMD
太累	CMD
白痴	CMD
早饭	CMD
优惠	CMD
客	CMD
也想	CMD
色情	CMD
场所	CMD
记忆	CMD
二六	CMD
美元	CMD
赢	CMD
天涯	CMD
要对	CMD
各种	CMD
无敌	CMD
都听	CMD
扣扣	CMD
八五	CMD
能干	CMD
麦当劳	CMD
耍	CMD
要把	CMD
周六	CMD
地理	CMD
丽	CMD
数字	CMD
总统	CMD
没来	CMD
结	CMD
关注	CMD
部分	CMD
购买	CMD
不清	CMD
特产	CMD
食品	CMD
面对	CMD
最快	CMD
王子	CMD
俊杰	CMD
如此	CMD
做到	CMD
抱抱	CMD
曾	CMD
团	CMD
重复	CMD
能吃	CMD
心疼	CMD
柴油	CMD
都睡	CMD
拯救	CMD
成语	CMD
吉林	CMD
丑	CMD
就能	CMD
若	CMD
戴	CMD
人要	CMD
混	CMD
环境	CMD
班车	CMD
谱	CMD
叔叔	CMD
逛街	CMD
业	CMD
瓶子	CMD
怪	CMD
心中	CMD
有何	CMD
温	CMD
公安	CMD
铁	CMD
日记	CMD
勇气	CMD
到时	CMD
的哦	CMD
子书	CMD
绵阳	CMD
天可	CMD
吹	CMD
也就	CMD
山市	CMD
喂	CMD
项目	CMD
买票	CMD
也很	CMD
高级	CMD
日程	CMD
期待	CMD
妹子	CMD
说对	CMD
我写	CMD
价钱	CMD
屁	CMD
作品	CMD
招呼	CMD
来找	CMD
此	CMD
有流	CMD
有过	CMD
待	CMD
同事	CMD
想干	CMD
八七	CMD
网游	CMD
疯狂	CMD
驾驶	CMD
额	CMD
疯	CMD
火线	CMD
亦菲	CMD
太笨	CMD
俩	CMD
古	CMD
来着	CMD
父母	CMD
沙	CMD
名称	CMD
别说	CMD
仙	CMD
女友	CMD
高手	CMD
居然	CMD
多高	CMD
姓	CMD
真实	CMD
玩玩	CMD
宠物	CMD
有病	CMD
亚洲	CMD
全球	CMD
欠	CMD
爱人	CMD
校园	CMD
人也	CMD
主演	CMD
腾	CMD
遵义	CMD
尾巴	CMD
跟他	CMD
表示	CMD
发条	CMD
龙江	CMD
事都	CMD
责任	CMD
运	CMD
启动	CMD
商务	CMD
七七	CMD
假如	CMD
万事	CMD
糟	CMD
悟空	CMD
食物	CMD
双节	CMD
周五	CMD
假日	CMD
纠结	CMD
蒙古	CMD
嫉妒	CMD
作者	CMD
公共	CMD
二八	CMD
人心	CMD
利	CMD
勿扰	CMD
泡	CMD
牛奶	CMD
莫	CMD
机能	CMD
足球	CMD
输	CMD
红色	CMD
我怕	CMD
喽	CMD
孕妇	CMD
桥	CMD
巧	CMD
阳	CMD
五天	CMD
赣州	CMD
从我	CMD
半夜	CMD
要带	CMD
招生	CMD
西游	CMD
头疼	CMD
泪	CMD
做些	CMD
承认	CMD
过节	CMD
聚会	CMD
不许	CMD
做错	CMD
粤语	CMD
逗	CMD
羽绒	CMD
网速	CMD
初	CMD
有爱	CMD
甲	CMD
忍者	CMD
可怕	CMD
店里	CMD
顺便	CMD
陪着	CMD
我请	CMD
舍得	CMD
今儿	CMD
里来	CMD
要脸	CMD
中考	CMD
日来	CMD
十天	CMD
几种	CMD
柳州	CMD
病毒	CMD
金刚	CMD
胸部	CMD
万岁	CMD
宇宙	CMD
人员	CMD
酱油	CMD
面试	CMD
初中	CMD
身材	CMD
时就	CMD
伤感	CMD
许嵩	CMD
那不	CMD
蔡依	CMD
文学	CMD
邓	CMD
女子	CMD
珠海	CMD
不玩	CMD
反	CMD
素	CMD
妇女	CMD
黑色	CMD
OK	CMD
辽宁	CMD
市区	CMD
南站	CMD
据说	CMD
义乌	CMD
格式	CMD
油	CMD
副	CMD
美图	CMD
敏感	CMD
杰	CMD
做过	CMD
准确	CMD
杯	CMD
动力	CMD
扬州	CMD
哎呀	CMD
真诚	CMD
章	CMD
十日	CMD
度过	CMD
貌似	CMD
圆	CMD
汤圆	CMD
三围	CMD
改成	CMD
共	CMD
提高	CMD
错过	CMD
第几	CMD
包括	CMD
股份	CMD
翅膀	CMD
有无	CMD
有缘	CMD
值	CMD
雅人	CMD
发烧	CMD
邓丽	CMD
盘	CMD
讨论	CMD
准时	CMD
长江	CMD
我生	CMD
精彩	CMD
思考	CMD
三九	CMD
顾问	CMD
路由	CMD
说些	CMD
入	CMD
根	CMD
批发	CMD
冻	CMD
组织	CMD
着急	CMD
后台	CMD
委屈	CMD
永恒	CMD
同样	CMD
重生	CMD
见识	CMD
朝阳	CMD
资格	CMD
真正	CMD
发过	CMD
设定	CMD
佳	CMD
千年	CMD
摸	CMD
国荣	CMD
怕我	CMD
我从	CMD
劳动	CMD
张翰	CMD
川	CMD
编码	CMD
学会	CMD
说错	CMD
婚前	CMD
猪猪	CMD
期末	CMD
扣	CMD
萝卜	CMD
为啥	CMD
女士	CMD
天来	CMD
不听	CMD
香蕉	CMD
修改	CMD
糊涂	CMD
温暖	CMD
预	CMD
种人	CMD
拒绝	CMD
都很	CMD
火影	CMD
友谊	CMD
平洋	CMD
李白	CMD
轻松	CMD
有种	CMD
书店	CMD
体重	CMD
战士	CMD
坏人	CMD
二手	CMD
拉萨	CMD
骗子	CMD
系列	CMD
教学	CMD
房产	CMD
梁静	CMD
明日	CMD
牡丹	CMD
巴马	CMD
早睡	CMD
理想	CMD
骗人	CMD
邮	CMD
蓝色	CMD
懒	CMD
人们	CMD
山寨	CMD
抽烟	CMD
途	CMD
邮编	CMD
钢琴	CMD
我的爱	CMD
盐城	CMD
俄	CMD
宋词	CMD
岳阳	CMD
肺	CMD
旅行	CMD
无论	CMD
敷衍	CMD
魔术	CMD
烧烤	CMD
步	CMD
柯南	CMD
句	CMD
烦恼	CMD
浩特	CMD
驰	CMD
文章	CMD
追求	CMD
得多	CMD
土	CMD
前面	CMD
趟	CMD
季节	CMD
共产	CMD
很忙	CMD
媛	CMD
嘻嘻	CMD
惹	CMD
像我	CMD
周日	CMD
我拿	CMD
第四	CMD
带来	CMD
存	CMD
史	CMD
杨幂	CMD
京	CMD
人人	CMD
刺激	CMD
千里	CMD
多钱	CMD
丝	CMD
似	CMD
等级	CMD
型	CMD
政策	CMD
茶	CMD
竟然	CMD
当前	CMD
那也	CMD
五七	CMD
单机	CMD
骂人	CMD
会很	CMD
文明	CMD
蛮	CMD
峰	CMD
违章	CMD
日文	CMD
诱惑	CMD
五三	CMD
专科	CMD
厚	CMD
付款	CMD
克力	CMD
排骨	CMD
眼里	CMD
就来	CMD
很烦	CMD
交流	CMD
娃娃	CMD
装备	CMD
时尚	CMD
不觉	CMD
登陆	CMD
功夫	CMD
零三	CMD
章节	CMD
二九	CMD
哈喽	CMD
请假	CMD
长城	CMD
评价	CMD
混蛋	CMD
设	CMD
会来	CMD
条路	CMD
用手	CMD
最贵	CMD
动作	CMD
秋天	CMD
房价	CMD
魅力	CMD
观看	CMD
精	CMD
十元	CMD
冰冰	CMD
期间	CMD
我干	CMD
事成	CMD
四日	CMD
陌生	CMD
耳机	CMD
完全	CMD
我得	CMD
基金	CMD
高潮	CMD
拜托	CMD
含	CMD
滋味	CMD
军事	CMD
预防	CMD
晴天	CMD
四百	CMD
羽	CMD
裸体	CMD
人多	CMD
说他	CMD
WAP	CMD
洗完	CMD
骑士	CMD
呃	CMD
凌晨	CMD
忍	CMD
位于	CMD
西班	CMD
关键	CMD
原则	CMD
九百	CMD
天河	CMD
尽快	CMD
并不	CMD
百元	CMD
谁能	CMD
周年	CMD
总理	CMD
保证	CMD
送到	CMD
穷	CMD
汽油	CMD
太冷	CMD
呆	CMD
鼻子	CMD
汪峰	CMD
零四	CMD
和谁	CMD
谈过	CMD
芜湖	CMD
红柿	CMD
周星	CMD
负责	CMD
瑞	CMD
租车	CMD
太不	CMD
穿梭	CMD
她在	CMD
忙吗	CMD
期中	CMD
命	CMD
复活	CMD
刚从	CMD
决赛	CMD
恶心	CMD
西站	CMD
工具	CMD
会玩	CMD
己	CMD
伦敦	CMD
天然	CMD
户口	CMD
会所	CMD
洋洋	CMD
字母	CMD
订票	CMD
随	CMD
熟悉	CMD
炫	CMD
轻	CMD
快捷	CMD
切糕	CMD
滚蛋	CMD
秋	CMD
海阔	CMD
湘潭	CMD
做完	CMD
国语	CMD
伞	CMD
要让	CMD
良心	CMD
新娘	CMD
四年	CMD
佛	CMD
杰克	CMD
何处	CMD
高跟	CMD
酒泉	CMD
盛	CMD
不靠	CMD
唱吧	CMD
只在	CMD
平方	CMD
苍井	CMD
日元	CMD
六分	CMD
心如	CMD
万圣	CMD
包头	CMD
屋	CMD
相关	CMD
堵车	CMD
蹲	CMD
立	CMD
说句	CMD
心都	CMD
四分	CMD
鸡鸡	CMD
订购	CMD
精灵	CMD
珠	CMD
总会	CMD
古诗	CMD
售价	CMD
魔女	CMD
就得	CMD
胜利	CMD
毛球	CMD
足彩	CMD
外星	CMD
侦探	CMD
五四	CMD
之际	CMD
也快	CMD
毕竟	CMD
爬山	CMD
桌	CMD
风流	CMD
西南	CMD
水平	CMD
谁在	CMD
高等	CMD
跟着	CMD
断	CMD
暖	CMD
霆锋	CMD
照常	CMD
当兵	CMD
民兵	CMD
冰	CMD
觉觉	CMD
饭馆	CMD
危害	CMD
几时	CMD
几度	CMD
闯	CMD
燕子	CMD
情绪	CMD
威	CMD
蜜	CMD
自知	CMD
头痛	CMD
恐龙	CMD
鞍山	CMD
奇	CMD
几日	CMD
司机	CMD
商丘	CMD
宇	CMD
坑	CMD
几条	CMD
奇迹	CMD
摄像	CMD
平顶	CMD
包容	CMD
现场	CMD
洋	CMD
火星	CMD
来吃	CMD
政局	CMD
门市	CMD
罗拉	CMD
板	CMD
瓜	CMD
相遇	CMD
做呢	CMD
野	CMD
箱	CMD
纽约	CMD
男友	CMD
允许	CMD
自私	CMD
四四	CMD
接到	CMD
收入	CMD
就够	CMD
把他	CMD
枪	CMD
郑爽	CMD
夜班	CMD
商品	CMD
人间	CMD
情侣	CMD
严	CMD
琴	CMD
浪	CMD
问道	CMD
面子	CMD
但我	CMD
用我	CMD
新婚	CMD
源	CMD
TO	CMD
跳舞	CMD
沈	CMD
组	CMD
从事	CMD
迷茫	CMD
湖人	CMD
光明	CMD
员工	CMD
厘米	CMD
松	CMD
欣	CMD
都做	CMD
寺	CMD
步骤	CMD
体会	CMD
份	CMD
难得	CMD
香烟	CMD
形成	CMD
鄙视	CMD
张雨	CMD
验证	CMD
进来	CMD
星级	CMD
某	CMD
敏	CMD
山区	CMD
灵	CMD
邮局	CMD
日前	CMD
长期	CMD
飞车	CMD
狗狗	CMD
索尼	CMD
鼻涕	CMD
想睡	CMD
兆	CMD
清除	CMD
球队	CMD
会让	CMD
承德	CMD
阅兵	CMD
爸	CMD
熟	CMD
乔	CMD
叫他	CMD
搬	CMD
针	CMD
冬季	CMD
前台	CMD
抓紧	CMD
裸照	CMD
泰州	CMD
白雪	CMD
新加	CMD
脱掉	CMD
午夜	CMD
瞎	CMD
虹桥	CMD
广元	CMD
完整	CMD
最火	CMD
漫游	CMD
本事	CMD
惠	CMD
有害	CMD
欠费	CMD
三级	CMD
金牛	CMD
规划	CMD
之类	CMD
助理	CMD
蘑菇	CMD
胸罩	CMD
操作	CMD
补偿	CMD
豆浆	CMD
猛烈	CMD
多吧	CMD
龚	CMD
练习	CMD
凡	CMD
窗	CMD
自助	CMD
落	CMD
柳	CMD
死人	CMD
替我	CMD
襄樊	CMD
主流	CMD
第十	CMD
玩到	CMD
会用	CMD
致	CMD
龙岗	CMD
科比	CMD
叔	CMD
实力	CMD
眼光	CMD
成年	CMD
西路	CMD
决不	CMD
利用	CMD
节奏	CMD
喝醉	CMD
事我	CMD
人睡	CMD
初三	CMD
轩	CMD
集合	CMD
住宿	CMD
确实	CMD
不愿	CMD
气象	CMD
激动	CMD
工厂	CMD
枝花	CMD
小V小V	CMD
国家电网	CMD
导航去公司	SFX
创建早上八点的闹钟	SFX
今天天气怎么样	SFX
查看明天的日程	SFX