﻿{
  "type": "fresh",
  "duration": 30000,
  "name": "Fresh",
  "id": "Fresh_30_1",
  "separationStep": 1710,
  "separationMinDuration": 5000,
  "separationMaxDuration": 10000,
  "transitions": [
    {
      "name": "叠化",
      "priority": 50,
      "pickCondition": -1,
      "horizon": true,
      "vertical": true
    },
    {
      "name": "模糊",
      "priority": 0,
      "pickCondition": -1,
      "horizon": true,
      "vertical": true
    },
    {
      "name": "融化",
      "priority": 0,
      "pickCondition": -1,
      "horizon": true,
      "vertical": true
    },
    {
      "name": "上移",
      "priority": 50,
      "pickCondition": -1,
      "horizon": true,
      "vertical": true
    },
    {
      "name": "下移",
      "priority": 50,
      "pickCondition": -1,
      "horizon": true,
      "vertical": true
    },
    {
      "name": "左移",
      "priority": 50,
      "pickCondition": -1,
      "horizon": true,
      "vertical": true
    },
    {
      "name": "右移",
      "priority": 50,
      "pickCondition": -1,
      "horizon": true,
      "vertical": true
    },
    {
      "name": "黑场",
      "priority": 70,
      "pickCondition": -1,
      "horizon": true,
      "vertical": true
    },
    {
      "name": "白场",
      "priority": 90,
      "pickCondition": 1,
      "horizon": true,
      "vertical": true
    },
    {
      "name": "放大",
      "priority": 90,
      "pickCondition": -1,
      "horizon": true,
      "vertical": true
    },
    {
      "name": "缩小",
      "priority": 90,
      "pickCondition": 2,
      "horizon": true,
      "vertical": true
    },
    {
      "name": "旋转",
      "priority": 0,
      "pickCondition": -1,
      "horizon": true,
      "vertical": true
    }
  ],
  "transitionMaxCount": 4,
  "filterId": "filter_res_13",
  "filterStrength": 0.3,
  "sticker": {},
  "borderId": "retro2",
  "specialEffect": [
    {
      "effectId": "light_spot",
      "effectStart": 0
    },
    {
      "effectId": "tindal_light",
      "effectStart": -1
    },
    {
      "effectId": "blingbling",
      "effectStart": -1
    }
  ],
  "tail": "honor_vlog"
}