#,version,,,,,,,,,,,,,,,,,,,,,,,,,,,,,,,,,,,,,,,,,,,,,,,,,,,,,,,
2022,11,7,4,,,,,,,,,,,,,,,,,,,,,,,,,,,,,,,,,,,,,,,,,,,,,,,,,,,,,
#,row_col_num,,,,,,,,,,,,,,,,,,,,,,,,,,,,,,,,,,,,,,,,,,,,,,,,,,,,,,,
39,18,,,,,,,,,,,,,,,,,,,,,,,,,,,,,,,,,,,,,,,,,,,,,,,,,,,,,,,
#,freq_noise,,,,,,,,,,,,,,,,,,,,,,,,,,,,,,,,,,,,,,,,,,,,,,,,,,,,,,,
-500,500,,,,,,,,,,,,,,,,,,,,,,,,,,,,,,,,,,,,,,,,,,,,,,,,,,,,,,,
#,raw_max,,,,,,,,,,,,,,,,,,,,,,,,,,,,,,,,,,,,,,,,,,,,,,,,,,,,,,,
20801,21148,21079,21275,20917,21205,21115,21180,21273,21188,21248,21325,21310,21369,21307,21276,21303,20481,,,,,,,,,,,,,,,,,,,,,,,,,,,,,,,,,,,,,,,
21343,21465,20955,21080,21154,21140,21445,21347,21433,21291,21179,21270,21154,21224,21352,21136,21340,21230,,,,,,,,,,,,,,,,,,,,,,,,,,,,,,,,,,,,,,,
21298,21151,21142,21116,21064,21061,21155,21161,21155,21155,21148,21140,21146,21149,21154,21182,21136,21185,,,,,,,,,,,,,,,,,,,,,,,,,,,,,,,,,,,,,,,
21317,21167,21175,21142,21159,21154,21156,21157,21151,21153,21149,21138,21146,21148,21164,21170,21135,21232,,,,,,,,,,,,,,,,,,,,,,,,,,,,,,,,,,,,,,,
21263,21120,21128,21103,21120,21117,21111,21112,21108,21110,21103,21097,21101,21106,21104,21112,21082,21186,,,,,,,,,,,,,,,,,,,,,,,,,,,,,,,,,,,,,,,
21356,21247,21257,21230,21243,21242,21239,21241,21240,21233,21225,21216,21239,21221,21217,21226,21204,21307,,,,,,,,,,,,,,,,,,,,,,,,,,,,,,,,,,,,,,,
21371,21270,21280,21254,21271,21267,21263,21269,21268,21258,21244,21239,21251,21243,21238,21244,21231,21326,,,,,,,,,,,,,,,,,,,,,,,,,,,,,,,,,,,,,,,
21352,21256,21268,21233,21254,21246,21252,21253,21250,21247,21236,21238,21240,21231,21234,21233,21205,21309,,,,,,,,,,,,,,,,,,,,,,,,,,,,,,,,,,,,,,,
21305,21220,21233,21199,21217,21208,21211,21214,21212,21215,21203,21197,21204,21198,21197,21200,21172,21268,,,,,,,,,,,,,,,,,,,,,,,,,,,,,,,,,,,,,,,
21291,21213,21225,21196,21214,21211,21212,21208,21206,21204,21196,21193,21204,21194,21198,21203,21177,21270,,,,,,,,,,,,,,,,,,,,,,,,,,,,,,,,,,,,,,,
21354,21291,21301,21276,21290,21283,21291,21293,21284,21284,21277,21268,21273,21272,21275,21288,21256,21348,,,,,,,,,,,,,,,,,,,,,,,,,,,,,,,,,,,,,,,
21272,21215,21230,21198,21210,21208,21218,21217,21216,21214,21203,21191,21201,21203,21211,21218,21246,21288,,,,,,,,,,,,,,,,,,,,,,,,,,,,,,,,,,,,,,,
21352,21311,21320,21288,21307,21303,21304,21305,21295,21302,21299,21294,21301,21296,21304,21315,21286,21376,,,,,,,,,,,,,,,,,,,,,,,,,,,,,,,,,,,,,,,
21386,21341,21348,21323,21348,21339,21342,21338,21333,21339,21336,21328,21334,21329,21344,21347,21324,21409,,,,,,,,,,,,,,,,,,,,,,,,,,,,,,,,,,,,,,,
21352,21322,21323,21302,21324,21320,21318,21318,21314,21322,21313,21307,21310,21316,21318,21322,21301,21384,,,,,,,,,,,,,,,,,,,,,,,,,,,,,,,,,,,,,,,
21282,21258,21268,21245,21272,21273,21267,21266,21260,21266,21260,21250,21260,21257,21260,21265,21247,21321,,,,,,,,,,,,,,,,,,,,,,,,,,,,,,,,,,,,,,,
21318,21257,21262,21249,21263,21270,21262,21261,21257,21268,21260,21253,21259,21252,21251,21262,21333,21356,,,,,,,,,,,,,,,,,,,,,,,,,,,,,,,,,,,,,,,
21269,21248,21266,21246,21267,21268,21266,21265,21265,21272,21270,21262,21268,21258,21263,21263,21242,21314,,,,,,,,,,,,,,,,,,,,,,,,,,,,,,,,,,,,,,,
21231,21214,21232,21219,21246,21243,21236,21235,21236,21250,21252,21239,21234,21221,21232,21234,21213,21294,,,,,,,,,,,,,,,,,,,,,,,,,,,,,,,,,,,,,,,
21263,21249,21268,21256,21288,21280,21273,21267,21267,21280,21274,21250,21255,21244,21250,21259,21246,21300,,,,,,,,,,,,,,,,,,,,,,,,,,,,,,,,,,,,,,,
21285,21275,21292,21278,21307,21303,21298,21287,21289,21302,21293,21280,21274,21269,21271,21283,21267,21321,,,,,,,,,,,,,,,,,,,,,,,,,,,,,,,,,,,,,,,
21272,21269,21289,21271,21300,21295,21291,21284,21287,21298,21290,21273,21270,21262,21274,21284,21267,21322,,,,,,,,,,,,,,,,,,,,,,,,,,,,,,,,,,,,,,,
21215,21224,21238,21225,21248,21247,21237,21234,21232,21245,21231,21222,21226,21217,21216,21233,21219,21270,,,,,,,,,,,,,,,,,,,,,,,,,,,,,,,,,,,,,,,
21176,21185,21205,21228,21216,21212,21210,21198,21197,21209,21205,21194,21198,21189,21189,21200,21186,21235,,,,,,,,,,,,,,,,,,,,,,,,,,,,,,,,,,,,,,,
21161,21176,21191,21181,21199,21199,21190,21182,21184,21197,21190,21187,21190,21182,21182,21197,21172,21225,,,,,,,,,,,,,,,,,,,,,,,,,,,,,,,,,,,,,,,
21158,21176,21292,21300,21203,21221,21185,21179,21182,21198,21188,21187,21193,21180,21183,21198,21180,21234,,,,,,,,,,,,,,,,,,,,,,,,,,,,,,,,,,,,,,,
21118,21146,21157,21148,21165,21155,21148,21147,21143,21158,21149,21147,21151,21146,21150,21170,21154,21194,,,,,,,,,,,,,,,,,,,,,,,,,,,,,,,,,,,,,,,
21214,21241,21259,21246,21260,21252,21251,21246,21247,21255,21247,21250,21252,21241,21252,21270,21257,21294,,,,,,,,,,,,,,,,,,,,,,,,,,,,,,,,,,,,,,,
21080,21103,21115,21109,21120,21124,21116,21109,21111,21116,21109,21106,21109,21105,21108,21127,21115,21141,,,,,,,,,,,,,,,,,,,,,,,,,,,,,,,,,,,,,,,
21101,21128,21174,21208,21145,21142,21140,21131,21136,21140,21141,21134,21140,21134,21139,21149,21141,21168,,,,,,,,,,,,,,,,,,,,,,,,,,,,,,,,,,,,,,,
21188,21223,21225,21214,21227,21221,21229,21218,21214,21223,21224,21225,21230,21224,21218,21234,21228,21246,,,,,,,,,,,,,,,,,,,,,,,,,,,,,,,,,,,,,,,
21191,21223,21235,21221,21233,21222,21227,21218,21220,21234,21236,21230,21235,21228,21231,21238,21239,21254,,,,,,,,,,,,,,,,,,,,,,,,,,,,,,,,,,,,,,,
21133,21166,21174,21165,21169,21169,21157,21153,21155,21178,21178,21168,21172,21169,21167,21184,21177,21192,,,,,,,,,,,,,,,,,,,,,,,,,,,,,,,,,,,,,,,
21105,21141,21149,21139,21148,21131,21131,21133,21141,21142,21148,21148,21150,21142,21146,21161,21157,21168,,,,,,,,,,,,,,,,,,,,,,,,,,,,,,,,,,,,,,,
21222,21247,21258,21253,21259,21243,21242,21247,21242,21252,21253,21259,21258,21259,21255,21268,21262,21267,,,,,,,,,,,,,,,,,,,,,,,,,,,,,,,,,,,,,,,
21209,21234,21243,21240,21253,21235,21232,21227,21230,21251,21251,21248,21260,21252,21252,21259,21255,21256,,,,,,,,,,,,,,,,,,,,,,,,,,,,,,,,,,,,,,,
21203,21261,21265,21255,21269,21256,21254,21263,21260,21266,21266,21266,21273,21273,21272,21281,21274,21244,,,,,,,,,,,,,,,,,,,,,,,,,,,,,,,,,,,,,,,
21399,21364,21416,21479,21447,21400,21299,21504,21271,21248,21398,21451,21531,21451,21413,21322,21520,21253,,,,,,,,,,,,,,,,,,,,,,,,,,,,,,,,,,,,,,,
20700,21227,21220,21329,21324,21232,21172,21115,21180,21179,21292,21287,21157,21300,21207,21213,21258,20407,,,,,,,,,,,,,,,,,,,,,,,,,,,,,,,,,,,,,,,
#,raw_min,,,,,,,,,,,,,,,,,,,,,,,,,,,,,,,,,,,,,,,,,,,,,,,,,,,,,,,
12481,12689,12647,12765,12550,12723,12669,12708,12763,12713,12749,12795,12786,12821,12784,12765,12781,12288,,,,,,,,,,,,,,,,,,,,,,,,,,,,,,,,,,,,,,,
12805,12879,12573,12648,12692,12684,12867,12808,12860,12774,12707,12762,12692,12734,12811,12681,12804,12738,,,,,,,,,,,,,,,,,,,,,,,,,,,,,,,,,,,,,,,
12779,12690,12685,12669,12638,12636,12693,12696,12693,12693,12689,12684,12688,12689,12692,12709,12681,12711,,,,,,,,,,,,,,,,,,,,,,,,,,,,,,,,,,,,,,,
12790,12700,12705,12685,12695,12692,12694,12694,12690,12692,12689,12682,12687,12688,12698,12702,12681,12739,,,,,,,,,,,,,,,,,,,,,,,,,,,,,,,,,,,,,,,
12758,12672,12677,12661,12672,12670,12666,12667,12664,12666,12662,12658,12660,12663,12662,12667,12649,12711,,,,,,,,,,,,,,,,,,,,,,,,,,,,,,,,,,,,,,,
12813,12748,12754,12738,12746,12745,12743,12745,12744,12740,12735,12730,12743,12732,12730,12735,12722,12784,,,,,,,,,,,,,,,,,,,,,,,,,,,,,,,,,,,,,,,
12822,12762,12768,12752,12762,12760,12757,12761,12761,12755,12746,12743,12751,12746,12743,12746,12738,12795,,,,,,,,,,,,,,,,,,,,,,,,,,,,,,,,,,,,,,,
12811,12754,12761,12739,12752,12748,12751,12751,12750,12748,12742,12743,12744,12738,12740,12740,12723,12785,,,,,,,,,,,,,,,,,,,,,,,,,,,,,,,,,,,,,,,
12783,12732,12739,12719,12730,12725,12726,12728,12727,12729,12722,12718,12722,12719,12718,12720,12703,12761,,,,,,,,,,,,,,,,,,,,,,,,,,,,,,,,,,,,,,,
12774,12728,12735,12718,12728,12727,12727,12724,12723,12722,12717,12716,12722,12716,12719,12722,12706,12762,,,,,,,,,,,,,,,,,,,,,,,,,,,,,,,,,,,,,,,
12812,12775,12781,12765,12774,12770,12774,12775,12770,12770,12766,12761,12764,12763,12765,12773,12753,12809,,,,,,,,,,,,,,,,,,,,,,,,,,,,,,,,,,,,,,,
12763,12729,12738,12718,12726,12724,12731,12730,12729,12728,12722,12714,12721,12722,12727,12731,12747,12772,,,,,,,,,,,,,,,,,,,,,,,,,,,,,,,,,,,,,,,
12811,12786,12792,12773,12784,12782,12782,12783,12777,12781,12779,12776,12781,12777,12782,12789,12772,12825,,,,,,,,,,,,,,,,,,,,,,,,,,,,,,,,,,,,,,,
12832,12804,12809,12794,12809,12803,12805,12802,12799,12803,12801,12797,12800,12797,12806,12808,12794,12845,,,,,,,,,,,,,,,,,,,,,,,,,,,,,,,,,,,,,,,
12811,12793,12794,12781,12794,12792,12790,12791,12788,12793,12787,12784,12786,12789,12791,12793,12780,12830,,,,,,,,,,,,,,,,,,,,,,,,,,,,,,,,,,,,,,,
12769,12755,12761,12747,12763,12764,12760,12759,12756,12759,12756,12750,12756,12754,12756,12759,12748,12792,,,,,,,,,,,,,,,,,,,,,,,,,,,,,,,,,,,,,,,
12790,12754,12757,12749,12758,12762,12757,12756,12754,12761,12756,12751,12755,12751,12751,12757,12799,12813,,,,,,,,,,,,,,,,,,,,,,,,,,,,,,,,,,,,,,,
12761,12748,12759,12747,12760,12761,12760,12759,12759,12763,12762,12757,12760,12755,12757,12758,12745,12788,,,,,,,,,,,,,,,,,,,,,,,,,,,,,,,,,,,,,,,
12738,12728,12739,12731,12747,12746,12742,12741,12741,12750,12751,12743,12740,12733,12739,12740,12728,12776,,,,,,,,,,,,,,,,,,,,,,,,,,,,,,,,,,,,,,,
12757,12749,12761,12753,12773,12768,12764,12760,12760,12768,12764,12750,12753,12746,12750,12755,12747,12780,,,,,,,,,,,,,,,,,,,,,,,,,,,,,,,,,,,,,,,
12771,12765,12775,12767,12784,12782,12778,12772,12773,12781,12776,12768,12764,12761,12763,12769,12760,12793,,,,,,,,,,,,,,,,,,,,,,,,,,,,,,,,,,,,,,,
12763,12761,12773,12762,12780,12777,12774,12770,12772,12778,12774,12764,12762,12757,12764,12770,12760,12793,,,,,,,,,,,,,,,,,,,,,,,,,,,,,,,,,,,,,,,
12729,12734,12743,12735,12748,12748,12742,12740,12739,12747,12738,12733,12736,12730,12729,12739,12731,12762,,,,,,,,,,,,,,,,,,,,,,,,,,,,,,,,,,,,,,,
12706,12711,12723,12737,12729,12727,12726,12719,12718,12725,12723,12716,12719,12713,12713,12720,12711,12741,,,,,,,,,,,,,,,,,,,,,,,,,,,,,,,,,,,,,,,
12696,12705,12715,12708,12719,12719,12714,12709,12710,12718,12714,12712,12714,12709,12709,12718,12703,12735,,,,,,,,,,,,,,,,,,,,,,,,,,,,,,,,,,,,,,,
12695,12706,12775,12780,12722,12732,12711,12707,12709,12719,12713,12712,12716,12708,12710,12718,12708,12740,,,,,,,,,,,,,,,,,,,,,,,,,,,,,,,,,,,,,,,
12671,12687,12694,12689,12699,12693,12688,12688,12685,12695,12689,12688,12690,12687,12690,12702,12692,12716,,,,,,,,,,,,,,,,,,,,,,,,,,,,,,,,,,,,,,,
12728,12744,12755,12747,12756,12751,12750,12748,12748,12753,12748,12750,12751,12745,12751,12762,12754,12776,,,,,,,,,,,,,,,,,,,,,,,,,,,,,,,,,,,,,,,
12648,12661,12669,12665,12672,12674,12670,12665,12666,12669,12665,12664,12665,12663,12665,12676,12669,12684,,,,,,,,,,,,,,,,,,,,,,,,,,,,,,,,,,,,,,,
12660,12676,12704,12725,12687,12685,12684,12678,12681,12684,12684,12680,12684,12680,12683,12689,12684,12701,,,,,,,,,,,,,,,,,,,,,,,,,,,,,,,,,,,,,,,
12712,12733,12735,12728,12736,12732,12737,12731,12728,12734,12734,12735,12738,12734,12731,12740,12737,12748,,,,,,,,,,,,,,,,,,,,,,,,,,,,,,,,,,,,,,,
12715,12734,12741,12732,12739,12733,12736,12731,12732,12740,12741,12738,12741,12736,12738,12743,12743,12752,,,,,,,,,,,,,,,,,,,,,,,,,,,,,,,,,,,,,,,
12679,12699,12704,12699,12701,12701,12694,12692,12693,12707,12706,12701,12703,12701,12700,12710,12706,12715,,,,,,,,,,,,,,,,,,,,,,,,,,,,,,,,,,,,,,,
12663,12684,12689,12683,12689,12678,12678,12679,12684,12685,12689,12689,12690,12685,12688,12697,12694,12701,,,,,,,,,,,,,,,,,,,,,,,,,,,,,,,,,,,,,,,
12733,12748,12755,12752,12755,12745,12745,12748,12745,12751,12752,12755,12754,12755,12753,12761,12757,12760,,,,,,,,,,,,,,,,,,,,,,,,,,,,,,,,,,,,,,,
12725,12740,12746,12744,12752,12741,12739,12736,12738,12751,12750,12749,12756,12751,12751,12755,12753,12753,,,,,,,,,,,,,,,,,,,,,,,,,,,,,,,,,,,,,,,
12722,12756,12759,12753,12761,12754,12752,12757,12756,12760,12760,12759,12764,12764,12763,12768,12764,12746,,,,,,,,,,,,,,,,,,,,,,,,,,,,,,,,,,,,,,,
12839,12818,12849,12887,12868,12840,12779,12902,12762,12748,12839,12871,12918,12870,12847,12793,12912,12751,,,,,,,,,,,,,,,,,,,,,,,,,,,,,,,,,,,,,,,
12420,12736,12732,12797,12794,12739,12703,12669,12708,12707,12775,12772,12694,12780,12724,12727,12754,12244,,,,,,,,,,,,,,,,,,,,,,,,,,,,,,,,,,,,,,,
#,raw_row_delta_max,,,,,,,,,,,,,,,,,,,,,,,,,,,,,,,,,,,,,,,,,,,,,,,,,,,,,,,
2400,1500,1500,1500,1500,1500,1500,1500,1500,1500,1500,1500,1500,1500,1500,1500,1500,2400,,,,,,,,,,,,,,,,,,,,,,,,,,,,,,,,,,,,,,,
800,1500,1500,1500,1500,1500,750,750,750,750,750,750,750,750,750,750,750,800,,,,,,,,,,,,,,,,,,,,,,,,,,,,,,,,,,,,,,,
650,650,650,650,650,650,650,650,650,650,650,650,650,650,650,650,650,650,,,,,,,,,,,,,,,,,,,,,,,,,,,,,,,,,,,,,,,
650,650,650,650,650,650,650,650,650,650,650,650,650,650,650,650,650,650,,,,,,,,,,,,,,,,,,,,,,,,,,,,,,,,,,,,,,,
650,650,650,650,650,650,650,650,650,650,650,650,650,650,650,650,650,650,,,,,,,,,,,,,,,,,,,,,,,,,,,,,,,,,,,,,,,
650,650,650,650,650,650,650,650,650,650,650,650,650,650,650,650,650,650,,,,,,,,,,,,,,,,,,,,,,,,,,,,,,,,,,,,,,,
650,650,650,650,650,650,650,650,650,650,650,650,650,650,650,650,650,650,,,,,,,,,,,,,,,,,,,,,,,,,,,,,,,,,,,,,,,
650,650,650,650,650,650,650,650,650,650,650,650,650,650,650,650,650,650,,,,,,,,,,,,,,,,,,,,,,,,,,,,,,,,,,,,,,,
650,650,650,650,650,650,650,650,650,650,650,650,650,650,650,650,650,650,,,,,,,,,,,,,,,,,,,,,,,,,,,,,,,,,,,,,,,
650,650,650,650,650,650,650,650,650,650,650,650,650,650,650,650,650,650,,,,,,,,,,,,,,,,,,,,,,,,,,,,,,,,,,,,,,,
650,650,650,650,650,650,650,650,650,650,650,650,650,650,650,650,650,650,,,,,,,,,,,,,,,,,,,,,,,,,,,,,,,,,,,,,,,
650,650,650,650,650,650,650,650,650,650,650,650,650,650,650,650,650,650,,,,,,,,,,,,,,,,,,,,,,,,,,,,,,,,,,,,,,,
650,650,650,650,650,650,650,650,650,650,650,650,650,650,650,650,650,650,,,,,,,,,,,,,,,,,,,,,,,,,,,,,,,,,,,,,,,
650,650,650,650,650,650,650,650,650,650,650,650,650,650,650,650,650,650,,,,,,,,,,,,,,,,,,,,,,,,,,,,,,,,,,,,,,,
650,650,650,650,650,650,650,650,650,650,650,650,650,650,650,650,650,650,,,,,,,,,,,,,,,,,,,,,,,,,,,,,,,,,,,,,,,
650,650,650,650,650,650,650,650,650,650,650,650,650,650,650,650,650,650,,,,,,,,,,,,,,,,,,,,,,,,,,,,,,,,,,,,,,,
650,650,650,650,650,650,650,650,650,650,650,650,650,650,650,650,650,650,,,,,,,,,,,,,,,,,,,,,,,,,,,,,,,,,,,,,,,
650,650,650,650,650,650,650,650,650,650,650,650,650,650,650,650,650,650,,,,,,,,,,,,,,,,,,,,,,,,,,,,,,,,,,,,,,,
650,650,650,650,650,650,650,650,650,650,650,650,650,650,650,650,650,650,,,,,,,,,,,,,,,,,,,,,,,,,,,,,,,,,,,,,,,
650,650,650,650,650,650,650,650,650,650,650,650,650,650,650,650,650,650,,,,,,,,,,,,,,,,,,,,,,,,,,,,,,,,,,,,,,,
650,650,650,650,650,650,650,650,650,650,650,650,650,650,650,650,650,650,,,,,,,,,,,,,,,,,,,,,,,,,,,,,,,,,,,,,,,
650,650,650,650,650,650,650,650,650,650,650,650,650,650,650,650,650,650,,,,,,,,,,,,,,,,,,,,,,,,,,,,,,,,,,,,,,,
650,650,650,650,650,650,650,650,650,650,650,650,650,650,650,650,650,650,,,,,,,,,,,,,,,,,,,,,,,,,,,,,,,,,,,,,,,
650,650,650,650,650,650,650,650,650,650,650,650,650,650,650,650,650,650,,,,,,,,,,,,,,,,,,,,,,,,,,,,,,,,,,,,,,,
650,650,650,650,650,650,650,650,650,650,650,650,650,650,650,650,650,650,,,,,,,,,,,,,,,,,,,,,,,,,,,,,,,,,,,,,,,
650,650,650,650,650,650,650,650,650,650,650,650,650,650,650,650,650,650,,,,,,,,,,,,,,,,,,,,,,,,,,,,,,,,,,,,,,,
650,650,650,650,650,650,650,650,650,650,650,650,650,650,650,650,650,650,,,,,,,,,,,,,,,,,,,,,,,,,,,,,,,,,,,,,,,
650,650,650,650,650,650,650,650,650,650,650,650,650,650,650,650,650,650,,,,,,,,,,,,,,,,,,,,,,,,,,,,,,,,,,,,,,,
650,650,650,650,650,650,650,650,650,650,650,650,650,650,650,650,650,650,,,,,,,,,,,,,,,,,,,,,,,,,,,,,,,,,,,,,,,
650,650,650,650,650,650,650,650,650,650,650,650,650,650,650,650,650,650,,,,,,,,,,,,,,,,,,,,,,,,,,,,,,,,,,,,,,,
650,650,650,650,650,650,650,650,650,650,650,650,650,650,650,650,650,650,,,,,,,,,,,,,,,,,,,,,,,,,,,,,,,,,,,,,,,
650,650,650,650,650,650,650,650,650,650,650,650,650,650,650,650,650,650,,,,,,,,,,,,,,,,,,,,,,,,,,,,,,,,,,,,,,,
650,650,650,650,650,650,650,650,650,650,650,650,650,650,650,650,650,650,,,,,,,,,,,,,,,,,,,,,,,,,,,,,,,,,,,,,,,
650,650,650,650,650,650,650,650,650,650,650,650,650,650,650,650,650,650,,,,,,,,,,,,,,,,,,,,,,,,,,,,,,,,,,,,,,,
650,650,650,650,650,650,650,650,650,650,650,650,650,650,650,650,650,650,,,,,,,,,,,,,,,,,,,,,,,,,,,,,,,,,,,,,,,
650,650,650,650,650,650,650,650,650,650,650,650,650,650,650,650,650,650,,,,,,,,,,,,,,,,,,,,,,,,,,,,,,,,,,,,,,,
800,650,650,650,650,650,650,650,650,650,650,650,650,650,650,650,650,800,,,,,,,,,,,,,,,,,,,,,,,,,,,,,,,,,,,,,,,
2400,1500,1500,1500,1500,1500,1500,1500,1500,1500,1500,1500,1500,1500,1500,1500,1500,2400,,,,,,,,,,,,,,,,,,,,,,,,,,,,,,,,,,,,,,,
#,raw_row_delta_min,,,,,,,,,,,,,,,,,,,,,,,,,,,,,,,,,,,,,,,,,,,,,,,,,,,,,,,
-2400,-1500,-1500,-1500,-1500,-1500,-1500,-1500,-1500,-1500,-1500,-1500,-1500,-1500,-1500,-1500,-1500,-2400,,,,,,,,,,,,,,,,,,,,,,,,,,,,,,,,,,,,,,,
-800,-1500,-1500,-1500,-1500,-1500,-750,-750,-750,-750,-750,-750,-750,-750,-750,-750,-750,-800,,,,,,,,,,,,,,,,,,,,,,,,,,,,,,,,,,,,,,,
-650,-650,-650,-650,-650,-650,-650,-650,-650,-650,-650,-650,-650,-650,-650,-650,-650,-650,,,,,,,,,,,,,,,,,,,,,,,,,,,,,,,,,,,,,,,
-650,-650,-650,-650,-650,-650,-650,-650,-650,-650,-650,-650,-650,-650,-650,-650,-650,-650,,,,,,,,,,,,,,,,,,,,,,,,,,,,,,,,,,,,,,,
-650,-650,-650,-650,-650,-650,-650,-650,-650,-650,-650,-650,-650,-650,-650,-650,-650,-650,,,,,,,,,,,,,,,,,,,,,,,,,,,,,,,,,,,,,,,
-650,-650,-650,-650,-650,-650,-650,-650,-650,-650,-650,-650,-650,-650,-650,-650,-650,-650,,,,,,,,,,,,,,,,,,,,,,,,,,,,,,,,,,,,,,,
-650,-650,-650,-650,-650,-650,-650,-650,-650,-650,-650,-650,-650,-650,-650,-650,-650,-650,,,,,,,,,,,,,,,,,,,,,,,,,,,,,,,,,,,,,,,
-650,-650,-650,-650,-650,-650,-650,-650,-650,-650,-650,-650,-650,-650,-650,-650,-650,-650,,,,,,,,,,,,,,,,,,,,,,,,,,,,,,,,,,,,,,,
-650,-650,-650,-650,-650,-650,-650,-650,-650,-650,-650,-650,-650,-650,-650,-650,-650,-650,,,,,,,,,,,,,,,,,,,,,,,,,,,,,,,,,,,,,,,
-650,-650,-650,-650,-650,-650,-650,-650,-650,-650,-650,-650,-650,-650,-650,-650,-650,-650,,,,,,,,,,,,,,,,,,,,,,,,,,,,,,,,,,,,,,,
-650,-650,-650,-650,-650,-650,-650,-650,-650,-650,-650,-650,-650,-650,-650,-650,-650,-650,,,,,,,,,,,,,,,,,,,,,,,,,,,,,,,,,,,,,,,
-650,-650,-650,-650,-650,-650,-650,-650,-650,-650,-650,-650,-650,-650,-650,-650,-650,-650,,,,,,,,,,,,,,,,,,,,,,,,,,,,,,,,,,,,,,,
-650,-650,-650,-650,-650,-650,-650,-650,-650,-650,-650,-650,-650,-650,-650,-650,-650,-650,,,,,,,,,,,,,,,,,,,,,,,,,,,,,,,,,,,,,,,
-650,-650,-650,-650,-650,-650,-650,-650,-650,-650,-650,-650,-650,-650,-650,-650,-650,-650,,,,,,,,,,,,,,,,,,,,,,,,,,,,,,,,,,,,,,,
-650,-650,-650,-650,-650,-650,-650,-650,-650,-650,-650,-650,-650,-650,-650,-650,-650,-650,,,,,,,,,,,,,,,,,,,,,,,,,,,,,,,,,,,,,,,
-650,-650,-650,-650,-650,-650,-650,-650,-650,-650,-650,-650,-650,-650,-650,-650,-650,-650,,,,,,,,,,,,,,,,,,,,,,,,,,,,,,,,,,,,,,,
-650,-650,-650,-650,-650,-650,-650,-650,-650,-650,-650,-650,-650,-650,-650,-650,-650,-650,,,,,,,,,,,,,,,,,,,,,,,,,,,,,,,,,,,,,,,
-650,-650,-650,-650,-650,-650,-650,-650,-650,-650,-650,-650,-650,-650,-650,-650,-650,-650,,,,,,,,,,,,,,,,,,,,,,,,,,,,,,,,,,,,,,,
-650,-650,-650,-650,-650,-650,-650,-650,-650,-650,-650,-650,-650,-650,-650,-650,-650,-650,,,,,,,,,,,,,,,,,,,,,,,,,,,,,,,,,,,,,,,
-650,-650,-650,-650,-650,-650,-650,-650,-650,-650,-650,-650,-650,-650,-650,-650,-650,-650,,,,,,,,,,,,,,,,,,,,,,,,,,,,,,,,,,,,,,,
-650,-650,-650,-650,-650,-650,-650,-650,-650,-650,-650,-650,-650,-650,-650,-650,-650,-650,,,,,,,,,,,,,,,,,,,,,,,,,,,,,,,,,,,,,,,
-650,-650,-650,-650,-650,-650,-650,-650,-650,-650,-650,-650,-650,-650,-650,-650,-650,-650,,,,,,,,,,,,,,,,,,,,,,,,,,,,,,,,,,,,,,,
-650,-650,-650,-650,-650,-650,-650,-650,-650,-650,-650,-650,-650,-650,-650,-650,-650,-650,,,,,,,,,,,,,,,,,,,,,,,,,,,,,,,,,,,,,,,
-650,-650,-650,-650,-650,-650,-650,-650,-650,-650,-650,-650,-650,-650,-650,-650,-650,-650,,,,,,,,,,,,,,,,,,,,,,,,,,,,,,,,,,,,,,,
-650,-650,-650,-650,-650,-650,-650,-650,-650,-650,-650,-650,-650,-650,-650,-650,-650,-650,,,,,,,,,,,,,,,,,,,,,,,,,,,,,,,,,,,,,,,
-650,-650,-650,-650,-650,-650,-650,-650,-650,-650,-650,-650,-650,-650,-650,-650,-650,-650,,,,,,,,,,,,,,,,,,,,,,,,,,,,,,,,,,,,,,,
-650,-650,-650,-650,-650,-650,-650,-650,-650,-650,-650,-650,-650,-650,-650,-650,-650,-650,,,,,,,,,,,,,,,,,,,,,,,,,,,,,,,,,,,,,,,
-650,-650,-650,-650,-650,-650,-650,-650,-650,-650,-650,-650,-650,-650,-650,-650,-650,-650,,,,,,,,,,,,,,,,,,,,,,,,,,,,,,,,,,,,,,,
-650,-650,-650,-650,-650,-650,-650,-650,-650,-650,-650,-650,-650,-650,-650,-650,-650,-650,,,,,,,,,,,,,,,,,,,,,,,,,,,,,,,,,,,,,,,
-650,-650,-650,-650,-650,-650,-650,-650,-650,-650,-650,-650,-650,-650,-650,-650,-650,-650,,,,,,,,,,,,,,,,,,,,,,,,,,,,,,,,,,,,,,,
-650,-650,-650,-650,-650,-650,-650,-650,-650,-650,-650,-650,-650,-650,-650,-650,-650,-650,,,,,,,,,,,,,,,,,,,,,,,,,,,,,,,,,,,,,,,
-650,-650,-650,-650,-650,-650,-650,-650,-650,-650,-650,-650,-650,-650,-650,-650,-650,-650,,,,,,,,,,,,,,,,,,,,,,,,,,,,,,,,,,,,,,,
-650,-650,-650,-650,-650,-650,-650,-650,-650,-650,-650,-650,-650,-650,-650,-650,-650,-650,,,,,,,,,,,,,,,,,,,,,,,,,,,,,,,,,,,,,,,
-650,-650,-650,-650,-650,-650,-650,-650,-650,-650,-650,-650,-650,-650,-650,-650,-650,-650,,,,,,,,,,,,,,,,,,,,,,,,,,,,,,,,,,,,,,,
-650,-650,-650,-650,-650,-650,-650,-650,-650,-650,-650,-650,-650,-650,-650,-650,-650,-650,,,,,,,,,,,,,,,,,,,,,,,,,,,,,,,,,,,,,,,
-650,-650,-650,-650,-650,-650,-650,-650,-650,-650,-650,-650,-650,-650,-650,-650,-650,-650,,,,,,,,,,,,,,,,,,,,,,,,,,,,,,,,,,,,,,,
-800,-650,-650,-650,-650,-650,-650,-650,-650,-650,-650,-650,-650,-650,-650,-650,-650,-800,,,,,,,,,,,,,,,,,,,,,,,,,,,,,,,,,,,,,,,
-2400,-1500,-1500,-1500,-1500,-1500,-1500,-1500,-1500,-1500,-1500,-1500,-1500,-1500,-1500,-1500,-1500,-2400,,,,,,,,,,,,,,,,,,,,,,,,,,,,,,,,,,,,,,,
#,raw_col_delta_max,,,,,,,,,,,,,,,,,,,,,,,,,,,,,,,,,,,,,,,,,,,,,,,,,,,,,,,
2500,1000,1000,1000,1000,1000,1000,1000,1000,1000,1000,1000,1000,1000,1000,1000,2500,,,,,,,,,,,,,,,,,,,,,,,,,,,,,,,,,,,,,,,,
1000,1500,1500,1500,1500,1000,800,800,800,800,800,800,800,800,800,800,800,,,,,,,,,,,,,,,,,,,,,,,,,,,,,,,,,,,,,,,,
800,650,650,650,650,650,650,650,650,650,650,650,650,650,650,650,800,,,,,,,,,,,,,,,,,,,,,,,,,,,,,,,,,,,,,,,,
800,650,650,650,650,650,650,650,650,650,650,650,650,650,650,650,800,,,,,,,,,,,,,,,,,,,,,,,,,,,,,,,,,,,,,,,,
800,650,650,650,650,650,650,650,650,650,650,650,650,650,650,650,800,,,,,,,,,,,,,,,,,,,,,,,,,,,,,,,,,,,,,,,,
800,650,650,650,650,650,650,650,650,650,650,650,650,650,650,650,800,,,,,,,,,,,,,,,,,,,,,,,,,,,,,,,,,,,,,,,,
800,650,650,650,650,650,650,650,650,650,650,650,650,650,650,650,800,,,,,,,,,,,,,,,,,,,,,,,,,,,,,,,,,,,,,,,,
800,650,650,650,650,650,650,650,650,650,650,650,650,650,650,650,800,,,,,,,,,,,,,,,,,,,,,,,,,,,,,,,,,,,,,,,,
800,650,650,650,650,650,650,650,650,650,650,650,650,650,650,650,800,,,,,,,,,,,,,,,,,,,,,,,,,,,,,,,,,,,,,,,,
800,650,650,650,650,650,650,650,650,650,650,650,650,650,650,650,800,,,,,,,,,,,,,,,,,,,,,,,,,,,,,,,,,,,,,,,,
800,650,650,650,650,650,650,650,650,650,650,650,650,650,650,650,800,,,,,,,,,,,,,,,,,,,,,,,,,,,,,,,,,,,,,,,,
800,650,650,650,650,650,650,650,650,650,650,650,650,650,650,650,800,,,,,,,,,,,,,,,,,,,,,,,,,,,,,,,,,,,,,,,,
800,650,650,650,650,650,650,650,650,650,650,650,650,650,650,650,800,,,,,,,,,,,,,,,,,,,,,,,,,,,,,,,,,,,,,,,,
800,650,650,650,650,650,650,650,650,650,650,650,650,650,650,650,800,,,,,,,,,,,,,,,,,,,,,,,,,,,,,,,,,,,,,,,,
800,650,650,650,650,650,650,650,650,650,650,650,650,650,650,650,800,,,,,,,,,,,,,,,,,,,,,,,,,,,,,,,,,,,,,,,,
800,650,650,650,650,650,650,650,650,650,650,650,650,650,650,650,800,,,,,,,,,,,,,,,,,,,,,,,,,,,,,,,,,,,,,,,,
800,650,650,650,650,650,650,650,650,650,650,650,650,650,650,650,800,,,,,,,,,,,,,,,,,,,,,,,,,,,,,,,,,,,,,,,,
800,650,650,650,650,650,650,650,650,650,650,650,650,650,650,650,800,,,,,,,,,,,,,,,,,,,,,,,,,,,,,,,,,,,,,,,,
800,650,650,650,650,650,650,650,650,650,650,650,650,650,650,650,800,,,,,,,,,,,,,,,,,,,,,,,,,,,,,,,,,,,,,,,,
800,650,650,650,650,650,650,650,650,650,650,650,650,650,650,650,800,,,,,,,,,,,,,,,,,,,,,,,,,,,,,,,,,,,,,,,,
800,650,650,650,650,650,650,650,650,650,650,650,650,650,650,650,800,,,,,,,,,,,,,,,,,,,,,,,,,,,,,,,,,,,,,,,,
800,650,650,650,650,650,650,650,650,650,650,650,650,650,650,650,800,,,,,,,,,,,,,,,,,,,,,,,,,,,,,,,,,,,,,,,,
800,650,650,650,650,650,650,650,650,650,650,650,650,650,650,650,800,,,,,,,,,,,,,,,,,,,,,,,,,,,,,,,,,,,,,,,,
800,650,650,650,650,650,650,650,650,650,650,650,650,650,650,650,800,,,,,,,,,,,,,,,,,,,,,,,,,,,,,,,,,,,,,,,,
800,650,650,650,650,650,650,650,650,650,650,650,650,650,650,650,800,,,,,,,,,,,,,,,,,,,,,,,,,,,,,,,,,,,,,,,,
800,650,650,650,650,650,650,650,650,650,650,650,650,650,650,650,800,,,,,,,,,,,,,,,,,,,,,,,,,,,,,,,,,,,,,,,,
800,650,650,650,650,650,650,650,650,650,650,650,650,650,650,650,800,,,,,,,,,,,,,,,,,,,,,,,,,,,,,,,,,,,,,,,,
800,650,650,650,650,650,650,650,650,650,650,650,650,650,650,650,800,,,,,,,,,,,,,,,,,,,,,,,,,,,,,,,,,,,,,,,,
800,650,650,650,650,650,650,650,650,650,650,650,650,650,650,650,800,,,,,,,,,,,,,,,,,,,,,,,,,,,,,,,,,,,,,,,,
800,650,650,650,650,650,650,650,650,650,650,650,650,650,650,650,800,,,,,,,,,,,,,,,,,,,,,,,,,,,,,,,,,,,,,,,,
800,650,650,650,650,650,650,650,650,650,650,650,650,650,650,650,800,,,,,,,,,,,,,,,,,,,,,,,,,,,,,,,,,,,,,,,,
800,650,650,650,650,650,650,650,650,650,650,650,650,650,650,650,800,,,,,,,,,,,,,,,,,,,,,,,,,,,,,,,,,,,,,,,,
800,650,650,650,650,650,650,650,650,650,650,650,650,650,650,650,800,,,,,,,,,,,,,,,,,,,,,,,,,,,,,,,,,,,,,,,,
800,650,650,650,650,650,650,650,650,650,650,650,650,650,650,650,800,,,,,,,,,,,,,,,,,,,,,,,,,,,,,,,,,,,,,,,,
800,650,650,650,650,650,650,650,650,650,650,650,650,650,650,650,800,,,,,,,,,,,,,,,,,,,,,,,,,,,,,,,,,,,,,,,,
800,650,650,650,650,650,650,650,650,650,650,650,650,650,650,650,800,,,,,,,,,,,,,,,,,,,,,,,,,,,,,,,,,,,,,,,,
800,650,650,650,650,650,650,650,650,650,650,650,650,650,650,650,800,,,,,,,,,,,,,,,,,,,,,,,,,,,,,,,,,,,,,,,,
800,650,650,650,650,650,650,650,650,650,650,650,650,650,650,650,800,,,,,,,,,,,,,,,,,,,,,,,,,,,,,,,,,,,,,,,,
2500,1000,1000,1000,1000,1000,1000,1000,1000,1000,1000,1000,1000,1000,1000,1000,2500,,,,,,,,,,,,,,,,,,,,,,,,,,,,,,,,,,,,,,,,
#,raw_col_delta_min,,,,,,,,,,,,,,,,,,,,,,,,,,,,,,,,,,,,,,,,,,,,,,,,,,,,,,,
-2500,-1000,-1000,-1000,-1000,-1000,-1000,-1000,-1000,-1000,-1000,-1000,-1000,-1000,-1000,-1000,-2500,,,,,,,,,,,,,,,,,,,,,,,,,,,,,,,,,,,,,,,,
-1000,-1500,-1500,-1500,-1500,-1000,-800,-800,-800,-800,-800,-800,-800,-800,-800,-800,-800,,,,,,,,,,,,,,,,,,,,,,,,,,,,,,,,,,,,,,,,
-800,-650,-650,-650,-650,-650,-650,-650,-650,-650,-650,-650,-650,-650,-650,-650,-800,,,,,,,,,,,,,,,,,,,,,,,,,,,,,,,,,,,,,,,,
-800,-650,-650,-650,-650,-650,-650,-650,-650,-650,-650,-650,-650,-650,-650,-650,-800,,,,,,,,,,,,,,,,,,,,,,,,,,,,,,,,,,,,,,,,
-800,-650,-650,-650,-650,-650,-650,-650,-650,-650,-650,-650,-650,-650,-650,-650,-800,,,,,,,,,,,,,,,,,,,,,,,,,,,,,,,,,,,,,,,,
-800,-650,-650,-650,-650,-650,-650,-650,-650,-650,-650,-650,-650,-650,-650,-650,-800,,,,,,,,,,,,,,,,,,,,,,,,,,,,,,,,,,,,,,,,
-800,-650,-650,-650,-650,-650,-650,-650,-650,-650,-650,-650,-650,-650,-650,-650,-800,,,,,,,,,,,,,,,,,,,,,,,,,,,,,,,,,,,,,,,,
-800,-650,-650,-650,-650,-650,-650,-650,-650,-650,-650,-650,-650,-650,-650,-650,-800,,,,,,,,,,,,,,,,,,,,,,,,,,,,,,,,,,,,,,,,
-800,-650,-650,-650,-650,-650,-650,-650,-650,-650,-650,-650,-650,-650,-650,-650,-800,,,,,,,,,,,,,,,,,,,,,,,,,,,,,,,,,,,,,,,,
-800,-650,-650,-650,-650,-650,-650,-650,-650,-650,-650,-650,-650,-650,-650,-650,-800,,,,,,,,,,,,,,,,,,,,,,,,,,,,,,,,,,,,,,,,
-800,-650,-650,-650,-650,-650,-650,-650,-650,-650,-650,-650,-650,-650,-650,-650,-800,,,,,,,,,,,,,,,,,,,,,,,,,,,,,,,,,,,,,,,,
-800,-650,-650,-650,-650,-650,-650,-650,-650,-650,-650,-650,-650,-650,-650,-650,-800,,,,,,,,,,,,,,,,,,,,,,,,,,,,,,,,,,,,,,,,
-800,-650,-650,-650,-650,-650,-650,-650,-650,-650,-650,-650,-650,-650,-650,-650,-800,,,,,,,,,,,,,,,,,,,,,,,,,,,,,,,,,,,,,,,,
-800,-650,-650,-650,-650,-650,-650,-650,-650,-650,-650,-650,-650,-650,-650,-650,-800,,,,,,,,,,,,,,,,,,,,,,,,,,,,,,,,,,,,,,,,
-800,-650,-650,-650,-650,-650,-650,-650,-650,-650,-650,-650,-650,-650,-650,-650,-800,,,,,,,,,,,,,,,,,,,,,,,,,,,,,,,,,,,,,,,,
-800,-650,-650,-650,-650,-650,-650,-650,-650,-650,-650,-650,-650,-650,-650,-650,-800,,,,,,,,,,,,,,,,,,,,,,,,,,,,,,,,,,,,,,,,
-800,-650,-650,-650,-650,-650,-650,-650,-650,-650,-650,-650,-650,-650,-650,-650,-800,,,,,,,,,,,,,,,,,,,,,,,,,,,,,,,,,,,,,,,,
-800,-650,-650,-650,-650,-650,-650,-650,-650,-650,-650,-650,-650,-650,-650,-650,-800,,,,,,,,,,,,,,,,,,,,,,,,,,,,,,,,,,,,,,,,
-800,-650,-650,-650,-650,-650,-650,-650,-650,-650,-650,-650,-650,-650,-650,-650,-800,,,,,,,,,,,,,,,,,,,,,,,,,,,,,,,,,,,,,,,,
-800,-650,-650,-650,-650,-650,-650,-650,-650,-650,-650,-650,-650,-650,-650,-650,-800,,,,,,,,,,,,,,,,,,,,,,,,,,,,,,,,,,,,,,,,
-800,-650,-650,-650,-650,-650,-650,-650,-650,-650,-650,-650,-650,-650,-650,-650,-800,,,,,,,,,,,,,,,,,,,,,,,,,,,,,,,,,,,,,,,,
-800,-650,-650,-650,-650,-650,-650,-650,-650,-650,-650,-650,-650,-650,-650,-650,-800,,,,,,,,,,,,,,,,,,,,,,,,,,,,,,,,,,,,,,,,
-800,-650,-650,-650,-650,-650,-650,-650,-650,-650,-650,-650,-650,-650,-650,-650,-800,,,,,,,,,,,,,,,,,,,,,,,,,,,,,,,,,,,,,,,,
-800,-650,-650,-650,-650,-650,-650,-650,-650,-650,-650,-650,-650,-650,-650,-650,-800,,,,,,,,,,,,,,,,,,,,,,,,,,,,,,,,,,,,,,,,
-800,-650,-650,-650,-650,-650,-650,-650,-650,-650,-650,-650,-650,-650,-650,-650,-800,,,,,,,,,,,,,,,,,,,,,,,,,,,,,,,,,,,,,,,,
-800,-650,-650,-650,-650,-650,-650,-650,-650,-650,-650,-650,-650,-650,-650,-650,-800,,,,,,,,,,,,,,,,,,,,,,,,,,,,,,,,,,,,,,,,
-800,-650,-650,-650,-650,-650,-650,-650,-650,-650,-650,-650,-650,-650,-650,-650,-800,,,,,,,,,,,,,,,,,,,,,,,,,,,,,,,,,,,,,,,,
-800,-650,-650,-650,-650,-650,-650,-650,-650,-650,-650,-650,-650,-650,-650,-650,-800,,,,,,,,,,,,,,,,,,,,,,,,,,,,,,,,,,,,,,,,
-800,-650,-650,-650,-650,-650,-650,-650,-650,-650,-650,-650,-650,-650,-650,-650,-800,,,,,,,,,,,,,,,,,,,,,,,,,,,,,,,,,,,,,,,,
-800,-650,-650,-650,-650,-650,-650,-650,-650,-650,-650,-650,-650,-650,-650,-650,-800,,,,,,,,,,,,,,,,,,,,,,,,,,,,,,,,,,,,,,,,
-800,-650,-650,-650,-650,-650,-650,-650,-650,-650,-650,-650,-650,-650,-650,-650,-800,,,,,,,,,,,,,,,,,,,,,,,,,,,,,,,,,,,,,,,,
-800,-650,-650,-650,-650,-650,-650,-650,-650,-650,-650,-650,-650,-650,-650,-650,-800,,,,,,,,,,,,,,,,,,,,,,,,,,,,,,,,,,,,,,,,
-800,-650,-650,-650,-650,-650,-650,-650,-650,-650,-650,-650,-650,-650,-650,-650,-800,,,,,,,,,,,,,,,,,,,,,,,,,,,,,,,,,,,,,,,,
-800,-650,-650,-650,-650,-650,-650,-650,-650,-650,-650,-650,-650,-650,-650,-650,-800,,,,,,,,,,,,,,,,,,,,,,,,,,,,,,,,,,,,,,,,
-800,-650,-650,-650,-650,-650,-650,-650,-650,-650,-650,-650,-650,-650,-650,-650,-800,,,,,,,,,,,,,,,,,,,,,,,,,,,,,,,,,,,,,,,,
-800,-650,-650,-650,-650,-650,-650,-650,-650,-650,-650,-650,-650,-650,-650,-650,-800,,,,,,,,,,,,,,,,,,,,,,,,,,,,,,,,,,,,,,,,
-800,-650,-650,-650,-650,-650,-650,-650,-650,-650,-650,-650,-650,-650,-650,-650,-800,,,,,,,,,,,,,,,,,,,,,,,,,,,,,,,,,,,,,,,,
-800,-650,-650,-650,-650,-650,-650,-650,-650,-650,-650,-650,-650,-650,-650,-650,-800,,,,,,,,,,,,,,,,,,,,,,,,,,,,,,,,,,,,,,,,
-2500,-1000,-1000,-1000,-1000,-1000,-1000,-1000,-1000,-1000,-1000,-1000,-1000,-1000,-1000,-1000,-2500,,,,,,,,,,,,,,,,,,,,,,,,,,,,,,,,,,,,,,,,
#,line_max,,,,,,,,,,,,,,,,,,,,,,,,,,,,,,,,,,,,,,,,,,,,,,,,,,,,,,,
50637,53260,51894,51941,51585,53177,53817,52754,51843,51531,51584,49397,48513,47111,47915,47574,48392,47329,46761,51014,51389,51606,51427,52167,51943,51721,52247,51868,51674,51128,51893,51123,51536,51747,51055,52095,51417,50831,50788,50032,50059,49358,49651,50565,51095,49995,50766,50137,50996,49298,50125,51898,51810,50159,50125,48865,46634
#,line_min,,,,,,,,,,,,,,,,,,,,,,,,,,,,,,,,,,,,,,,,,,,,,,,,,,,,,,,
19207,20202,19683,19701,19567,20170,20413,20010,19664,19546,19566,18736,18401,17869,18174,18045,18355,17952,17737,19350,19492,19574,19506,19787,19702,19618,19817,19674,19600,19393,19683,19391,19548,19628,19365,19760,19503,19280,19264,18977,18987,18722,18833,19179,19380,18963,19256,19017,19343,18699,19013,19685,19652,19025,19013,18535,17688
