{
  "beat": [
    0,928,1216,1376,1568,1792,1984,2144,2304,2496,2656,2816,3232,3520,3744,4000,4160,4320,4640,4896,5056,5216,5504,5824,5984,6144,6400,6592,6880,7072,7264,7520,7840,8064,8288,8736,8896,9184,9344,9536,9728,9952,10240,10464,10624,10912,11104,11296,11520,11712,11872,12064,12384,12544,12800,12960,13152,13408,13568,13792,14080,14432,14656,14816,15008,15200,15424,15616,15776,15936,16384,16576,16896,17120,17344,17504,17728,17920,18080,18304,18592,18784,19008,19232,19392,19616,19776,19968,20128,20384,20544,20832,21344,21504,21696,21856,22016,22368,22528,22784,23104,23328,23616,23840,24032,24256,24416,24608,24800,24992,25312,25536,25728,26048,26400,26624,26880,27040,27296,27520,27840,29846
    ],
  "beat_count": 122,
  "downbeat": [
    0,
    768,
    2496,
    4320,
    6592,
    7840,
    9184,
    10464,
    12384,
    14080,
    15104,
    16384,
    18304,
    20128,
    22016,
    24800,
    26048,
    27296,
    29846
    ],
  "downbeat_count": 19
}