"threshold,cap_raw_data_max_array",,,,,,,,,,,,,,,,,,,,,,,,,,,,,,,,,,,,,
20190,20406,19896,20417,20432,19907,20462,19532,19511,20466,20437,20442,19930,19951,19620,19500,,,,,,,,,,,,,,,,,,,,,,
19740,19730,19757,19756,19772,19758,19818,20274,19967,19732,19729,19720,19715,19723,18823,19030,,,,,,,,,,,,,,,,,,,,,,
19710,19700,19721,19796,19819,19790,19807,19723,19854,19697,19684,19674,19685,19691,19720,19904,,,,,,,,,,,,,,,,,,,,,,
19789,19781,19801,19789,19792,19812,19793,19799,19795,19793,19775,19763,19771,19775,19800,19925,,,,,,,,,,,,,,,,,,,,,,
19734,19729,19748,19734,19739,19760,19741,19750,19747,19750,19732,19718,19727,19729,19754,19852,,,,,,,,,,,,,,,,,,,,,,
19782,19776,19798,19781,19788,19811,19789,19798,19793,19789,19801,19794,19789,19806,19800,19909,,,,,,,,,,,,,,,,,,,,,,
19723,19716,19734,19718,19723,19746,19724,19730,19723,19720,19711,19703,19712,19714,19735,19802,,,,,,,,,,,,,,,,,,,,,,
19793,19784,19802,19788,19790,19808,19783,19790,19787,19790,19784,19778,19786,19789,19811,19864,,,,,,,,,,,,,,,,,,,,,,
19739,19735,19758,19734,19732,19746,19722,19732,19732,19742,19742,19736,19744,19748,19771,19812,,,,,,,,,,,,,,,,,,,,,,
19808,19801,19817,19798,19793,19806,19786,19793,19796,19810,19805,19804,19813,19816,19837,19866,,,,,,,,,,,,,,,,,,,,,,
19762,19760,19768,19746,19739,19753,19732,19742,19747,19754,19756,19754,19765,19768,19790,19811,,,,,,,,,,,,,,,,,,,,,,
19813,19804,19817,19793,19787,19801,19778,19798,19798,19808,19811,19811,19819,19824,19847,19854,,,,,,,,,,,,,,,,,,,,,,
19740,19728,19740,19716,19709,19723,19703,19715,19727,19739,19739,19739,19751,19759,19777,19798,,,,,,,,,,,,,,,,,,,,,,
19753,19741,19752,19728,19722,19735,19714,19730,19735,19746,19748,19750,19763,19769,19790,19777,,,,,,,,,,,,,,,,,,,,,,
19693,19682,19692,19667,19660,19680,19654,19669,19675,19685,19687,19688,19702,19709,19734,19714,,,,,,,,,,,,,,,,,,,,,,
19732,19717,19728,19703,19710,19710,19691,19706,19712,19726,19727,19728,19744,19750,19776,19747,,,,,,,,,,,,,,,,,,,,,,
19687,19675,19686,19661,19660,19668,19649,19663,19670,19680,19681,19680,19696,19704,19730,19694,,,,,,,,,,,,,,,,,,,,,,
19746,19735,19746,19721,19714,19728,19714,19723,19730,19739,19739,19741,19752,19760,19788,19739,,,,,,,,,,,,,,,,,,,,,,
19700,19688,19699,19684,19668,19682,19663,19678,19684,19700,19697,19697,19711,19720,19745,19692,,,,,,,,,,,,,,,,,,,,,,
19747,19736,19747,19723,19717,19730,19711,19727,19732,19694,19698,19699,19711,19720,19748,19685,,,,,,,,,,,,,,,,,,,,,,
19674,19663,19672,19649,19644,19656,19638,19654,19657,19620,19624,19626,19638,19646,19679,19614,,,,,,,,,,,,,,,,,,,,,,
19700,19685,19694,19672,19667,19680,19664,19676,19682,19646,19648,19650,19760,19672,19817,19710,,,,,,,,,,,,,,,,,,,,,,
19625,19610,19618,19594,19589,19602,19583,19597,19606,19568,19571,19572,19624,19596,19703,19582,,,,,,,,,,,,,,,,,,,,,,
19660,19642,19652,19638,19624,19638,19616,19633,19640,19603,19606,19608,19620,19628,19657,19572,,,,,,,,,,,,,,,,,,,,,,
19609,19590,19602,19582,19577,19590,19570,19584,19592,19558,19559,19560,19571,19578,19606,19519,,,,,,,,,,,,,,,,,,,,,,
19663,19651,19663,19644,19640,19655,19632,19649,19656,19620,19622,19625,19644,19643,19670,19556,,,,,,,,,,,,,,,,,,,,,,
19610,19596,19609,19589,19589,19603,19579,19596,19604,19568,19572,19574,19592,19591,19616,19498,,,,,,,,,,,,,,,,,,,,,,
19655,19638,19654,19633,19632,19646,19626,19642,19651,19615,19618,19622,19640,19637,19660,19534,,,,,,,,,,,,,,,,,,,,,,
19583,19567,19579,19561,19561,19576,19556,19576,19583,19546,19548,19558,19579,19570,19639,19462,,,,,,,,,,,,,,,,,,,,,,
19604,19608,19609,19596,19583,19615,19601,19598,19607,19570,19572,19584,19596,19592,19621,19471,,,,,,,,,,,,,,,,,,,,,,
19528,19506,19519,19500,19500,19516,19500,19517,19526,19496,19492,19505,19517,19513,19536,19388,,,,,,,,,,,,,,,,,,,,,,
19560,19541,19552,19548,19534,19552,19535,19555,19564,19525,19530,19542,19558,19550,19574,19414,,,,,,,,,,,,,,,,,,,,,,
19500,19480,19493,19474,19476,19494,19478,19500,19507,19468,19475,19486,19494,19493,19519,19342,,,,,,,,,,,,,,,,,,,,,,
19564,19547,19560,19544,19544,19565,19552,19572,19580,19543,19553,19564,19567,19564,19590,19402,,,,,,,,,,,,,,,,,,,,,,
19518,19505,19519,19502,19506,19528,19517,19537,19546,19508,19528,19520,19529,19526,19556,19363,,,,,,,,,,,,,,,,,,,,,,
19577,19567,19584,19568,19576,19598,19589,19613,19620,19582,19595,19590,19596,19603,19631,19427,,,,,,,,,,,,,,,,,,,,,,
19501,19488,19508,19499,19505,19530,19523,19549,19556,19522,19528,19519,19528,19529,19570,19376,,,,,,,,,,,,,,,,,,,,,,
19906,19621,19637,19643,19660,19675,19674,19716,19734,19707,19707,19706,19712,19716,19796,19400,,,,,,,,,,,,,,,,,,,,,,
"threshold,cap_raw_data_min_array",,,,,,,,,,,,,,,,,,,,,,,,,,,,,,,,,,,,,
13056,13196,13264,13203,13213,13271,13233,13022,13007,13235,13216,13219,13286,13301,13080,13150,,,,,,,,,,,,,,,,,,,,,,
13160,13154,13171,13170,13182,13172,13212,13516,13311,13154,13153,13146,13143,13149,12549,12686,,,,,,,,,,,,,,,,,,,,,,
13140,13134,13147,13198,13213,13194,13205,13149,13236,13131,13122,13116,13123,13127,13146,13270,,,,,,,,,,,,,,,,,,,,,,
13193,13187,13201,13193,13194,13208,13195,13199,13197,13195,13183,13175,13181,13183,13200,13283,,,,,,,,,,,,,,,,,,,,,,
13156,13153,13166,13156,13159,13174,13161,13166,13165,13166,13154,13146,13151,13153,13170,13234,,,,,,,,,,,,,,,,,,,,,,
13188,13184,13198,13187,13192,13207,13193,13198,13195,13193,13201,13196,13193,13204,13200,13273,,,,,,,,,,,,,,,,,,,,,,
13149,13144,13156,13146,13149,13164,13150,13154,13149,13146,13141,13135,13142,13142,13157,13202,,,,,,,,,,,,,,,,,,,,,,
13195,13190,13202,13192,13194,13206,13189,13194,13191,13194,13190,13186,13190,13193,13207,13242,,,,,,,,,,,,,,,,,,,,,,
13159,13157,13172,13156,13154,13164,13148,13154,13154,13162,13162,13158,13162,13166,13181,13208,,,,,,,,,,,,,,,,,,,,,,
13206,13201,13211,13198,13195,13204,13190,13195,13198,13206,13203,13202,13209,13210,13225,13244,,,,,,,,,,,,,,,,,,,,,,
13174,13174,13178,13164,13159,13169,13154,13162,13165,13170,13170,13170,13177,13178,13194,13207,,,,,,,,,,,,,,,,,,,,,,
13209,13202,13211,13195,13191,13201,13186,13198,13198,13206,13207,13207,13213,13216,13231,13236,,,,,,,,,,,,,,,,,,,,,,
13160,13152,13160,13144,13139,13149,13135,13143,13151,13159,13159,13159,13167,13173,13185,13198,,,,,,,,,,,,,,,,,,,,,,
13169,13161,13168,13152,13148,13157,13142,13154,13157,13164,13166,13166,13175,13179,13194,13185,,,,,,,,,,,,,,,,,,,,,,
13129,13122,13128,13111,13106,13120,13102,13113,13117,13123,13125,13126,13134,13139,13156,13142,,,,,,,,,,,,,,,,,,,,,,
13154,13145,13152,13135,13140,13140,13127,13138,13142,13150,13151,13152,13162,13166,13184,13165,,,,,,,,,,,,,,,,,,,,,,
13125,13117,13124,13107,13106,13112,13099,13109,13114,13120,13121,13120,13130,13136,13154,13130,,,,,,,,,,,,,,,,,,,,,,
13164,13157,13164,13147,13142,13152,13142,13149,13154,13159,13159,13161,13168,13174,13192,13159,,,,,,,,,,,,,,,,,,,,,,
13134,13126,13133,13122,13112,13122,13109,13118,13122,13134,13131,13131,13141,13146,13163,13128,,,,,,,,,,,,,,,,,,,,,,
13165,13158,13165,13149,13145,13154,13141,13151,13154,13130,13132,13133,13141,13146,13166,13123,,,,,,,,,,,,,,,,,,,,,,
13116,13109,13114,13099,13096,13104,13092,13102,13105,13080,13082,13084,13092,13098,13119,13076,,,,,,,,,,,,,,,,,,,,,,
13134,13123,13130,13114,13111,13120,13110,13118,13122,13098,13098,13100,13174,13114,13211,13140,,,,,,,,,,,,,,,,,,,,,,
13083,13074,13078,13062,13059,13068,13055,13065,13070,13046,13047,13048,13082,13064,13135,13054,,,,,,,,,,,,,,,,,,,,,,
13106,13094,13102,13092,13082,13092,13078,13089,13094,13069,13070,13072,13080,13086,13105,13048,,,,,,,,,,,,,,,,,,,,,,
13073,13060,13068,13054,13051,13060,13046,13056,13062,13038,13039,13040,13047,13052,13070,13013,,,,,,,,,,,,,,,,,,,,,,
13109,13101,13109,13096,13094,13103,13088,13099,13104,13080,13082,13083,13096,13095,13114,13038,,,,,,,,,,,,,,,,,,,,,,
13074,13064,13073,13059,13059,13069,13053,13064,13070,13046,13048,13050,13062,13061,13078,12998,,,,,,,,,,,,,,,,,,,,,,
13103,13092,13102,13089,13088,13098,13084,13094,13101,13077,13078,13082,13094,13091,13106,13022,,,,,,,,,,,,,,,,,,,,,,
13055,13045,13053,13041,13041,13050,13038,13050,13055,13030,13032,13038,13053,13046,13093,12974,,,,,,,,,,,,,,,,,,,,,,
13070,13072,13073,13064,13055,13077,13067,13066,13071,13046,13048,13056,13064,13062,13081,12981,,,,,,,,,,,,,,,,,,,,,,
13018,13004,13013,13000,13000,13010,13000,13011,13018,12998,12994,13003,13011,13009,13024,12926,,,,,,,,,,,,,,,,,,,,,,
13040,13027,13034,13032,13022,13034,13023,13037,13042,13017,13020,13028,13038,13034,13050,12942,,,,,,,,,,,,,,,,,,,,,,
13000,12986,12995,12982,12984,12996,12986,13000,13005,12978,12983,12990,12996,12995,13013,12894,,,,,,,,,,,,,,,,,,,,,,
13042,13031,13040,13030,13030,13043,13034,13048,13054,13029,13035,13042,13045,13042,13060,12934,,,,,,,,,,,,,,,,,,,,,,
13012,13003,13013,13002,13004,13018,13011,13025,13030,13006,13018,13014,13019,13018,13038,12909,,,,,,,,,,,,,,,,,,,,,,
13051,13045,13056,13046,13050,13066,13059,13075,13080,13054,13063,13060,13064,13069,13087,12951,,,,,,,,,,,,,,,,,,,,,,
13001,12992,13006,12999,13003,13020,13015,13033,13038,13014,13018,13013,13018,13019,13046,12918,,,,,,,,,,,,,,,,,,,,,,
13270,13081,13091,13095,13107,13116,13116,13144,13155,13138,13139,13137,13142,13144,13198,12930,,,,,,,,,,,,,,,,,,,,,,
"threshold,lcd_noise_max_array",,,,,,,,,,,,,,,,,,,,,,,,,,,,,,,,,,,,,
100,55,55,55,55,55,55,55,55,55,55,55,55,55,55,100,,,,,,,,,,,,,,,,,,,,,,
55,55,55,55,55,55,55,55,55,55,55,55,55,55,55,55,,,,,,,,,,,,,,,,,,,,,,
55,55,55,55,55,55,55,55,55,55,55,55,55,55,55,55,,,,,,,,,,,,,,,,,,,,,,
55,55,55,55,55,55,55,55,55,55,55,55,55,55,55,55,,,,,,,,,,,,,,,,,,,,,,
55,55,55,55,55,55,55,55,55,55,55,55,55,55,55,55,,,,,,,,,,,,,,,,,,,,,,
55,55,55,55,55,55,55,55,55,55,55,55,55,55,55,55,,,,,,,,,,,,,,,,,,,,,,
55,55,55,55,55,55,55,55,55,55,55,55,55,55,55,55,,,,,,,,,,,,,,,,,,,,,,
55,55,55,55,55,55,55,55,55,55,55,55,55,55,55,55,,,,,,,,,,,,,,,,,,,,,,
55,55,55,55,55,55,55,55,55,55,55,55,55,55,55,55,,,,,,,,,,,,,,,,,,,,,,
55,55,55,55,55,55,55,55,55,55,55,55,55,55,55,55,,,,,,,,,,,,,,,,,,,,,,
55,55,55,55,55,55,55,55,55,55,55,55,55,55,55,55,,,,,,,,,,,,,,,,,,,,,,
55,55,55,55,55,55,55,55,55,55,55,55,55,55,55,55,,,,,,,,,,,,,,,,,,,,,,
55,55,55,55,55,55,55,55,55,55,55,55,55,55,55,55,,,,,,,,,,,,,,,,,,,,,,
55,55,55,55,55,55,55,55,55,55,55,55,55,55,55,55,,,,,,,,,,,,,,,,,,,,,,
55,55,55,55,55,55,55,55,55,55,55,55,55,55,55,55,,,,,,,,,,,,,,,,,,,,,,
55,55,55,55,55,55,55,55,55,55,55,55,55,55,55,55,,,,,,,,,,,,,,,,,,,,,,
55,55,55,55,55,55,55,55,55,55,55,55,55,55,55,55,,,,,,,,,,,,,,,,,,,,,,
55,55,55,55,55,55,55,55,55,55,55,55,55,55,55,55,,,,,,,,,,,,,,,,,,,,,,
55,55,55,55,55,55,55,55,55,55,55,55,55,55,55,55,,,,,,,,,,,,,,,,,,,,,,
55,55,55,55,55,55,55,55,55,55,55,55,55,55,55,55,,,,,,,,,,,,,,,,,,,,,,
55,55,55,55,55,55,55,55,55,55,55,55,55,55,55,55,,,,,,,,,,,,,,,,,,,,,,
55,55,55,55,55,55,55,55,55,55,55,55,55,55,55,55,,,,,,,,,,,,,,,,,,,,,,
55,55,55,55,55,55,55,55,55,55,55,55,55,55,55,55,,,,,,,,,,,,,,,,,,,,,,
55,55,55,55,55,55,55,55,55,55,55,55,55,55,55,55,,,,,,,,,,,,,,,,,,,,,,
55,55,55,55,55,55,55,55,55,55,55,55,55,55,55,55,,,,,,,,,,,,,,,,,,,,,,
55,55,55,55,55,55,55,55,55,55,55,55,55,55,55,55,,,,,,,,,,,,,,,,,,,,,,
55,55,55,55,55,55,55,55,55,55,55,55,55,55,55,55,,,,,,,,,,,,,,,,,,,,,,
55,55,55,55,55,55,55,55,55,55,55,55,55,55,55,55,,,,,,,,,,,,,,,,,,,,,,
55,55,55,55,55,55,55,55,55,55,55,55,55,55,55,55,,,,,,,,,,,,,,,,,,,,,,
55,55,55,55,55,55,55,55,55,55,55,55,55,55,55,55,,,,,,,,,,,,,,,,,,,,,,
55,55,55,55,55,55,55,55,55,55,55,55,55,55,55,55,,,,,,,,,,,,,,,,,,,,,,
55,55,55,55,55,55,55,55,55,55,55,55,55,55,55,55,,,,,,,,,,,,,,,,,,,,,,
55,55,55,55,55,55,55,55,55,55,55,55,55,55,55,55,,,,,,,,,,,,,,,,,,,,,,
55,55,55,55,55,55,55,55,55,55,55,55,55,55,55,55,,,,,,,,,,,,,,,,,,,,,,
55,55,55,55,55,55,55,55,55,55,55,55,55,55,55,55,,,,,,,,,,,,,,,,,,,,,,
55,55,55,55,55,55,55,55,55,55,55,55,55,55,55,55,,,,,,,,,,,,,,,,,,,,,,
55,55,55,55,55,55,55,55,55,55,55,55,55,55,55,55,,,,,,,,,,,,,,,,,,,,,,
100,55,55,55,55,55,55,55,55,55,55,55,55,55,55,100,,,,,,,,,,,,,,,,,,,,,,
"threshold,raw_data_max_array",,,,,,,,,,,,,,,,,,,,,,,,,,,,,,,,,,,,,
3000,3000,3000,3000,3000,3000,3000,3000,3000,3000,3000,3000,3000,3000,3000,3000,,,,,,,,,,,,,,,,,,,,,,
3000,3000,3000,3000,3000,3000,3000,3000,3000,3000,3000,3000,3000,3000,3000,3000,,,,,,,,,,,,,,,,,,,,,,
3000,3000,3000,3000,3000,3000,3000,3000,3000,3000,3000,3000,3000,3000,3000,3000,,,,,,,,,,,,,,,,,,,,,,
3000,3000,3000,3000,3000,3000,3000,3000,3000,3000,3000,3000,3000,3000,3000,3000,,,,,,,,,,,,,,,,,,,,,,
3000,3000,3000,3000,3000,3000,3000,3000,3000,3000,3000,3000,3000,3000,3000,3000,,,,,,,,,,,,,,,,,,,,,,
3000,3000,3000,3000,3000,3000,3000,3000,3000,3000,3000,3000,3000,3000,3000,3000,,,,,,,,,,,,,,,,,,,,,,
3000,3000,3000,3000,3000,3000,3000,3000,3000,3000,3000,3000,3000,3000,3000,3000,,,,,,,,,,,,,,,,,,,,,,
3000,3000,3000,3000,3000,3000,3000,3000,3000,3000,3000,3000,3000,3000,3000,3000,,,,,,,,,,,,,,,,,,,,,,
3000,3000,3000,3000,3000,3000,3000,3000,3000,3000,3000,3000,3000,3000,3000,3000,,,,,,,,,,,,,,,,,,,,,,
3000,3000,3000,3000,3000,3000,3000,3000,3000,3000,3000,3000,3000,3000,3000,3000,,,,,,,,,,,,,,,,,,,,,,
3000,3000,3000,3000,3000,3000,3000,3000,3000,3000,3000,3000,3000,3000,3000,3000,,,,,,,,,,,,,,,,,,,,,,
3000,3000,3000,3000,3000,3000,3000,3000,3000,3000,3000,3000,3000,3000,3000,3000,,,,,,,,,,,,,,,,,,,,,,
3000,3000,3000,3000,3000,3000,3000,3000,3000,3000,3000,3000,3000,3000,3000,3000,,,,,,,,,,,,,,,,,,,,,,
3000,3000,3000,3000,3000,3000,3000,3000,3000,3000,3000,3000,3000,3000,3000,3000,,,,,,,,,,,,,,,,,,,,,,
3000,3000,3000,3000,3000,3000,3000,3000,3000,3000,3000,3000,3000,3000,3000,3000,,,,,,,,,,,,,,,,,,,,,,
3000,3000,3000,3000,3000,3000,3000,3000,3000,3000,3000,3000,3000,3000,3000,3000,,,,,,,,,,,,,,,,,,,,,,
3000,3000,3000,3000,3000,3000,3000,3000,3000,3000,3000,3000,3000,3000,3000,3000,,,,,,,,,,,,,,,,,,,,,,
3000,3000,3000,3000,3000,3000,3000,3000,3000,3000,3000,3000,3000,3000,3000,3000,,,,,,,,,,,,,,,,,,,,,,
3000,3000,3000,3000,3000,3000,3000,3000,3000,3000,3000,3000,3000,3000,3000,3000,,,,,,,,,,,,,,,,,,,,,,
3000,3000,3000,3000,3000,3000,3000,3000,3000,3000,3000,3000,3000,3000,3000,3000,,,,,,,,,,,,,,,,,,,,,,
3000,3000,3000,3000,3000,3000,3000,3000,3000,3000,3000,3000,3000,3000,3000,3000,,,,,,,,,,,,,,,,,,,,,,
3000,3000,3000,3000,3000,3000,3000,3000,3000,3000,3000,3000,3000,3000,3000,3000,,,,,,,,,,,,,,,,,,,,,,
3000,3000,3000,3000,3000,3000,3000,3000,3000,3000,3000,3000,3000,3000,3000,3000,,,,,,,,,,,,,,,,,,,,,,
3000,3000,3000,3000,3000,3000,3000,3000,3000,3000,3000,3000,3000,3000,3000,3000,,,,,,,,,,,,,,,,,,,,,,
3000,3000,3000,3000,3000,3000,3000,3000,3000,3000,3000,3000,3000,3000,3000,3000,,,,,,,,,,,,,,,,,,,,,,
3000,3000,3000,3000,3000,3000,3000,3000,3000,3000,3000,3000,3000,3000,3000,3000,,,,,,,,,,,,,,,,,,,,,,
3000,3000,3000,3000,3000,3000,3000,3000,3000,3000,3000,3000,3000,3000,3000,3000,,,,,,,,,,,,,,,,,,,,,,
3000,3000,3000,3000,3000,3000,3000,3000,3000,3000,3000,3000,3000,3000,3000,3000,,,,,,,,,,,,,,,,,,,,,,
3000,3000,3000,3000,3000,3000,3000,3000,3000,3000,3000,3000,3000,3000,3000,3000,,,,,,,,,,,,,,,,,,,,,,
3000,3000,3000,3000,3000,3000,3000,3000,3000,3000,3000,3000,3000,3000,3000,3000,,,,,,,,,,,,,,,,,,,,,,
3000,3000,3000,3000,3000,3000,3000,3000,3000,3000,3000,3000,3000,3000,3000,3000,,,,,,,,,,,,,,,,,,,,,,
3000,3000,3000,3000,3000,3000,3000,3000,3000,3000,3000,3000,3000,3000,3000,3000,,,,,,,,,,,,,,,,,,,,,,
3000,3000,3000,3000,3000,3000,3000,3000,3000,3000,3000,3000,3000,3000,3000,3000,,,,,,,,,,,,,,,,,,,,,,
3000,3000,3000,3000,3000,3000,3000,3000,3000,3000,3000,3000,3000,3000,3000,3000,,,,,,,,,,,,,,,,,,,,,,
3000,3000,3000,3000,3000,3000,3000,3000,3000,3000,3000,3000,3000,3000,3000,3000,,,,,,,,,,,,,,,,,,,,,,
3000,3000,3000,3000,3000,3000,3000,3000,3000,3000,3000,3000,3000,3000,3000,3000,,,,,,,,,,,,,,,,,,,,,,
3000,3000,3000,3000,3000,3000,3000,3000,3000,3000,3000,3000,3000,3000,3000,3000,,,,,,,,,,,,,,,,,,,,,,
3000,3000,3000,3000,3000,3000,3000,3000,3000,3000,3000,3000,3000,3000,3000,3000,,,,,,,,,,,,,,,,,,,,,,
"threshold,raw_data_min_array",,,,,,,,,,,,,,,,,,,,,,,,,,,,,,,,,,,,,
100,100,100,100,100,100,100,100,100,100,100,100,100,100,100,100,,,,,,,,,,,,,,,,,,,,,,
100,100,100,100,100,100,100,100,100,100,100,100,100,100,100,100,,,,,,,,,,,,,,,,,,,,,,
100,100,100,100,100,100,100,100,100,100,100,100,100,100,100,100,,,,,,,,,,,,,,,,,,,,,,
100,100,100,100,100,100,100,100,100,100,100,100,100,100,100,100,,,,,,,,,,,,,,,,,,,,,,
100,100,100,100,100,100,100,100,100,100,100,100,100,100,100,100,,,,,,,,,,,,,,,,,,,,,,
100,100,100,100,100,100,100,100,100,100,100,100,100,100,100,100,,,,,,,,,,,,,,,,,,,,,,
100,100,100,100,100,100,100,100,100,100,100,100,100,100,100,100,,,,,,,,,,,,,,,,,,,,,,
100,100,100,100,100,100,100,100,100,100,100,100,100,100,100,100,,,,,,,,,,,,,,,,,,,,,,
100,100,100,100,100,100,100,100,100,100,100,100,100,100,100,100,,,,,,,,,,,,,,,,,,,,,,
100,100,100,100,100,100,100,100,100,100,100,100,100,100,100,100,,,,,,,,,,,,,,,,,,,,,,
100,100,100,100,100,100,100,100,100,100,100,100,100,100,100,100,,,,,,,,,,,,,,,,,,,,,,
100,100,100,100,100,100,100,100,100,100,100,100,100,100,100,100,,,,,,,,,,,,,,,,,,,,,,
100,100,100,100,100,100,100,100,100,100,100,100,100,100,100,100,,,,,,,,,,,,,,,,,,,,,,
100,100,100,100,100,100,100,100,100,100,100,100,100,100,100,100,,,,,,,,,,,,,,,,,,,,,,
100,100,100,100,100,100,100,100,100,100,100,100,100,100,100,100,,,,,,,,,,,,,,,,,,,,,,
100,100,100,100,100,100,100,100,100,100,100,100,100,100,100,100,,,,,,,,,,,,,,,,,,,,,,
100,100,100,100,100,100,100,100,100,100,100,100,100,100,100,100,,,,,,,,,,,,,,,,,,,,,,
100,100,100,100,100,100,100,100,100,100,100,100,100,100,100,100,,,,,,,,,,,,,,,,,,,,,,
100,100,100,100,100,100,100,100,100,100,100,100,100,100,100,100,,,,,,,,,,,,,,,,,,,,,,
100,100,100,100,100,100,100,100,100,100,100,100,100,100,100,100,,,,,,,,,,,,,,,,,,,,,,
100,100,100,100,100,100,100,100,100,100,100,100,100,100,100,100,,,,,,,,,,,,,,,,,,,,,,
100,100,100,100,100,100,100,100,100,100,100,100,100,100,100,100,,,,,,,,,,,,,,,,,,,,,,
100,100,100,100,100,100,100,100,100,100,100,100,100,100,100,100,,,,,,,,,,,,,,,,,,,,,,
100,100,100,100,100,100,100,100,100,100,100,100,100,100,100,100,,,,,,,,,,,,,,,,,,,,,,
100,100,100,100,100,100,100,100,100,100,100,100,100,100,100,100,,,,,,,,,,,,,,,,,,,,,,
100,100,100,100,100,100,100,100,100,100,100,100,100,100,100,100,,,,,,,,,,,,,,,,,,,,,,
100,100,100,100,100,100,100,100,100,100,100,100,100,100,100,100,,,,,,,,,,,,,,,,,,,,,,
100,100,100,100,100,100,100,100,100,100,100,100,100,100,100,100,,,,,,,,,,,,,,,,,,,,,,
100,100,100,100,100,100,100,100,100,100,100,100,100,100,100,100,,,,,,,,,,,,,,,,,,,,,,
100,100,100,100,100,100,100,100,100,100,100,100,100,100,100,100,,,,,,,,,,,,,,,,,,,,,,
100,100,100,100,100,100,100,100,100,100,100,100,100,100,100,100,,,,,,,,,,,,,,,,,,,,,,
100,100,100,100,100,100,100,100,100,100,100,100,100,100,100,100,,,,,,,,,,,,,,,,,,,,,,
100,100,100,100,100,100,100,100,100,100,100,100,100,100,100,100,,,,,,,,,,,,,,,,,,,,,,
100,100,100,100,100,100,100,100,100,100,100,100,100,100,100,100,,,,,,,,,,,,,,,,,,,,,,
100,100,100,100,100,100,100,100,100,100,100,100,100,100,100,100,,,,,,,,,,,,,,,,,,,,,,
100,100,100,100,100,100,100,100,100,100,100,100,100,100,100,100,,,,,,,,,,,,,,,,,,,,,,
100,100,100,100,100,100,100,100,100,100,100,100,100,100,100,100,,,,,,,,,,,,,,,,,,,,,,
100,100,100,100,100,100,100,100,100,100,100,100,100,100,100,100,,,,,,,,,,,,,,,,,,,,,,
"threshold,open_short_max_array",,,,,,,,,,,,,,,,,,,,,,,,,,,,,,,,,,,,,
30000,30000,30000,30000,30000,30000,30000,30000,30000,30000,30000,30000,30000,30000,30000,30000,,,,,,,,,,,,,,,,,,,,,,
30000,30000,30000,30000,30000,30000,30000,30000,30000,30000,30000,30000,30000,30000,30000,30000,,,,,,,,,,,,,,,,,,,,,,
30000,30000,30000,30000,30000,30000,30000,30000,30000,30000,30000,30000,30000,30000,30000,30000,,,,,,,,,,,,,,,,,,,,,,
30000,30000,30000,30000,30000,30000,30000,30000,30000,30000,30000,30000,30000,30000,30000,30000,,,,,,,,,,,,,,,,,,,,,,
30000,30000,30000,30000,30000,30000,30000,30000,30000,30000,30000,30000,30000,30000,30000,30000,,,,,,,,,,,,,,,,,,,,,,
30000,30000,30000,30000,30000,30000,30000,30000,30000,30000,30000,30000,30000,30000,30000,30000,,,,,,,,,,,,,,,,,,,,,,
30000,30000,30000,30000,30000,30000,30000,30000,30000,30000,30000,30000,30000,30000,30000,30000,,,,,,,,,,,,,,,,,,,,,,
30000,30000,30000,30000,30000,30000,30000,30000,30000,30000,30000,30000,30000,30000,30000,30000,,,,,,,,,,,,,,,,,,,,,,
30000,30000,30000,30000,30000,30000,30000,30000,30000,30000,30000,30000,30000,30000,30000,30000,,,,,,,,,,,,,,,,,,,,,,
30000,30000,30000,30000,30000,30000,30000,30000,30000,30000,30000,30000,30000,30000,30000,30000,,,,,,,,,,,,,,,,,,,,,,
30000,30000,30000,30000,30000,30000,30000,30000,30000,30000,30000,30000,30000,30000,30000,30000,,,,,,,,,,,,,,,,,,,,,,
30000,30000,30000,30000,30000,30000,30000,30000,30000,30000,30000,30000,30000,30000,30000,30000,,,,,,,,,,,,,,,,,,,,,,
30000,30000,30000,30000,30000,30000,30000,30000,30000,30000,30000,30000,30000,30000,30000,30000,,,,,,,,,,,,,,,,,,,,,,
30000,30000,30000,30000,30000,30000,30000,30000,30000,30000,30000,30000,30000,30000,30000,30000,,,,,,,,,,,,,,,,,,,,,,
30000,30000,30000,30000,30000,30000,30000,30000,30000,30000,30000,30000,30000,30000,30000,30000,,,,,,,,,,,,,,,,,,,,,,
30000,30000,30000,30000,30000,30000,30000,30000,30000,30000,30000,30000,30000,30000,30000,30000,,,,,,,,,,,,,,,,,,,,,,
30000,30000,30000,30000,30000,30000,30000,30000,30000,30000,30000,30000,30000,30000,30000,30000,,,,,,,,,,,,,,,,,,,,,,
30000,30000,30000,30000,30000,30000,30000,30000,30000,30000,30000,30000,30000,30000,30000,30000,,,,,,,,,,,,,,,,,,,,,,
30000,30000,30000,30000,30000,30000,30000,30000,30000,30000,30000,30000,30000,30000,30000,30000,,,,,,,,,,,,,,,,,,,,,,
30000,30000,30000,30000,30000,30000,30000,30000,30000,30000,30000,30000,30000,30000,30000,30000,,,,,,,,,,,,,,,,,,,,,,
30000,30000,30000,30000,30000,30000,30000,30000,30000,30000,30000,30000,30000,30000,30000,30000,,,,,,,,,,,,,,,,,,,,,,
30000,30000,30000,30000,30000,30000,30000,30000,30000,30000,30000,30000,30000,30000,30000,30000,,,,,,,,,,,,,,,,,,,,,,
30000,30000,30000,30000,30000,30000,30000,30000,30000,30000,30000,30000,30000,30000,30000,30000,,,,,,,,,,,,,,,,,,,,,,
30000,30000,30000,30000,30000,30000,30000,30000,30000,30000,30000,30000,30000,30000,30000,30000,,,,,,,,,,,,,,,,,,,,,,
30000,30000,30000,30000,30000,30000,30000,30000,30000,30000,30000,30000,30000,30000,30000,30000,,,,,,,,,,,,,,,,,,,,,,
30000,30000,30000,30000,30000,30000,30000,30000,30000,30000,30000,30000,30000,30000,30000,30000,,,,,,,,,,,,,,,,,,,,,,
30000,30000,30000,30000,30000,30000,30000,30000,30000,30000,30000,30000,30000,30000,30000,30000,,,,,,,,,,,,,,,,,,,,,,
30000,30000,30000,30000,30000,30000,30000,30000,30000,30000,30000,30000,30000,30000,30000,30000,,,,,,,,,,,,,,,,,,,,,,
30000,30000,30000,30000,30000,30000,30000,30000,30000,30000,30000,30000,30000,30000,30000,30000,,,,,,,,,,,,,,,,,,,,,,
30000,30000,30000,30000,30000,30000,30000,30000,30000,30000,30000,30000,30000,30000,30000,30000,,,,,,,,,,,,,,,,,,,,,,
30000,30000,30000,30000,30000,30000,30000,30000,30000,30000,30000,30000,30000,30000,30000,30000,,,,,,,,,,,,,,,,,,,,,,
30000,30000,30000,30000,30000,30000,30000,30000,30000,30000,30000,30000,30000,30000,30000,30000,,,,,,,,,,,,,,,,,,,,,,
30000,30000,30000,30000,30000,30000,30000,30000,30000,30000,30000,30000,30000,30000,30000,30000,,,,,,,,,,,,,,,,,,,,,,
30000,30000,30000,30000,30000,30000,30000,30000,30000,30000,30000,30000,30000,30000,30000,30000,,,,,,,,,,,,,,,,,,,,,,
30000,30000,30000,30000,30000,30000,30000,30000,30000,30000,30000,30000,30000,30000,30000,30000,,,,,,,,,,,,,,,,,,,,,,
30000,30000,30000,30000,30000,30000,30000,30000,30000,30000,30000,30000,30000,30000,30000,30000,,,,,,,,,,,,,,,,,,,,,,
30000,30000,30000,30000,30000,30000,30000,30000,30000,30000,30000,30000,30000,30000,30000,30000,,,,,,,,,,,,,,,,,,,,,,
30000,30000,30000,30000,30000,30000,30000,30000,30000,30000,30000,30000,30000,30000,30000,30000,,,,,,,,,,,,,,,,,,,,,,
"threshold,open_short_min_array",,,,,,,,,,,,,,,,,,,,,,,,,,,,,,,,,,,,,
-30000,-30000,-30000,-30000,-30000,-30000,-30000,-30000,-30000,-30000,-30000,-30000,-30000,-30000,-30000,-30000,,,,,,,,,,,,,,,,,,,,,,
-30000,-30000,-30000,-30000,-30000,-30000,-30000,-30000,-30000,-30000,-30000,-30000,-30000,-30000,-30000,-30000,,,,,,,,,,,,,,,,,,,,,,
-30000,-30000,-30000,-30000,-30000,-30000,-30000,-30000,-30000,-30000,-30000,-30000,-30000,-30000,-30000,-30000,,,,,,,,,,,,,,,,,,,,,,
-30000,-30000,-30000,-30000,-30000,-30000,-30000,-30000,-30000,-30000,-30000,-30000,-30000,-30000,-30000,-30000,,,,,,,,,,,,,,,,,,,,,,
-30000,-30000,-30000,-30000,-30000,-30000,-30000,-30000,-30000,-30000,-30000,-30000,-30000,-30000,-30000,-30000,,,,,,,,,,,,,,,,,,,,,,
-30000,-30000,-30000,-30000,-30000,-30000,-30000,-30000,-30000,-30000,-30000,-30000,-30000,-30000,-30000,-30000,,,,,,,,,,,,,,,,,,,,,,
-30000,-30000,-30000,-30000,-30000,-30000,-30000,-30000,-30000,-30000,-30000,-30000,-30000,-30000,-30000,-30000,,,,,,,,,,,,,,,,,,,,,,
-30000,-30000,-30000,-30000,-30000,-30000,-30000,-30000,-30000,-30000,-30000,-30000,-30000,-30000,-30000,-30000,,,,,,,,,,,,,,,,,,,,,,
-30000,-30000,-30000,-30000,-30000,-30000,-30000,-30000,-30000,-30000,-30000,-30000,-30000,-30000,-30000,-30000,,,,,,,,,,,,,,,,,,,,,,
-30000,-30000,-30000,-30000,-30000,-30000,-30000,-30000,-30000,-30000,-30000,-30000,-30000,-30000,-30000,-30000,,,,,,,,,,,,,,,,,,,,,,
-30000,-30000,-30000,-30000,-30000,-30000,-30000,-30000,-30000,-30000,-30000,-30000,-30000,-30000,-30000,-30000,,,,,,,,,,,,,,,,,,,,,,
-30000,-30000,-30000,-30000,-30000,-30000,-30000,-30000,-30000,-30000,-30000,-30000,-30000,-30000,-30000,-30000,,,,,,,,,,,,,,,,,,,,,,
-30000,-30000,-30000,-30000,-30000,-30000,-30000,-30000,-30000,-30000,-30000,-30000,-30000,-30000,-30000,-30000,,,,,,,,,,,,,,,,,,,,,,
-30000,-30000,-30000,-30000,-30000,-30000,-30000,-30000,-30000,-30000,-30000,-30000,-30000,-30000,-30000,-30000,,,,,,,,,,,,,,,,,,,,,,
-30000,-30000,-30000,-30000,-30000,-30000,-30000,-30000,-30000,-30000,-30000,-30000,-30000,-30000,-30000,-30000,,,,,,,,,,,,,,,,,,,,,,
-30000,-30000,-30000,-30000,-30000,-30000,-30000,-30000,-30000,-30000,-30000,-30000,-30000,-30000,-30000,-30000,,,,,,,,,,,,,,,,,,,,,,
-30000,-30000,-30000,-30000,-30000,-30000,-30000,-30000,-30000,-30000,-30000,-30000,-30000,-30000,-30000,-30000,,,,,,,,,,,,,,,,,,,,,,
-30000,-30000,-30000,-30000,-30000,-30000,-30000,-30000,-30000,-30000,-30000,-30000,-30000,-30000,-30000,-30000,,,,,,,,,,,,,,,,,,,,,,
-30000,-30000,-30000,-30000,-30000,-30000,-30000,-30000,-30000,-30000,-30000,-30000,-30000,-30000,-30000,-30000,,,,,,,,,,,,,,,,,,,,,,
-30000,-30000,-30000,-30000,-30000,-30000,-30000,-30000,-30000,-30000,-30000,-30000,-30000,-30000,-30000,-30000,,,,,,,,,,,,,,,,,,,,,,
-30000,-30000,-30000,-30000,-30000,-30000,-30000,-30000,-30000,-30000,-30000,-30000,-30000,-30000,-30000,-30000,,,,,,,,,,,,,,,,,,,,,,
-30000,-30000,-30000,-30000,-30000,-30000,-30000,-30000,-30000,-30000,-30000,-30000,-30000,-30000,-30000,-30000,,,,,,,,,,,,,,,,,,,,,,
-30000,-30000,-30000,-30000,-30000,-30000,-30000,-30000,-30000,-30000,-30000,-30000,-30000,-30000,-30000,-30000,,,,,,,,,,,,,,,,,,,,,,
-30000,-30000,-30000,-30000,-30000,-30000,-30000,-30000,-30000,-30000,-30000,-30000,-30000,-30000,-30000,-30000,,,,,,,,,,,,,,,,,,,,,,
-30000,-30000,-30000,-30000,-30000,-30000,-30000,-30000,-30000,-30000,-30000,-30000,-30000,-30000,-30000,-30000,,,,,,,,,,,,,,,,,,,,,,
-30000,-30000,-30000,-30000,-30000,-30000,-30000,-30000,-30000,-30000,-30000,-30000,-30000,-30000,-30000,-30000,,,,,,,,,,,,,,,,,,,,,,
-30000,-30000,-30000,-30000,-30000,-30000,-30000,-30000,-30000,-30000,-30000,-30000,-30000,-30000,-30000,-30000,,,,,,,,,,,,,,,,,,,,,,
-30000,-30000,-30000,-30000,-30000,-30000,-30000,-30000,-30000,-30000,-30000,-30000,-30000,-30000,-30000,-30000,,,,,,,,,,,,,,,,,,,,,,
-30000,-30000,-30000,-30000,-30000,-30000,-30000,-30000,-30000,-30000,-30000,-30000,-30000,-30000,-30000,-30000,,,,,,,,,,,,,,,,,,,,,,
-30000,-30000,-30000,-30000,-30000,-30000,-30000,-30000,-30000,-30000,-30000,-30000,-30000,-30000,-30000,-30000,,,,,,,,,,,,,,,,,,,,,,
-30000,-30000,-30000,-30000,-30000,-30000,-30000,-30000,-30000,-30000,-30000,-30000,-30000,-30000,-30000,-30000,,,,,,,,,,,,,,,,,,,,,,
-30000,-30000,-30000,-30000,-30000,-30000,-30000,-30000,-30000,-30000,-30000,-30000,-30000,-30000,-30000,-30000,,,,,,,,,,,,,,,,,,,,,,
-30000,-30000,-30000,-30000,-30000,-30000,-30000,-30000,-30000,-30000,-30000,-30000,-30000,-30000,-30000,-30000,,,,,,,,,,,,,,,,,,,,,,
-30000,-30000,-30000,-30000,-30000,-30000,-30000,-30000,-30000,-30000,-30000,-30000,-30000,-30000,-30000,-30000,,,,,,,,,,,,,,,,,,,,,,
-30000,-30000,-30000,-30000,-30000,-30000,-30000,-30000,-30000,-30000,-30000,-30000,-30000,-30000,-30000,-30000,,,,,,,,,,,,,,,,,,,,,,
-30000,-30000,-30000,-30000,-30000,-30000,-30000,-30000,-30000,-30000,-30000,-30000,-30000,-30000,-30000,-30000,,,,,,,,,,,,,,,,,,,,,,
-30000,-30000,-30000,-30000,-30000,-30000,-30000,-30000,-30000,-30000,-30000,-30000,-30000,-30000,-30000,-30000,,,,,,,,,,,,,,,,,,,,,,
-30000,-30000,-30000,-30000,-30000,-30000,-30000,-30000,-30000,-30000,-30000,-30000,-30000,-30000,-30000,-30000,,,,,,,,,,,,,,,,,,,,,,
"threshold,raw_data_col_min_array",,,,,,,,,,,,,,,,,,,,,,,,,,,,,,,,,,,,,
190662,187539,187266,186974,187351,187251,187741,188243,188352,188291,188787,189468,189743,190214,190974,195404,,,,,,,,,,,,,,,,,,,,,,
"threshold,raw_data_col_max_array",,,,,,,,,,,,,,,,,,,,,,,,,,,,,,,,,,,,,
762646,750156,749064,747896,749404,749004,750962,752972,753406,753162,755146,757872,758970,760854,763896,781614,,,,,,,,,,,,,,,,,,,,,,
"threshold,raw_data_row_min_array",,,,,,,,,,,,,,,,,,,,,,,,,,,,,,,,,,,,,
81968,81948,80797,81141,80639,79943,80240,79719,79623,79058,79020,78404,78815,79048,79240,78400,78314,78354,78139,78473,79072,79996,79350,79236,78571,78648,78960,79094,78698,79090,79219,79038,78093,77872,78810,79344,79045,77054
"threshold,raw_data_row_max_array",,,,,,,,,,,,,,,,,,,,,,,,,,,,,,,,,,,,,
327872,327790,323188,324564,322556,319772,320958,318874,318490,316230,316080,313614,315258,316192,316958,313598,313256,313414,312556,313890,316288,319982,317398,316942,314282,314590,315840,316374,314790,316358,316874,316150,312372,311488,315240,317376,316180,308216
"threshold,abs_noise_row_max_array",,,,,,,,,,,,,,,,,,,,,,,,,,,,,,,,,,,,,
3000,3000,3000,3000,3000,3000,3000,3000,3000,3000,3000,3000,3000,3000,3000,3000,3000,3000,3000,3000,3000,3000,3000,3000,3000,3000,3000,3000,3000,3000,3000,3000,3000,3000,3000,3000,3000,3000
"threshold,abs_noise_col_max_array",,,,,,,,,,,,,,,,,,,,,,,,,,,,,,,,,,,,,
3000,3000,3000,3000,3000,3000,3000,3000,3000,3000,3000,3000,3000,3000,3000,3000,,,,,,,,,,,,,,,,,,,,,,
"threshold,raw_data_row_delta_max_array",,,,,,,,,,,,,,,,,,,,,,,,,,,,,,,,,,,,,
2000,2000,2000,2000,2000,2000,2000,2000,2000,2000,2000,2000,2000,2000,2000,4000,,,,,,,,,,,,,,,,,,,,,,
600,600,600,600,600,600,600,2000,2000,600,600,600,600,600,2000,2000,,,,,,,,,,,,,,,,,,,,,,
600,600,600,600,600,600,600,600,600,600,600,600,600,600,600,600,,,,,,,,,,,,,,,,,,,,,,
600,600,600,600,600,600,600,600,600,600,600,600,600,600,600,600,,,,,,,,,,,,,,,,,,,,,,
600,600,600,600,600,600,600,600,600,600,600,600,600,600,600,600,,,,,,,,,,,,,,,,,,,,,,
600,600,600,600,600,600,600,600,600,600,600,600,600,600,600,600,,,,,,,,,,,,,,,,,,,,,,
600,600,600,600,600,600,600,600,600,600,600,600,600,600,600,600,,,,,,,,,,,,,,,,,,,,,,
600,600,600,600,600,600,600,600,600,600,600,600,600,600,600,600,,,,,,,,,,,,,,,,,,,,,,
600,600,600,600,600,600,600,600,600,600,600,600,600,600,600,600,,,,,,,,,,,,,,,,,,,,,,
600,600,600,600,600,600,600,600,600,600,600,600,600,600,600,600,,,,,,,,,,,,,,,,,,,,,,
600,600,600,600,600,600,600,600,600,600,600,600,600,600,600,600,,,,,,,,,,,,,,,,,,,,,,
600,600,600,600,600,600,600,600,600,600,600,600,600,600,600,600,,,,,,,,,,,,,,,,,,,,,,
600,600,600,600,600,600,600,600,600,600,600,600,600,600,600,600,,,,,,,,,,,,,,,,,,,,,,
600,600,600,600,600,600,600,600,600,600,600,600,600,600,600,600,,,,,,,,,,,,,,,,,,,,,,
600,600,600,600,600,600,600,600,600,600,600,600,600,600,600,600,,,,,,,,,,,,,,,,,,,,,,
600,600,600,600,600,600,600,600,600,600,600,600,600,600,600,600,,,,,,,,,,,,,,,,,,,,,,
600,600,600,600,600,600,600,600,600,600,600,600,600,600,600,600,,,,,,,,,,,,,,,,,,,,,,
600,600,600,600,600,600,600,600,600,600,600,600,600,600,600,600,,,,,,,,,,,,,,,,,,,,,,
600,600,600,600,600,600,600,600,600,600,600,600,600,600,600,600,,,,,,,,,,,,,,,,,,,,,,
600,600,600,600,600,600,600,600,600,600,600,600,600,600,600,600,,,,,,,,,,,,,,,,,,,,,,
600,600,600,600,600,600,600,600,600,600,600,600,600,600,600,600,,,,,,,,,,,,,,,,,,,,,,
600,600,600,600,600,600,600,600,600,600,600,600,600,600,600,600,,,,,,,,,,,,,,,,,,,,,,
600,600,600,600,600,600,600,600,600,600,600,600,600,600,600,600,,,,,,,,,,,,,,,,,,,,,,
600,600,600,600,600,600,600,600,600,600,600,600,600,600,600,600,,,,,,,,,,,,,,,,,,,,,,
600,600,600,600,600,600,600,600,600,600,600,600,600,600,600,600,,,,,,,,,,,,,,,,,,,,,,
600,600,600,600,600,600,600,600,600,600,600,600,600,600,600,600,,,,,,,,,,,,,,,,,,,,,,
600,600,600,600,600,600,600,600,600,600,600,600,600,600,600,600,,,,,,,,,,,,,,,,,,,,,,
600,600,600,600,600,600,600,600,600,600,600,600,600,600,600,600,,,,,,,,,,,,,,,,,,,,,,
600,600,600,600,600,600,600,600,600,600,600,600,600,600,600,600,,,,,,,,,,,,,,,,,,,,,,
600,600,600,600,600,600,600,600,600,600,600,600,600,600,600,600,,,,,,,,,,,,,,,,,,,,,,
600,600,600,600,600,600,600,600,600,600,600,600,600,600,600,600,,,,,,,,,,,,,,,,,,,,,,
600,600,600,600,600,600,600,600,600,600,600,600,600,600,600,600,,,,,,,,,,,,,,,,,,,,,,
600,600,600,600,600,600,600,600,600,600,600,600,600,600,600,600,,,,,,,,,,,,,,,,,,,,,,
600,600,600,600,600,600,600,600,600,600,600,600,600,600,600,600,,,,,,,,,,,,,,,,,,,,,,
600,600,600,600,600,600,600,600,600,600,600,600,600,600,600,600,,,,,,,,,,,,,,,,,,,,,,
600,600,600,600,600,600,600,600,600,600,600,600,600,600,600,600,,,,,,,,,,,,,,,,,,,,,,
2000,2000,2000,2000,2000,2000,2000,2000,2000,2000,2000,2000,2000,2000,2000,4000,,,,,,,,,,,,,,,,,,,,,,
"threshold,raw_data_col_delta_max_array",,,,,,,,,,,,,,,,,,,,,,,,,,,,,,,,,,,,,
1000,1500,1500,1500,1500,1500,2500,1000,2500,600,600,2000,600,1500,3000,,,,,,,,,,,,,,,,,,,,,,,
600,600,600,600,600,600,2000,1000,1000,600,600,600,600,2000,1000,,,,,,,,,,,,,,,,,,,,,,,
600,600,600,600,600,600,600,600,600,600,600,600,600,600,1000,,,,,,,,,,,,,,,,,,,,,,,
600,600,600,600,600,600,600,600,600,600,600,600,600,600,600,,,,,,,,,,,,,,,,,,,,,,,
600,600,600,600,600,600,600,600,600,600,600,600,600,600,600,,,,,,,,,,,,,,,,,,,,,,,
600,600,600,600,600,600,600,600,600,600,600,600,600,600,600,,,,,,,,,,,,,,,,,,,,,,,
600,600,600,600,600,600,600,600,600,600,600,600,600,600,600,,,,,,,,,,,,,,,,,,,,,,,
600,600,600,600,600,600,600,600,600,600,600,600,600,600,600,,,,,,,,,,,,,,,,,,,,,,,
600,600,600,600,600,600,600,600,600,600,600,600,600,600,600,,,,,,,,,,,,,,,,,,,,,,,
600,600,600,600,600,600,600,600,600,600,600,600,600,600,600,,,,,,,,,,,,,,,,,,,,,,,
600,600,600,600,600,600,600,600,600,600,600,600,600,600,600,,,,,,,,,,,,,,,,,,,,,,,
600,600,600,600,600,600,600,600,600,600,600,600,600,600,600,,,,,,,,,,,,,,,,,,,,,,,
600,600,600,600,600,600,600,600,600,600,600,600,600,600,600,,,,,,,,,,,,,,,,,,,,,,,
600,600,600,600,600,600,600,600,600,600,600,600,600,600,600,,,,,,,,,,,,,,,,,,,,,,,
600,600,600,600,600,600,600,600,600,600,600,600,600,600,600,,,,,,,,,,,,,,,,,,,,,,,
600,600,600,600,600,600,600,600,600,600,600,600,600,600,600,,,,,,,,,,,,,,,,,,,,,,,
600,600,600,600,600,600,600,600,600,600,600,600,600,600,600,,,,,,,,,,,,,,,,,,,,,,,
600,600,600,600,600,600,600,600,600,600,600,600,600,600,600,,,,,,,,,,,,,,,,,,,,,,,
600,600,600,600,600,600,600,600,600,600,600,600,600,600,600,,,,,,,,,,,,,,,,,,,,,,,
600,600,600,600,600,600,600,600,600,600,600,600,600,600,600,,,,,,,,,,,,,,,,,,,,,,,
600,600,600,600,600,600,600,600,600,600,600,600,600,600,600,,,,,,,,,,,,,,,,,,,,,,,
600,600,600,600,600,600,600,600,600,600,600,600,600,600,600,,,,,,,,,,,,,,,,,,,,,,,
600,600,600,600,600,600,600,600,600,600,600,600,600,600,600,,,,,,,,,,,,,,,,,,,,,,,
600,600,600,600,600,600,600,600,600,600,600,600,600,600,600,,,,,,,,,,,,,,,,,,,,,,,
600,600,600,600,600,600,600,600,600,600,600,600,600,600,600,,,,,,,,,,,,,,,,,,,,,,,
600,600,600,600,600,600,600,600,600,600,600,600,600,600,600,,,,,,,,,,,,,,,,,,,,,,,
600,600,600,600,600,600,600,600,600,600,600,600,600,600,600,,,,,,,,,,,,,,,,,,,,,,,
600,600,600,600,600,600,600,600,600,600,600,600,600,600,600,,,,,,,,,,,,,,,,,,,,,,,
600,600,600,600,600,600,600,600,600,600,600,600,600,600,600,,,,,,,,,,,,,,,,,,,,,,,
600,600,600,600,600,600,600,600,600,600,600,600,600,600,600,,,,,,,,,,,,,,,,,,,,,,,
600,600,600,600,600,600,600,600,600,600,600,600,600,600,600,,,,,,,,,,,,,,,,,,,,,,,
600,600,600,600,600,600,600,600,600,600,600,600,600,600,600,,,,,,,,,,,,,,,,,,,,,,,
600,600,600,600,600,600,600,600,600,600,600,600,600,600,600,,,,,,,,,,,,,,,,,,,,,,,
600,600,600,600,600,600,600,600,600,600,600,600,600,600,600,,,,,,,,,,,,,,,,,,,,,,,
600,600,600,600,600,600,600,600,600,600,600,600,600,600,600,,,,,,,,,,,,,,,,,,,,,,,
600,600,600,600,600,600,600,600,600,600,600,600,600,600,600,,,,,,,,,,,,,,,,,,,,,,,
600,600,600,600,600,600,600,600,600,600,600,600,600,600,600,,,,,,,,,,,,,,,,,,,,,,,
2000,600,600,600,600,600,600,600,600,600,600,600,600,600,2000,,,,,,,,,,,,,,,,,,,,,,,
"threshold,self_cap_raw_data_col_min_array",,,,,,,,,,,,,,,,,,,,,,,,,,,,,,,,,,,,,
5000,5000,5000,5000,5000,5000,5000,5000,5000,5000,5000,5000,5000,5000,5000,5000,,,,,,,,,,,,,,,,,,,,,,
"threshold,self_cap_raw_data_col_max_array",,,,,,,,,,,,,,,,,,,,,,,,,,,,,,,,,,,,,
60000,60000,60000,60000,60000,60000,60000,60000,60000,60000,60000,60000,60000,60000,60000,60000,,,,,,,,,,,,,,,,,,,,,,
"threshold,self_cap_raw_data_row_min_array",,,,,,,,,,,,,,,,,,,,,,,,,,,,,,,,,,,,,
5000,5000,5000,5000,5000,5000,5000,5000,5000,5000,5000,5000,5000,5000,5000,5000,5000,5000,5000,5000,5000,5000,5000,5000,5000,5000,5000,5000,5000,5000,5000,5000,5000,5000,5000,5000,5000,5000
"threshold,self_cap_raw_data_row_max_array",,,,,,,,,,,,,,,,,,,,,,,,,,,,,,,,,,,,,
60000,60000,60000,60000,60000,60000,60000,60000,60000,60000,60000,60000,60000,60000,60000,60000,60000,60000,60000,60000,60000,60000,60000,60000,60000,60000,60000,60000,60000,60000,60000,60000,60000,60000,60000,60000,60000,60000
