{
  "beat": [
    0,224,416,608,768,960,1120,1280,1440,1664,1856,2016,2208,2368,2528,2720,2976,3360,3552,3712,3872,4064,4256,4480,4640,4864,5088,5248,5472,5664,5824,6016,6176,6368,6592,6752,7168,7328,7584,7776,8064,8576,8768,8928,9120,9344,9568,9792,9952,10144,10304,10464,10656,10816,11008,11264,11424,11648,11968,12128,12352,12512,12704,12864,13152,13440,13600,13792,13952,14144,14464,14784,15168,15328,15520,15744,16000,16191,16351,16576,16864,17056,17408,17664,17984,18144,18368,18528,18816,19072,19264,19424,19584,19968,20128,20288,20512,20704,20864,21120,21568,21728,21920,22144,22336,22528,22720,22880,23104,23264,23456,23616,23808,24064,24224,24576,24768,24928,25120,25312,25504,25664,25920,26432,26592,26752,26912,27072,27232,27424,27616,27808,27968,28192,28352,28544,30038
    ],
  "beat_count": 137,
  "downbeat": [
    0,
    256,
    3872,
    5824,
    7584,
    11008,
    14784,
    18816,
    21728,
    23808,
    27616,
    29952,
    30038
    ],
  "downbeat_count": 13
}