"threshold,cap_raw_data_max_array",,,,,,,,,,,,,,,,,,,,,,,,,,,,,,,,,,,,,
19430,19464,19066,19538,19566,19141,19606,19459,19428,19664,19675,19696,19271,19316,19144,19800,,,,,,,,,,,,,,,,,,,,,,
19872,19868,19897,19872,19878,19894,19885,19564,19512,19878,19873,19871,19883,19884,19026,19342,,,,,,,,,,,,,,,,,,,,,,
19014,18985,19000,18977,18983,19000,19000,19023,19027,19001,18988,18985,18999,18998,19029,19319,,,,,,,,,,,,,,,,,,,,,,
19007,18980,18991,18968,18972,18987,18981,19001,19004,18981,18974,18973,18988,18987,19018,19129,,,,,,,,,,,,,,,,,,,,,,
19024,18998,19011,18989,18991,19005,18995,19012,19014,18995,18992,18992,19007,19006,19044,19114,,,,,,,,,,,,,,,,,,,,,,
18999,18968,18983,18961,18965,18978,18968,18981,18983,18966,19083,19099,19067,19118,19012,19219,,,,,,,,,,,,,,,,,,,,,,
18991,18962,18976,18953,18957,18972,18960,18973,18973,18957,18954,18955,18970,18968,18997,19050,,,,,,,,,,,,,,,,,,,,,,
19007,18985,18999,18978,18982,18996,18983,18997,18997,18981,18980,18980,18995,18993,19021,19060,,,,,,,,,,,,,,,,,,,,,,
19026,19014,19028,19008,19013,19026,19013,19028,19029,19012,19020,19010,19023,19022,19052,19081,,,,,,,,,,,,,,,,,,,,,,
19029,19020,19034,19015,19019,19031,19019,19034,19036,19027,19016,19016,19029,19028,19058,19077,,,,,,,,,,,,,,,,,,,,,,
19022,19014,19028,19008,19013,19026,19012,19027,19028,19012,19010,19007,19029,19021,19050,19058,,,,,,,,,,,,,,,,,,,,,,
19023,19019,19033,19013,19018,19031,19018,19031,19033,19016,19013,19013,19026,19026,19054,19053,,,,,,,,,,,,,,,,,,,,,,
18996,18988,19001,18983,18989,19001,18989,19003,19004,18988,18984,18984,18997,19018,19024,19118,,,,,,,,,,,,,,,,,,,,,,
18967,18953,18968,18950,18954,18968,18955,18969,18969,18953,18950,18947,18960,18960,18988,18969,,,,,,,,,,,,,,,,,,,,,,
18962,18951,18964,18945,18951,18965,18952,18966,18967,18950,18946,18944,18954,18955,18984,18960,,,,,,,,,,,,,,,,,,,,,,
18962,18954,18967,18950,18955,18968,18954,18968,18969,18952,18947,18945,18957,18958,18988,18955,,,,,,,,,,,,,,,,,,,,,,
18950,18945,18958,18942,18947,18958,18944,18958,18968,18943,18939,18935,18947,18947,18977,18939,,,,,,,,,,,,,,,,,,,,,,
18950,18945,18960,18943,18949,18959,18945,18959,18961,18944,18939,18945,18947,18949,18977,18934,,,,,,,,,,,,,,,,,,,,,,
18952,18952,18967,18950,18955,18966,18952,18965,18967,18950,18945,18942,18953,18962,18982,18934,,,,,,,,,,,,,,,,,,,,,,
18926,18922,18936,18919,18926,18936,18921,18935,18937,18920,18915,18911,18922,18923,18951,18895,,,,,,,,,,,,,,,,,,,,,,
18876,18868,18883,18875,18874,18883,18868,18881,18883,18867,18862,18858,18869,18870,18898,18834,,,,,,,,,,,,,,,,,,,,,,
18838,18826,18842,18823,18829,18838,18830,18835,18836,18820,18815,18812,18823,18824,18852,18781,,,,,,,,,,,,,,,,,,,,,,
18821,18819,18824,18806,18811,18819,18801,18815,18817,18801,18796,18792,18803,18805,18832,18757,,,,,,,,,,,,,,,,,,,,,,
18789,18778,18788,18808,18773,18781,18762,18776,18780,18762,18757,18752,18763,18766,18794,18715,,,,,,,,,,,,,,,,,,,,,,
18800,18789,18801,18783,18786,18793,18777,18790,18792,18775,18770,18766,18777,18780,18808,18723,,,,,,,,,,,,,,,,,,,,,,
18840,18850,18852,18850,18837,18844,18827,18840,18842,18824,18820,18816,18828,18830,18860,18763,,,,,,,,,,,,,,,,,,,,,,
18837,18844,18853,18835,18838,18852,18828,18840,18840,18823,18819,18815,18827,18830,18861,18758,,,,,,,,,,,,,,,,,,,,,,
18805,18807,18823,18796,18798,18806,18790,18801,18801,18784,18780,18776,18788,18793,18822,18714,,,,,,,,,,,,,,,,,,,,,,
18781,18780,18788,18768,18769,18777,18761,18774,18774,18755,18750,18747,18763,18767,18794,18684,,,,,,,,,,,,,,,,,,,,,,
18760,18862,18817,18819,18758,18846,18850,18753,18752,18735,18729,18724,18747,18744,18775,18661,,,,,,,,,,,,,,,,,,,,,,
18734,18735,18742,18720,18722,18730,18714,18725,18725,18707,18701,18701,18720,18719,18750,18637,,,,,,,,,,,,,,,,,,,,,,
18720,18737,18729,18792,18708,18715,18699,18712,18711,18692,18686,18692,18706,18706,18738,18621,,,,,,,,,,,,,,,,,,,,,,
18747,18758,18763,18740,18742,18750,18734,18745,18744,18725,18724,18729,18744,18743,18777,18656,,,,,,,,,,,,,,,,,,,,,,
18759,18775,18780,18757,18759,18766,18750,18761,18760,18742,18745,18747,18762,18760,18794,18671,,,,,,,,,,,,,,,,,,,,,,
18750,18769,18774,18752,18755,18763,18747,18760,18758,18743,18745,18746,18760,18759,18794,18667,,,,,,,,,,,,,,,,,,,,,,
18758,18788,18797,18776,18788,18790,18774,18786,18785,18773,18770,18770,18784,18783,18820,18685,,,,,,,,,,,,,,,,,,,,,,
18751,18794,18814,18798,18806,18815,18799,18820,18817,18801,18799,18797,18808,18804,18837,18682,,,,,,,,,,,,,,,,,,,,,,
19164,19596,19621,19642,19674,19640,19658,19698,19735,19733,19747,19763,19782,19687,19745,19952,,,,,,,,,,,,,,,,,,,,,,
"threshold,cap_raw_data_min_array",,,,,,,,,,,,,,,,,,,,,,,,,,,,,,,,,,,,,
12954,12976,12710,13026,13044,12761,13070,12973,12952,13110,13117,13130,12847,12878,12762,13000,,,,,,,,,,,,,,,,,,,,,,
13248,13246,13265,13248,13252,13262,13257,13042,13008,13252,13249,13247,13255,13256,12684,12894,,,,,,,,,,,,,,,,,,,,,,
14054,14033,14044,14027,14031,14044,14044,14061,14063,14045,14034,14033,14043,14042,14065,14279,,,,,,,,,,,,,,,,,,,,,,
14049,14028,14037,14020,14022,14034,14029,14045,14046,14029,14024,14023,14034,14034,14056,14139,,,,,,,,,,,,,,,,,,,,,,
14062,14042,14051,14035,14037,14047,14039,14052,14054,14039,14038,14038,14049,14048,14076,14128,,,,,,,,,,,,,,,,,,,,,,
14043,14020,14031,14015,14017,14028,14020,14029,14031,14018,14105,14117,14093,14130,14052,14205,,,,,,,,,,,,,,,,,,,,,,
14037,14016,14026,14009,14011,14022,14014,14023,14023,14011,14010,14011,14022,14020,14041,14080,,,,,,,,,,,,,,,,,,,,,,
14049,14033,14043,14028,14030,14040,14031,14041,14041,14029,14028,14028,14039,14039,14059,14088,,,,,,,,,,,,,,,,,,,,,,
14062,14054,14064,14050,14053,14062,14053,14064,14065,14052,14058,14051,14061,14060,14082,14103,,,,,,,,,,,,,,,,,,,,,,
14065,14058,14068,14055,14057,14067,14057,14068,14070,14063,14056,14056,14065,14064,14086,14101,,,,,,,,,,,,,,,,,,,,,,
14060,14054,14064,14050,14053,14062,14052,14063,14064,14052,14051,14049,14065,14059,14080,14086,,,,,,,,,,,,,,,,,,,,,,
14061,14057,14068,14053,14056,14067,14056,14067,14068,14056,14053,14053,14062,14062,14084,14083,,,,,,,,,,,,,,,,,,,,,,
14040,14034,14045,14031,14035,14045,14035,14045,14046,14034,14032,14032,14041,14056,14062,14130,,,,,,,,,,,,,,,,,,,,,,
14019,14009,14020,14006,14010,14020,14011,14021,14021,14009,14006,14005,14014,14014,14034,14021,,,,,,,,,,,,,,,,,,,,,,
14016,14007,14017,14003,14007,14017,14008,14018,14019,14006,14004,14002,14010,14011,14032,14014,,,,,,,,,,,,,,,,,,,,,,
14016,14010,14019,14006,14011,14020,14010,14020,14021,14008,14005,14003,14011,14012,14034,14011,,,,,,,,,,,,,,,,,,,,,,
14006,14003,14012,14000,14005,14012,14002,14012,14020,14001,13999,13995,14005,14005,14027,13999,,,,,,,,,,,,,,,,,,,,,,
14006,14003,14014,14001,14005,14013,14003,14013,14015,14002,13999,14003,14005,14005,14027,13994,,,,,,,,,,,,,,,,,,,,,,
14008,14008,14019,14006,14011,14018,14008,14017,14019,14006,14003,14000,14009,14016,14030,13994,,,,,,,,,,,,,,,,,,,,,,
13988,13986,13996,13983,13988,13996,13985,13995,13997,13984,13981,13977,13986,13987,14007,13966,,,,,,,,,,,,,,,,,,,,,,
13952,13946,13957,13951,13950,13957,13946,13955,13957,13945,13942,13938,13947,13948,13968,13920,,,,,,,,,,,,,,,,,,,,,,
13924,13915,13926,13913,13917,13924,13918,13921,13922,13910,13907,13904,13913,13914,13934,13881,,,,,,,,,,,,,,,,,,,,,,
13911,13909,13914,13900,13903,13909,13897,13907,13909,13897,13892,13890,13898,13899,13920,13864,,,,,,,,,,,,,,,,,,,,,,
13887,13880,13886,13902,13875,13881,13868,13878,13881,13868,13864,13860,13869,13870,13892,13833,,,,,,,,,,,,,,,,,,,,,,
13896,13887,13897,13883,13886,13891,13879,13888,13890,13877,13874,13870,13879,13881,13902,13839,,,,,,,,,,,,,,,,,,,,,,
13926,13932,13934,13932,13923,13928,13915,13926,13926,13914,13910,13908,13916,13918,13940,13869,,,,,,,,,,,,,,,,,,,,,,
13923,13928,13935,13921,13924,13934,13916,13926,13926,13913,13909,13907,13915,13918,13941,13864,,,,,,,,,,,,,,,,,,,,,,
13899,13901,13913,13892,13894,13900,13888,13897,13897,13884,13881,13878,13886,13891,13912,13832,,,,,,,,,,,,,,,,,,,,,,
13881,13881,13886,13872,13873,13879,13867,13876,13876,13863,13858,13857,13869,13871,13892,13810,,,,,,,,,,,,,,,,,,,,,,
13866,13942,13909,13909,13864,13930,13932,13861,13860,13847,13843,13840,13857,13854,13877,13793,,,,,,,,,,,,,,,,,,,,,,
13847,13847,13852,13836,13838,13844,13832,13841,13841,13827,13823,13823,13836,13835,13858,13775,,,,,,,,,,,,,,,,,,,,,,
13836,13849,13843,13890,13828,13833,13821,13830,13830,13816,13812,13816,13826,13826,13850,13763,,,,,,,,,,,,,,,,,,,,,,
13857,13864,13869,13852,13852,13858,13847,13855,13854,13841,13840,13843,13854,13853,13879,13790,,,,,,,,,,,,,,,,,,,,,,
13865,13877,13881,13864,13865,13870,13858,13867,13866,13852,13855,13857,13868,13866,13892,13801,,,,,,,,,,,,,,,,,,,,,,
13858,13873,13876,13860,13863,13869,13857,13866,13864,13853,13855,13856,13866,13865,13892,13797,,,,,,,,,,,,,,,,,,,,,,
13864,13886,13893,13878,13886,13888,13876,13886,13885,13875,13874,13874,13884,13883,13910,13811,,,,,,,,,,,,,,,,,,,,,,
13859,13892,13906,13894,13900,13907,13895,13910,13909,13897,13895,13893,13902,13898,13923,13808,,,,,,,,,,,,,,,,,,,,,,
12776,13064,13081,13094,13116,13094,13106,13132,13157,13155,13165,13175,13188,13125,13163,12500,,,,,,,,,,,,,,,,,,,,,,
"threshold,lcd_noise_max_array",,,,,,,,,,,,,,,,,,,,,,,,,,,,,,,,,,,,,
100,55,55,55,55,55,55,55,55,55,55,55,55,55,55,100,,,,,,,,,,,,,,,,,,,,,,
55,55,55,55,55,55,55,55,55,55,55,55,55,55,55,55,,,,,,,,,,,,,,,,,,,,,,
55,55,55,55,55,55,55,55,55,55,55,55,55,55,55,55,,,,,,,,,,,,,,,,,,,,,,
55,55,55,55,55,55,55,55,55,55,55,55,55,55,55,55,,,,,,,,,,,,,,,,,,,,,,
55,55,55,55,55,55,55,55,55,55,55,55,55,55,55,55,,,,,,,,,,,,,,,,,,,,,,
55,55,55,55,55,55,55,55,55,55,55,55,55,55,55,55,,,,,,,,,,,,,,,,,,,,,,
55,55,55,55,55,55,55,55,55,55,55,55,55,55,55,55,,,,,,,,,,,,,,,,,,,,,,
55,55,55,55,55,55,55,55,55,55,55,55,55,55,55,55,,,,,,,,,,,,,,,,,,,,,,
55,55,55,55,55,55,55,55,55,55,55,55,55,55,55,55,,,,,,,,,,,,,,,,,,,,,,
55,55,55,55,55,55,55,55,55,55,55,55,55,55,55,55,,,,,,,,,,,,,,,,,,,,,,
55,55,55,55,55,55,55,55,55,55,55,55,55,55,55,55,,,,,,,,,,,,,,,,,,,,,,
55,55,55,55,55,55,55,55,55,55,55,55,55,55,55,55,,,,,,,,,,,,,,,,,,,,,,
55,55,55,55,55,55,55,55,55,55,55,55,55,55,55,55,,,,,,,,,,,,,,,,,,,,,,
55,55,55,55,55,55,55,55,55,55,55,55,55,55,55,55,,,,,,,,,,,,,,,,,,,,,,
55,55,55,55,55,55,55,55,55,55,55,55,55,55,55,55,,,,,,,,,,,,,,,,,,,,,,
55,55,55,55,55,55,55,55,55,55,55,55,55,55,55,55,,,,,,,,,,,,,,,,,,,,,,
55,55,55,55,55,55,55,55,55,55,55,55,55,55,55,55,,,,,,,,,,,,,,,,,,,,,,
55,55,55,55,55,55,55,55,55,55,55,55,55,55,55,55,,,,,,,,,,,,,,,,,,,,,,
55,55,55,55,55,55,55,55,55,55,55,55,55,55,55,55,,,,,,,,,,,,,,,,,,,,,,
55,55,55,55,55,55,55,55,55,55,55,55,55,55,55,55,,,,,,,,,,,,,,,,,,,,,,
55,55,55,55,55,55,55,55,55,55,55,55,55,55,55,55,,,,,,,,,,,,,,,,,,,,,,
55,55,55,55,55,55,55,55,55,55,55,55,55,55,55,55,,,,,,,,,,,,,,,,,,,,,,
55,55,55,55,55,55,55,55,55,55,55,55,55,55,55,55,,,,,,,,,,,,,,,,,,,,,,
55,55,55,55,55,55,55,55,55,55,55,55,55,55,55,55,,,,,,,,,,,,,,,,,,,,,,
55,55,55,55,55,55,55,55,55,55,55,55,55,55,55,55,,,,,,,,,,,,,,,,,,,,,,
55,55,55,55,55,55,55,55,55,55,55,55,55,55,55,55,,,,,,,,,,,,,,,,,,,,,,
55,55,55,55,55,55,55,55,55,55,55,55,55,55,55,55,,,,,,,,,,,,,,,,,,,,,,
55,55,55,55,55,55,55,55,55,55,55,55,55,55,55,55,,,,,,,,,,,,,,,,,,,,,,
55,55,55,55,55,55,55,55,55,55,55,55,55,55,55,55,,,,,,,,,,,,,,,,,,,,,,
55,55,55,55,55,55,55,55,55,55,55,55,55,55,55,55,,,,,,,,,,,,,,,,,,,,,,
55,55,55,55,55,55,55,55,55,55,55,55,55,55,55,55,,,,,,,,,,,,,,,,,,,,,,
55,55,55,55,55,55,55,55,55,55,55,55,55,55,55,55,,,,,,,,,,,,,,,,,,,,,,
55,55,55,55,55,55,55,55,55,55,55,55,55,55,55,55,,,,,,,,,,,,,,,,,,,,,,
55,55,55,55,55,55,55,55,55,55,55,55,55,55,55,55,,,,,,,,,,,,,,,,,,,,,,
55,55,55,55,55,55,55,55,55,55,55,55,55,55,55,55,,,,,,,,,,,,,,,,,,,,,,
55,55,55,55,55,55,55,55,55,55,55,55,55,55,55,55,,,,,,,,,,,,,,,,,,,,,,
55,55,55,55,55,55,55,55,55,55,55,55,55,55,55,55,,,,,,,,,,,,,,,,,,,,,,
100,55,55,55,55,55,55,55,55,55,55,55,55,55,55,100,,,,,,,,,,,,,,,,,,,,,,
"threshold,raw_data_max_array",,,,,,,,,,,,,,,,,,,,,,,,,,,,,,,,,,,,,
3000,3000,3000,3000,3000,3000,3000,3000,3000,3000,3000,3000,3000,3000,3000,3000,,,,,,,,,,,,,,,,,,,,,,
3000,3000,3000,3000,3000,3000,3000,3000,3000,3000,3000,3000,3000,3000,3000,3000,,,,,,,,,,,,,,,,,,,,,,
3000,3000,3000,3000,3000,3000,3000,3000,3000,3000,3000,3000,3000,3000,3000,3000,,,,,,,,,,,,,,,,,,,,,,
3000,3000,3000,3000,3000,3000,3000,3000,3000,3000,3000,3000,3000,3000,3000,3000,,,,,,,,,,,,,,,,,,,,,,
3000,3000,3000,3000,3000,3000,3000,3000,3000,3000,3000,3000,3000,3000,3000,3000,,,,,,,,,,,,,,,,,,,,,,
3000,3000,3000,3000,3000,3000,3000,3000,3000,3000,3000,3000,3000,3000,3000,3000,,,,,,,,,,,,,,,,,,,,,,
3000,3000,3000,3000,3000,3000,3000,3000,3000,3000,3000,3000,3000,3000,3000,3000,,,,,,,,,,,,,,,,,,,,,,
3000,3000,3000,3000,3000,3000,3000,3000,3000,3000,3000,3000,3000,3000,3000,3000,,,,,,,,,,,,,,,,,,,,,,
3000,3000,3000,3000,3000,3000,3000,3000,3000,3000,3000,3000,3000,3000,3000,3000,,,,,,,,,,,,,,,,,,,,,,
3000,3000,3000,3000,3000,3000,3000,3000,3000,3000,3000,3000,3000,3000,3000,3000,,,,,,,,,,,,,,,,,,,,,,
3000,3000,3000,3000,3000,3000,3000,3000,3000,3000,3000,3000,3000,3000,3000,3000,,,,,,,,,,,,,,,,,,,,,,
3000,3000,3000,3000,3000,3000,3000,3000,3000,3000,3000,3000,3000,3000,3000,3000,,,,,,,,,,,,,,,,,,,,,,
3000,3000,3000,3000,3000,3000,3000,3000,3000,3000,3000,3000,3000,3000,3000,3000,,,,,,,,,,,,,,,,,,,,,,
3000,3000,3000,3000,3000,3000,3000,3000,3000,3000,3000,3000,3000,3000,3000,3000,,,,,,,,,,,,,,,,,,,,,,
3000,3000,3000,3000,3000,3000,3000,3000,3000,3000,3000,3000,3000,3000,3000,3000,,,,,,,,,,,,,,,,,,,,,,
3000,3000,3000,3000,3000,3000,3000,3000,3000,3000,3000,3000,3000,3000,3000,3000,,,,,,,,,,,,,,,,,,,,,,
3000,3000,3000,3000,3000,3000,3000,3000,3000,3000,3000,3000,3000,3000,3000,3000,,,,,,,,,,,,,,,,,,,,,,
3000,3000,3000,3000,3000,3000,3000,3000,3000,3000,3000,3000,3000,3000,3000,3000,,,,,,,,,,,,,,,,,,,,,,
3000,3000,3000,3000,3000,3000,3000,3000,3000,3000,3000,3000,3000,3000,3000,3000,,,,,,,,,,,,,,,,,,,,,,
3000,3000,3000,3000,3000,3000,3000,3000,3000,3000,3000,3000,3000,3000,3000,3000,,,,,,,,,,,,,,,,,,,,,,
3000,3000,3000,3000,3000,3000,3000,3000,3000,3000,3000,3000,3000,3000,3000,3000,,,,,,,,,,,,,,,,,,,,,,
3000,3000,3000,3000,3000,3000,3000,3000,3000,3000,3000,3000,3000,3000,3000,3000,,,,,,,,,,,,,,,,,,,,,,
3000,3000,3000,3000,3000,3000,3000,3000,3000,3000,3000,3000,3000,3000,3000,3000,,,,,,,,,,,,,,,,,,,,,,
3000,3000,3000,3000,3000,3000,3000,3000,3000,3000,3000,3000,3000,3000,3000,3000,,,,,,,,,,,,,,,,,,,,,,
3000,3000,3000,3000,3000,3000,3000,3000,3000,3000,3000,3000,3000,3000,3000,3000,,,,,,,,,,,,,,,,,,,,,,
3000,3000,3000,3000,3000,3000,3000,3000,3000,3000,3000,3000,3000,3000,3000,3000,,,,,,,,,,,,,,,,,,,,,,
3000,3000,3000,3000,3000,3000,3000,3000,3000,3000,3000,3000,3000,3000,3000,3000,,,,,,,,,,,,,,,,,,,,,,
3000,3000,3000,3000,3000,3000,3000,3000,3000,3000,3000,3000,3000,3000,3000,3000,,,,,,,,,,,,,,,,,,,,,,
3000,3000,3000,3000,3000,3000,3000,3000,3000,3000,3000,3000,3000,3000,3000,3000,,,,,,,,,,,,,,,,,,,,,,
3000,3000,3000,3000,3000,3000,3000,3000,3000,3000,3000,3000,3000,3000,3000,3000,,,,,,,,,,,,,,,,,,,,,,
3000,3000,3000,3000,3000,3000,3000,3000,3000,3000,3000,3000,3000,3000,3000,3000,,,,,,,,,,,,,,,,,,,,,,
3000,3000,3000,3000,3000,3000,3000,3000,3000,3000,3000,3000,3000,3000,3000,3000,,,,,,,,,,,,,,,,,,,,,,
3000,3000,3000,3000,3000,3000,3000,3000,3000,3000,3000,3000,3000,3000,3000,3000,,,,,,,,,,,,,,,,,,,,,,
3000,3000,3000,3000,3000,3000,3000,3000,3000,3000,3000,3000,3000,3000,3000,3000,,,,,,,,,,,,,,,,,,,,,,
3000,3000,3000,3000,3000,3000,3000,3000,3000,3000,3000,3000,3000,3000,3000,3000,,,,,,,,,,,,,,,,,,,,,,
3000,3000,3000,3000,3000,3000,3000,3000,3000,3000,3000,3000,3000,3000,3000,3000,,,,,,,,,,,,,,,,,,,,,,
3000,3000,3000,3000,3000,3000,3000,3000,3000,3000,3000,3000,3000,3000,3000,3000,,,,,,,,,,,,,,,,,,,,,,
3000,3000,3000,3000,3000,3000,3000,3000,3000,3000,3000,3000,3000,3000,3000,3000,,,,,,,,,,,,,,,,,,,,,,
"threshold,raw_data_min_array",,,,,,,,,,,,,,,,,,,,,,,,,,,,,,,,,,,,,
100,100,100,100,100,100,100,100,100,100,100,100,100,100,100,100,,,,,,,,,,,,,,,,,,,,,,
100,100,100,100,100,100,100,100,100,100,100,100,100,100,100,100,,,,,,,,,,,,,,,,,,,,,,
100,100,100,100,100,100,100,100,100,100,100,100,100,100,100,100,,,,,,,,,,,,,,,,,,,,,,
100,100,100,100,100,100,100,100,100,100,100,100,100,100,100,100,,,,,,,,,,,,,,,,,,,,,,
100,100,100,100,100,100,100,100,100,100,100,100,100,100,100,100,,,,,,,,,,,,,,,,,,,,,,
100,100,100,100,100,100,100,100,100,100,100,100,100,100,100,100,,,,,,,,,,,,,,,,,,,,,,
100,100,100,100,100,100,100,100,100,100,100,100,100,100,100,100,,,,,,,,,,,,,,,,,,,,,,
100,100,100,100,100,100,100,100,100,100,100,100,100,100,100,100,,,,,,,,,,,,,,,,,,,,,,
100,100,100,100,100,100,100,100,100,100,100,100,100,100,100,100,,,,,,,,,,,,,,,,,,,,,,
100,100,100,100,100,100,100,100,100,100,100,100,100,100,100,100,,,,,,,,,,,,,,,,,,,,,,
100,100,100,100,100,100,100,100,100,100,100,100,100,100,100,100,,,,,,,,,,,,,,,,,,,,,,
100,100,100,100,100,100,100,100,100,100,100,100,100,100,100,100,,,,,,,,,,,,,,,,,,,,,,
100,100,100,100,100,100,100,100,100,100,100,100,100,100,100,100,,,,,,,,,,,,,,,,,,,,,,
100,100,100,100,100,100,100,100,100,100,100,100,100,100,100,100,,,,,,,,,,,,,,,,,,,,,,
100,100,100,100,100,100,100,100,100,100,100,100,100,100,100,100,,,,,,,,,,,,,,,,,,,,,,
100,100,100,100,100,100,100,100,100,100,100,100,100,100,100,100,,,,,,,,,,,,,,,,,,,,,,
100,100,100,100,100,100,100,100,100,100,100,100,100,100,100,100,,,,,,,,,,,,,,,,,,,,,,
100,100,100,100,100,100,100,100,100,100,100,100,100,100,100,100,,,,,,,,,,,,,,,,,,,,,,
100,100,100,100,100,100,100,100,100,100,100,100,100,100,100,100,,,,,,,,,,,,,,,,,,,,,,
100,100,100,100,100,100,100,100,100,100,100,100,100,100,100,100,,,,,,,,,,,,,,,,,,,,,,
100,100,100,100,100,100,100,100,100,100,100,100,100,100,100,100,,,,,,,,,,,,,,,,,,,,,,
100,100,100,100,100,100,100,100,100,100,100,100,100,100,100,100,,,,,,,,,,,,,,,,,,,,,,
100,100,100,100,100,100,100,100,100,100,100,100,100,100,100,100,,,,,,,,,,,,,,,,,,,,,,
100,100,100,100,100,100,100,100,100,100,100,100,100,100,100,100,,,,,,,,,,,,,,,,,,,,,,
100,100,100,100,100,100,100,100,100,100,100,100,100,100,100,100,,,,,,,,,,,,,,,,,,,,,,
100,100,100,100,100,100,100,100,100,100,100,100,100,100,100,100,,,,,,,,,,,,,,,,,,,,,,
100,100,100,100,100,100,100,100,100,100,100,100,100,100,100,100,,,,,,,,,,,,,,,,,,,,,,
100,100,100,100,100,100,100,100,100,100,100,100,100,100,100,100,,,,,,,,,,,,,,,,,,,,,,
100,100,100,100,100,100,100,100,100,100,100,100,100,100,100,100,,,,,,,,,,,,,,,,,,,,,,
100,100,100,100,100,100,100,100,100,100,100,100,100,100,100,100,,,,,,,,,,,,,,,,,,,,,,
100,100,100,100,100,100,100,100,100,100,100,100,100,100,100,100,,,,,,,,,,,,,,,,,,,,,,
100,100,100,100,100,100,100,100,100,100,100,100,100,100,100,100,,,,,,,,,,,,,,,,,,,,,,
100,100,100,100,100,100,100,100,100,100,100,100,100,100,100,100,,,,,,,,,,,,,,,,,,,,,,
100,100,100,100,100,100,100,100,100,100,100,100,100,100,100,100,,,,,,,,,,,,,,,,,,,,,,
100,100,100,100,100,100,100,100,100,100,100,100,100,100,100,100,,,,,,,,,,,,,,,,,,,,,,
100,100,100,100,100,100,100,100,100,100,100,100,100,100,100,100,,,,,,,,,,,,,,,,,,,,,,
100,100,100,100,100,100,100,100,100,100,100,100,100,100,100,100,,,,,,,,,,,,,,,,,,,,,,
100,100,100,100,100,100,100,100,100,100,100,100,100,100,100,100,,,,,,,,,,,,,,,,,,,,,,
"threshold,open_short_max_array",,,,,,,,,,,,,,,,,,,,,,,,,,,,,,,,,,,,,
30000,30000,30000,30000,30000,30000,30000,30000,30000,30000,30000,30000,30000,30000,30000,30000,,,,,,,,,,,,,,,,,,,,,,
30000,30000,30000,30000,30000,30000,30000,30000,30000,30000,30000,30000,30000,30000,30000,30000,,,,,,,,,,,,,,,,,,,,,,
30000,30000,30000,30000,30000,30000,30000,30000,30000,30000,30000,30000,30000,30000,30000,30000,,,,,,,,,,,,,,,,,,,,,,
30000,30000,30000,30000,30000,30000,30000,30000,30000,30000,30000,30000,30000,30000,30000,30000,,,,,,,,,,,,,,,,,,,,,,
30000,30000,30000,30000,30000,30000,30000,30000,30000,30000,30000,30000,30000,30000,30000,30000,,,,,,,,,,,,,,,,,,,,,,
30000,30000,30000,30000,30000,30000,30000,30000,30000,30000,30000,30000,30000,30000,30000,30000,,,,,,,,,,,,,,,,,,,,,,
30000,30000,30000,30000,30000,30000,30000,30000,30000,30000,30000,30000,30000,30000,30000,30000,,,,,,,,,,,,,,,,,,,,,,
30000,30000,30000,30000,30000,30000,30000,30000,30000,30000,30000,30000,30000,30000,30000,30000,,,,,,,,,,,,,,,,,,,,,,
30000,30000,30000,30000,30000,30000,30000,30000,30000,30000,30000,30000,30000,30000,30000,30000,,,,,,,,,,,,,,,,,,,,,,
30000,30000,30000,30000,30000,30000,30000,30000,30000,30000,30000,30000,30000,30000,30000,30000,,,,,,,,,,,,,,,,,,,,,,
30000,30000,30000,30000,30000,30000,30000,30000,30000,30000,30000,30000,30000,30000,30000,30000,,,,,,,,,,,,,,,,,,,,,,
30000,30000,30000,30000,30000,30000,30000,30000,30000,30000,30000,30000,30000,30000,30000,30000,,,,,,,,,,,,,,,,,,,,,,
30000,30000,30000,30000,30000,30000,30000,30000,30000,30000,30000,30000,30000,30000,30000,30000,,,,,,,,,,,,,,,,,,,,,,
30000,30000,30000,30000,30000,30000,30000,30000,30000,30000,30000,30000,30000,30000,30000,30000,,,,,,,,,,,,,,,,,,,,,,
30000,30000,30000,30000,30000,30000,30000,30000,30000,30000,30000,30000,30000,30000,30000,30000,,,,,,,,,,,,,,,,,,,,,,
30000,30000,30000,30000,30000,30000,30000,30000,30000,30000,30000,30000,30000,30000,30000,30000,,,,,,,,,,,,,,,,,,,,,,
30000,30000,30000,30000,30000,30000,30000,30000,30000,30000,30000,30000,30000,30000,30000,30000,,,,,,,,,,,,,,,,,,,,,,
30000,30000,30000,30000,30000,30000,30000,30000,30000,30000,30000,30000,30000,30000,30000,30000,,,,,,,,,,,,,,,,,,,,,,
30000,30000,30000,30000,30000,30000,30000,30000,30000,30000,30000,30000,30000,30000,30000,30000,,,,,,,,,,,,,,,,,,,,,,
30000,30000,30000,30000,30000,30000,30000,30000,30000,30000,30000,30000,30000,30000,30000,30000,,,,,,,,,,,,,,,,,,,,,,
30000,30000,30000,30000,30000,30000,30000,30000,30000,30000,30000,30000,30000,30000,30000,30000,,,,,,,,,,,,,,,,,,,,,,
30000,30000,30000,30000,30000,30000,30000,30000,30000,30000,30000,30000,30000,30000,30000,30000,,,,,,,,,,,,,,,,,,,,,,
30000,30000,30000,30000,30000,30000,30000,30000,30000,30000,30000,30000,30000,30000,30000,30000,,,,,,,,,,,,,,,,,,,,,,
30000,30000,30000,30000,30000,30000,30000,30000,30000,30000,30000,30000,30000,30000,30000,30000,,,,,,,,,,,,,,,,,,,,,,
30000,30000,30000,30000,30000,30000,30000,30000,30000,30000,30000,30000,30000,30000,30000,30000,,,,,,,,,,,,,,,,,,,,,,
30000,30000,30000,30000,30000,30000,30000,30000,30000,30000,30000,30000,30000,30000,30000,30000,,,,,,,,,,,,,,,,,,,,,,
30000,30000,30000,30000,30000,30000,30000,30000,30000,30000,30000,30000,30000,30000,30000,30000,,,,,,,,,,,,,,,,,,,,,,
30000,30000,30000,30000,30000,30000,30000,30000,30000,30000,30000,30000,30000,30000,30000,30000,,,,,,,,,,,,,,,,,,,,,,
30000,30000,30000,30000,30000,30000,30000,30000,30000,30000,30000,30000,30000,30000,30000,30000,,,,,,,,,,,,,,,,,,,,,,
30000,30000,30000,30000,30000,30000,30000,30000,30000,30000,30000,30000,30000,30000,30000,30000,,,,,,,,,,,,,,,,,,,,,,
30000,30000,30000,30000,30000,30000,30000,30000,30000,30000,30000,30000,30000,30000,30000,30000,,,,,,,,,,,,,,,,,,,,,,
30000,30000,30000,30000,30000,30000,30000,30000,30000,30000,30000,30000,30000,30000,30000,30000,,,,,,,,,,,,,,,,,,,,,,
30000,30000,30000,30000,30000,30000,30000,30000,30000,30000,30000,30000,30000,30000,30000,30000,,,,,,,,,,,,,,,,,,,,,,
30000,30000,30000,30000,30000,30000,30000,30000,30000,30000,30000,30000,30000,30000,30000,30000,,,,,,,,,,,,,,,,,,,,,,
30000,30000,30000,30000,30000,30000,30000,30000,30000,30000,30000,30000,30000,30000,30000,30000,,,,,,,,,,,,,,,,,,,,,,
30000,30000,30000,30000,30000,30000,30000,30000,30000,30000,30000,30000,30000,30000,30000,30000,,,,,,,,,,,,,,,,,,,,,,
30000,30000,30000,30000,30000,30000,30000,30000,30000,30000,30000,30000,30000,30000,30000,30000,,,,,,,,,,,,,,,,,,,,,,
30000,30000,30000,30000,30000,30000,30000,30000,30000,30000,30000,30000,30000,30000,30000,30000,,,,,,,,,,,,,,,,,,,,,,
"threshold,open_short_min_array",,,,,,,,,,,,,,,,,,,,,,,,,,,,,,,,,,,,,
-30000,-30000,-30000,-30000,-30000,-30000,-30000,-30000,-30000,-30000,-30000,-30000,-30000,-30000,-30000,-30000,,,,,,,,,,,,,,,,,,,,,,
-30000,-30000,-30000,-30000,-30000,-30000,-30000,-30000,-30000,-30000,-30000,-30000,-30000,-30000,-30000,-30000,,,,,,,,,,,,,,,,,,,,,,
-30000,-30000,-30000,-30000,-30000,-30000,-30000,-30000,-30000,-30000,-30000,-30000,-30000,-30000,-30000,-30000,,,,,,,,,,,,,,,,,,,,,,
-30000,-30000,-30000,-30000,-30000,-30000,-30000,-30000,-30000,-30000,-30000,-30000,-30000,-30000,-30000,-30000,,,,,,,,,,,,,,,,,,,,,,
-30000,-30000,-30000,-30000,-30000,-30000,-30000,-30000,-30000,-30000,-30000,-30000,-30000,-30000,-30000,-30000,,,,,,,,,,,,,,,,,,,,,,
-30000,-30000,-30000,-30000,-30000,-30000,-30000,-30000,-30000,-30000,-30000,-30000,-30000,-30000,-30000,-30000,,,,,,,,,,,,,,,,,,,,,,
-30000,-30000,-30000,-30000,-30000,-30000,-30000,-30000,-30000,-30000,-30000,-30000,-30000,-30000,-30000,-30000,,,,,,,,,,,,,,,,,,,,,,
-30000,-30000,-30000,-30000,-30000,-30000,-30000,-30000,-30000,-30000,-30000,-30000,-30000,-30000,-30000,-30000,,,,,,,,,,,,,,,,,,,,,,
-30000,-30000,-30000,-30000,-30000,-30000,-30000,-30000,-30000,-30000,-30000,-30000,-30000,-30000,-30000,-30000,,,,,,,,,,,,,,,,,,,,,,
-30000,-30000,-30000,-30000,-30000,-30000,-30000,-30000,-30000,-30000,-30000,-30000,-30000,-30000,-30000,-30000,,,,,,,,,,,,,,,,,,,,,,
-30000,-30000,-30000,-30000,-30000,-30000,-30000,-30000,-30000,-30000,-30000,-30000,-30000,-30000,-30000,-30000,,,,,,,,,,,,,,,,,,,,,,
-30000,-30000,-30000,-30000,-30000,-30000,-30000,-30000,-30000,-30000,-30000,-30000,-30000,-30000,-30000,-30000,,,,,,,,,,,,,,,,,,,,,,
-30000,-30000,-30000,-30000,-30000,-30000,-30000,-30000,-30000,-30000,-30000,-30000,-30000,-30000,-30000,-30000,,,,,,,,,,,,,,,,,,,,,,
-30000,-30000,-30000,-30000,-30000,-30000,-30000,-30000,-30000,-30000,-30000,-30000,-30000,-30000,-30000,-30000,,,,,,,,,,,,,,,,,,,,,,
-30000,-30000,-30000,-30000,-30000,-30000,-30000,-30000,-30000,-30000,-30000,-30000,-30000,-30000,-30000,-30000,,,,,,,,,,,,,,,,,,,,,,
-30000,-30000,-30000,-30000,-30000,-30000,-30000,-30000,-30000,-30000,-30000,-30000,-30000,-30000,-30000,-30000,,,,,,,,,,,,,,,,,,,,,,
-30000,-30000,-30000,-30000,-30000,-30000,-30000,-30000,-30000,-30000,-30000,-30000,-30000,-30000,-30000,-30000,,,,,,,,,,,,,,,,,,,,,,
-30000,-30000,-30000,-30000,-30000,-30000,-30000,-30000,-30000,-30000,-30000,-30000,-30000,-30000,-30000,-30000,,,,,,,,,,,,,,,,,,,,,,
-30000,-30000,-30000,-30000,-30000,-30000,-30000,-30000,-30000,-30000,-30000,-30000,-30000,-30000,-30000,-30000,,,,,,,,,,,,,,,,,,,,,,
-30000,-30000,-30000,-30000,-30000,-30000,-30000,-30000,-30000,-30000,-30000,-30000,-30000,-30000,-30000,-30000,,,,,,,,,,,,,,,,,,,,,,
-30000,-30000,-30000,-30000,-30000,-30000,-30000,-30000,-30000,-30000,-30000,-30000,-30000,-30000,-30000,-30000,,,,,,,,,,,,,,,,,,,,,,
-30000,-30000,-30000,-30000,-30000,-30000,-30000,-30000,-30000,-30000,-30000,-30000,-30000,-30000,-30000,-30000,,,,,,,,,,,,,,,,,,,,,,
-30000,-30000,-30000,-30000,-30000,-30000,-30000,-30000,-30000,-30000,-30000,-30000,-30000,-30000,-30000,-30000,,,,,,,,,,,,,,,,,,,,,,
-30000,-30000,-30000,-30000,-30000,-30000,-30000,-30000,-30000,-30000,-30000,-30000,-30000,-30000,-30000,-30000,,,,,,,,,,,,,,,,,,,,,,
-30000,-30000,-30000,-30000,-30000,-30000,-30000,-30000,-30000,-30000,-30000,-30000,-30000,-30000,-30000,-30000,,,,,,,,,,,,,,,,,,,,,,
-30000,-30000,-30000,-30000,-30000,-30000,-30000,-30000,-30000,-30000,-30000,-30000,-30000,-30000,-30000,-30000,,,,,,,,,,,,,,,,,,,,,,
-30000,-30000,-30000,-30000,-30000,-30000,-30000,-30000,-30000,-30000,-30000,-30000,-30000,-30000,-30000,-30000,,,,,,,,,,,,,,,,,,,,,,
-30000,-30000,-30000,-30000,-30000,-30000,-30000,-30000,-30000,-30000,-30000,-30000,-30000,-30000,-30000,-30000,,,,,,,,,,,,,,,,,,,,,,
-30000,-30000,-30000,-30000,-30000,-30000,-30000,-30000,-30000,-30000,-30000,-30000,-30000,-30000,-30000,-30000,,,,,,,,,,,,,,,,,,,,,,
-30000,-30000,-30000,-30000,-30000,-30000,-30000,-30000,-30000,-30000,-30000,-30000,-30000,-30000,-30000,-30000,,,,,,,,,,,,,,,,,,,,,,
-30000,-30000,-30000,-30000,-30000,-30000,-30000,-30000,-30000,-30000,-30000,-30000,-30000,-30000,-30000,-30000,,,,,,,,,,,,,,,,,,,,,,
-30000,-30000,-30000,-30000,-30000,-30000,-30000,-30000,-30000,-30000,-30000,-30000,-30000,-30000,-30000,-30000,,,,,,,,,,,,,,,,,,,,,,
-30000,-30000,-30000,-30000,-30000,-30000,-30000,-30000,-30000,-30000,-30000,-30000,-30000,-30000,-30000,-30000,,,,,,,,,,,,,,,,,,,,,,
-30000,-30000,-30000,-30000,-30000,-30000,-30000,-30000,-30000,-30000,-30000,-30000,-30000,-30000,-30000,-30000,,,,,,,,,,,,,,,,,,,,,,
-30000,-30000,-30000,-30000,-30000,-30000,-30000,-30000,-30000,-30000,-30000,-30000,-30000,-30000,-30000,-30000,,,,,,,,,,,,,,,,,,,,,,
-30000,-30000,-30000,-30000,-30000,-30000,-30000,-30000,-30000,-30000,-30000,-30000,-30000,-30000,-30000,-30000,,,,,,,,,,,,,,,,,,,,,,
-30000,-30000,-30000,-30000,-30000,-30000,-30000,-30000,-30000,-30000,-30000,-30000,-30000,-30000,-30000,-30000,,,,,,,,,,,,,,,,,,,,,,
-30000,-30000,-30000,-30000,-30000,-30000,-30000,-30000,-30000,-30000,-30000,-30000,-30000,-30000,-30000,-30000,,,,,,,,,,,,,,,,,,,,,,
"threshold,raw_data_col_min_array",,,,,,,,,,,,,,,,,,,,,,,,,,,,,,,,,,,,,
190662,187539,187266,186974,187351,187251,187741,188243,188352,188291,188787,189468,189743,190214,190974,195404,,,,,,,,,,,,,,,,,,,,,,
"threshold,raw_data_col_max_array",,,,,,,,,,,,,,,,,,,,,,,,,,,,,,,,,,,,,
762646,750156,749064,747896,749404,749004,750962,752972,753406,753162,755146,757872,758970,760854,763896,781614,,,,,,,,,,,,,,,,,,,,,,
"threshold,raw_data_row_min_array",,,,,,,,,,,,,,,,,,,,,,,,,,,,,,,,,,,,,
81968,81948,80797,81141,80639,79943,80240,79719,79623,79058,79020,78404,78815,79048,79240,78400,78314,78354,78139,78473,79072,79996,79350,79236,78571,78648,78960,79094,78698,79090,79219,79038,78093,77872,78810,79344,79045,77054
"threshold,raw_data_row_max_array",,,,,,,,,,,,,,,,,,,,,,,,,,,,,,,,,,,,,
327872,327790,323188,324564,322556,319772,320958,318874,318490,316230,316080,313614,315258,316192,316958,313598,313256,313414,312556,313890,316288,319982,317398,316942,314282,314590,315840,316374,314790,316358,316874,316150,312372,311488,315240,317376,316180,308216
"threshold,abs_noise_row_max_array",,,,,,,,,,,,,,,,,,,,,,,,,,,,,,,,,,,,,
3000,3000,3000,3000,3000,3000,3000,3000,3000,3000,3000,3000,3000,3000,3000,3000,3000,3000,3000,3000,3000,3000,3000,3000,3000,3000,3000,3000,3000,3000,3000,3000,3000,3000,3000,3000,3000,3000
"threshold,abs_noise_col_max_array",,,,,,,,,,,,,,,,,,,,,,,,,,,,,,,,,,,,,
3000,3000,3000,3000,3000,3000,3000,3000,3000,3000,3000,3000,3000,3000,3000,3000,,,,,,,,,,,,,,,,,,,,,,
"threshold,raw_data_row_delta_max_array",,,,,,,,,,,,,,,,,,,,,,,,,,,,,,,,,,,,,
2000,2000,4000,2000,2000,2000,2000,2000,2000,2000,2000,2000,2000,2000,2000,2000,,,,,,,,,,,,,,,,,,,,,,
2000,2000,2000,2000,2000,2000,2000,2000,2000,2000,2000,2000,2000,2000,2000,2000,,,,,,,,,,,,,,,,,,,,,,
600,600,600,600,600,600,600,600,600,600,600,600,600,600,600,600,,,,,,,,,,,,,,,,,,,,,,
600,600,600,600,600,600,600,600,600,600,600,600,600,600,600,600,,,,,,,,,,,,,,,,,,,,,,
600,600,600,600,600,600,600,600,600,600,600,600,600,600,600,600,,,,,,,,,,,,,,,,,,,,,,
600,600,600,600,600,600,600,600,600,600,600,600,600,600,600,600,,,,,,,,,,,,,,,,,,,,,,
600,600,600,600,600,600,600,600,600,600,600,600,600,600,600,600,,,,,,,,,,,,,,,,,,,,,,
600,600,600,600,600,600,600,600,600,600,600,600,600,600,600,600,,,,,,,,,,,,,,,,,,,,,,
600,600,600,600,600,600,600,600,600,600,600,600,600,600,600,600,,,,,,,,,,,,,,,,,,,,,,
600,600,600,600,600,600,600,600,600,600,600,600,600,600,600,600,,,,,,,,,,,,,,,,,,,,,,
600,600,600,600,600,600,600,600,600,600,600,600,600,600,600,600,,,,,,,,,,,,,,,,,,,,,,
600,600,600,600,600,600,600,600,600,600,600,600,600,600,600,600,,,,,,,,,,,,,,,,,,,,,,
600,600,600,600,600,600,600,600,600,600,600,600,600,600,600,600,,,,,,,,,,,,,,,,,,,,,,
600,600,600,600,600,600,600,600,600,600,600,600,600,600,600,600,,,,,,,,,,,,,,,,,,,,,,
600,600,600,600,600,600,600,600,600,600,600,600,600,600,600,600,,,,,,,,,,,,,,,,,,,,,,
600,600,600,600,600,600,600,600,600,600,600,600,600,600,600,600,,,,,,,,,,,,,,,,,,,,,,
600,600,600,600,600,600,600,600,600,600,600,600,600,600,600,600,,,,,,,,,,,,,,,,,,,,,,
600,600,600,600,600,600,600,600,600,600,600,600,600,600,600,600,,,,,,,,,,,,,,,,,,,,,,
600,600,600,600,600,600,600,600,600,600,600,600,600,600,600,600,,,,,,,,,,,,,,,,,,,,,,
600,600,600,600,600,600,600,600,600,600,600,600,600,600,600,600,,,,,,,,,,,,,,,,,,,,,,
600,600,600,600,600,600,600,600,600,600,600,600,600,600,600,600,,,,,,,,,,,,,,,,,,,,,,
600,600,600,600,600,600,600,600,600,600,600,600,600,600,600,600,,,,,,,,,,,,,,,,,,,,,,
600,600,600,600,600,600,600,600,600,600,600,600,600,600,600,600,,,,,,,,,,,,,,,,,,,,,,
600,600,600,600,600,600,600,600,600,600,600,600,600,600,600,600,,,,,,,,,,,,,,,,,,,,,,
600,600,600,600,600,600,600,600,600,600,600,600,600,600,600,600,,,,,,,,,,,,,,,,,,,,,,
600,600,600,600,600,600,600,600,600,600,600,600,600,600,600,600,,,,,,,,,,,,,,,,,,,,,,
600,600,600,600,600,600,600,600,600,600,600,600,600,600,600,600,,,,,,,,,,,,,,,,,,,,,,
600,600,600,600,600,600,600,600,600,600,600,600,600,600,600,600,,,,,,,,,,,,,,,,,,,,,,
600,600,600,600,600,600,600,600,600,600,600,600,600,600,600,600,,,,,,,,,,,,,,,,,,,,,,
600,600,600,600,600,600,600,600,600,600,600,600,600,600,600,600,,,,,,,,,,,,,,,,,,,,,,
600,600,600,600,600,600,600,600,600,600,600,600,600,600,600,600,,,,,,,,,,,,,,,,,,,,,,
600,600,600,600,600,600,600,600,600,600,600,600,600,600,600,600,,,,,,,,,,,,,,,,,,,,,,
600,600,600,600,600,600,600,600,600,600,600,600,600,600,600,600,,,,,,,,,,,,,,,,,,,,,,
600,600,600,600,600,600,600,600,600,600,600,600,600,600,600,600,,,,,,,,,,,,,,,,,,,,,,
600,600,600,600,600,600,600,600,600,600,600,600,600,600,600,600,,,,,,,,,,,,,,,,,,,,,,
600,600,600,600,600,600,600,600,600,600,600,600,600,600,600,600,,,,,,,,,,,,,,,,,,,,,,
2000,1400,1400,1400,1400,1400,1400,1400,1400,1400,1400,1400,1400,1400,1400,2000,,,,,,,,,,,,,,,,,,,,,,
"threshold,raw_data_col_delta_max_array",,,,,,,,,,,,,,,,,,,,,,,,,,,,,,,,,,,,,
3500,3500,2500,3000,3000,3000,3000,3000,3000,3000,3000,3000,3000,3000,3000,,,,,,,,,,,,,,,,,,,,,,,
1500,2000,2000,2000,2000,2000,2000,2000,2000,2000,2000,2000,2000,3000,3000,,,,,,,,,,,,,,,,,,,,,,,
600,600,600,600,600,600,600,600,600,600,600,600,600,600,800,,,,,,,,,,,,,,,,,,,,,,,
600,600,600,600,600,600,600,600,600,600,600,600,600,600,600,,,,,,,,,,,,,,,,,,,,,,,
600,600,600,600,600,600,600,600,600,600,600,600,600,600,600,,,,,,,,,,,,,,,,,,,,,,,
600,600,600,600,600,600,600,600,600,600,600,600,600,600,600,,,,,,,,,,,,,,,,,,,,,,,
600,600,600,600,600,600,600,600,600,600,600,600,600,600,600,,,,,,,,,,,,,,,,,,,,,,,
600,600,600,600,600,600,600,600,600,600,600,600,600,600,600,,,,,,,,,,,,,,,,,,,,,,,
600,600,600,600,600,600,600,600,600,600,600,600,600,600,600,,,,,,,,,,,,,,,,,,,,,,,
600,600,600,600,600,600,600,600,600,600,600,600,600,600,600,,,,,,,,,,,,,,,,,,,,,,,
600,600,600,600,600,600,600,600,600,600,600,600,600,600,600,,,,,,,,,,,,,,,,,,,,,,,
600,600,600,600,600,600,600,600,600,600,600,600,600,600,600,,,,,,,,,,,,,,,,,,,,,,,
600,600,600,600,600,600,600,600,600,600,600,600,600,600,600,,,,,,,,,,,,,,,,,,,,,,,
600,600,600,600,600,600,600,600,600,600,600,600,600,600,600,,,,,,,,,,,,,,,,,,,,,,,
600,600,600,600,600,600,600,600,600,600,600,600,600,600,600,,,,,,,,,,,,,,,,,,,,,,,
600,600,600,600,600,600,600,600,600,600,600,600,600,600,600,,,,,,,,,,,,,,,,,,,,,,,
600,600,600,600,600,600,600,600,600,600,600,600,600,600,600,,,,,,,,,,,,,,,,,,,,,,,
600,600,600,600,600,600,600,600,600,600,600,600,600,600,600,,,,,,,,,,,,,,,,,,,,,,,
600,600,600,600,600,600,600,600,600,600,600,600,600,600,600,,,,,,,,,,,,,,,,,,,,,,,
600,600,600,600,600,600,600,600,600,600,600,600,600,600,600,,,,,,,,,,,,,,,,,,,,,,,
600,600,600,600,600,600,600,600,600,600,600,600,600,600,600,,,,,,,,,,,,,,,,,,,,,,,
600,600,600,600,600,600,600,600,600,600,600,600,600,600,600,,,,,,,,,,,,,,,,,,,,,,,
600,600,600,600,600,600,600,600,600,600,600,600,600,600,600,,,,,,,,,,,,,,,,,,,,,,,
600,600,600,600,600,600,600,600,600,600,600,600,600,600,600,,,,,,,,,,,,,,,,,,,,,,,
600,600,600,600,600,600,600,600,600,600,600,600,600,600,600,,,,,,,,,,,,,,,,,,,,,,,
600,600,600,600,600,600,600,600,600,600,600,600,600,600,600,,,,,,,,,,,,,,,,,,,,,,,
600,600,600,600,600,600,600,600,600,600,600,600,600,600,600,,,,,,,,,,,,,,,,,,,,,,,
600,600,600,600,600,600,600,600,600,600,600,600,600,600,600,,,,,,,,,,,,,,,,,,,,,,,
600,600,600,600,600,600,600,600,600,600,600,600,600,600,600,,,,,,,,,,,,,,,,,,,,,,,
600,600,600,600,600,600,600,600,600,600,600,600,600,600,600,,,,,,,,,,,,,,,,,,,,,,,
600,600,600,600,600,600,600,600,600,600,600,600,600,600,600,,,,,,,,,,,,,,,,,,,,,,,
600,600,600,600,600,600,600,600,600,600,600,600,600,600,600,,,,,,,,,,,,,,,,,,,,,,,
600,600,600,600,600,600,600,600,600,600,600,600,600,600,600,,,,,,,,,,,,,,,,,,,,,,,
600,600,600,600,600,600,600,600,600,600,600,600,600,600,600,,,,,,,,,,,,,,,,,,,,,,,
600,600,600,600,600,600,600,600,600,600,600,600,600,600,600,,,,,,,,,,,,,,,,,,,,,,,
600,600,600,600,600,600,600,600,600,600,600,600,600,600,600,,,,,,,,,,,,,,,,,,,,,,,
600,600,600,600,600,600,600,600,600,600,600,600,600,600,600,,,,,,,,,,,,,,,,,,,,,,,
2000,600,600,600,600,600,600,600,600,600,600,600,600,600,3000,,,,,,,,,,,,,,,,,,,,,,,
"threshold,self_cap_raw_data_col_min_array",,,,,,,,,,,,,,,,,,,,,,,,,,,,,,,,,,,,,
5000,5000,5000,5000,5000,5000,5000,5000,5000,5000,5000,5000,5000,5000,5000,5000,,,,,,,,,,,,,,,,,,,,,,
"threshold,self_cap_raw_data_col_max_array",,,,,,,,,,,,,,,,,,,,,,,,,,,,,,,,,,,,,
60000,60000,60000,60000,60000,60000,60000,60000,60000,60000,60000,60000,60000,60000,60000,60000,,,,,,,,,,,,,,,,,,,,,,
"threshold,self_cap_raw_data_row_min_array",,,,,,,,,,,,,,,,,,,,,,,,,,,,,,,,,,,,,
5000,5000,5000,5000,5000,5000,5000,5000,5000,5000,5000,5000,5000,5000,5000,5000,5000,5000,5000,5000,5000,5000,5000,5000,5000,5000,5000,5000,5000,5000,5000,5000,5000,5000,5000,5000,5000,5000
"threshold,self_cap_raw_data_row_max_array",,,,,,,,,,,,,,,,,,,,,,,,,,,,,,,,,,,,,
60000,60000,60000,60000,60000,60000,60000,60000,60000,60000,60000,60000,60000,60000,60000,60000,60000,60000,60000,60000,60000,60000,60000,60000,60000,60000,60000,60000,60000,60000,60000,60000,60000,60000,60000,60000,60000,60000
