﻿{
    "order": 3,
    "lockScreenInfo": {
        "templateId": "05_star_poster",
        "templateName": [
            {
                "region": "zh-rCN",
                "name": "超级明星"
            },
            {
                "region": "en",
                "name": "Super star"
            }
        ],
        "thumbnailSrc": "05_preview_lockscreen.png",
        "originSrc": "05_origin.png",
        "cropSrc": "05_crop.png",
        "decorateType": 2,
        "isDepthOfFieldSupported": true,
        "isDepthOfFieldOpened": true,
        "isDepthOfFieldBlurSupported": false,
        "layers": [
            {
                "id": "layer_origin",
                "type": 0,
                "src": "05_origin.png"
            },
            {
                "id": "layer_color",
                "type": 1,
                "colorPolicy": 1,
                "color": "#FFB3653E"
            },
            {
                "id": "layer_res1",
                "type": 2,
                "colorPolicy": 2,
                "color": "#FF994D26",
                "src": "05_res1_1.png",
                "srcExpand": "05_res1_1_expand.png"
            },
            {
                "id": "layer_timer",
                "type": 3,
                "layout": 0,
                "font": "HonorDigits_ZYRainbowVF.ttf",
                "color": "#FFFFD5BF",
                "colorPolicy": 4,
                "thickness": 10
            },
            {
                "id": "layer_crop",
                "type": 4,
                "src": "05_crop.png"
            }
        ],
        "styles": [
            "人物"
        ],
        "decorateReses": [
            {
                "id": "res1",
                "src": "05_res1.png",
                "resLayerMappings": {
                    "layer_res1": "05_res1_1.png",
                    "layer_res1_expand": "05_res1_1_expand.png"
                }
            },
            {
                "id": "res2",
                "src": "05_res2.png",
                "resLayerMappings": {
                    "layer_res1": "05_res2_1.png",
                    "layer_res1_expand": "05_res2_1_expand.png"
                }
            },
            {
                "id": "res3",
                "src": "05_res3.png",
                "resLayerMappings": {
                    "layer_res1": "05_res3_1.png",
                    "layer_res1_expand": "05_res3_1_expand.png"
                }
            },
            {
                "id": "res4",
                "src": "05_res4.png",
                "resLayerMappings": {
                    "layer_res1": "05_res4_1.png",
                    "layer_res1_expand": "05_res4_1_expand.png"
                }
            }
        ],
        "decorateColors": [
            {
                "mainColor": "#FFB3653E",
                "subColor": "#FF994D26",
                "timerColor": "#FFFFD5BF"
            },
            {
                "mainColor": "#FFA63F3A",
                "subColor": "#FF8C2F2A",
                "timerColor": "#FFFFC2BF"
            },
            {
                "mainColor": "#FFB3783E",
                "subColor": "#FF996026",
                "timerColor": "#FFFFDFBF"
            },
            {
                "mainColor": "#FFCCB129",
                "subColor": "#FFBF9413",
                "timerColor": "#FFFFF4BF"
            },
            {
                "mainColor": "#FF849945",
                "subColor": "#FF6C8033",
                "timerColor": "#FFEFFFBF"
            },
            {
                "mainColor": "#FF6C994D",
                "subColor": "#FF538033",
                "timerColor": "#FFDAFFBF"
            },
            {
                "mainColor": "#FF4D9966",
                "subColor": "#FF33804D",
                "timerColor": "#FFBFFFD5"
            },
            {
                "mainColor": "#FF4D9986",
                "subColor": "#FF33806C",
                "timerColor": "#FFBFFFEF"
            },
            {
                "mainColor": "#FF4D8699",
                "subColor": "#FF336C80",
                "timerColor": "#FFBFEFFF"
            },
            {
                "mainColor": "#FF4D6C99",
                "subColor": "#FF335380",
                "timerColor": "#FFBFDAFF"
            },
            {
                "mainColor": "#FF5B68A6",
                "subColor": "#FF3F4C8C",
                "timerColor": "#FFBFCAFF"
            },
            {
                "mainColor": "#FF6963A6",
                "subColor": "#FF4B4680",
                "timerColor": "#FFC5BFFF"
            },
            {
                "mainColor": "#FF6B5499",
                "subColor": "#FF513980",
                "timerColor": "#FFD5BFFF"
            },
            {
                "mainColor": "#FF7C5499",
                "subColor": "#FF623980",
                "timerColor": "#FFE4BFFF"
            },
            {
                "mainColor": "#FF995499",
                "subColor": "#FF803980",
                "timerColor": "#FFFFBFFF"
            },
            {
                "mainColor": "#FF994D6F",
                "subColor": "#FF803959",
                "timerColor": "#FFFFBFDC"
            },
            {
                "mainColor": "#FF8C8369",
                "subColor": "#FF736A50",
                "timerColor": "#FFFFF2CC",
                "colorMatchType": 1
            },
            {
                "mainColor": "#FF5F6066",
                "subColor": "#FF47484D",
                "timerColor": "#FFF2F4FF",
                "colorMatchType": 2
            }
        ]
    },
    "desktopInfo": {
        "templateId": "05_star_poster",
        "thumbnailSrc": "05_preview_desktop.png",
        "groupImageRes": {
            "src": "05_origin.png"
        }
    }
}