{
    "AsrParams":{
        "Enrollment":[false, 0, 240, 2000, 100, 0, 30000, 1, 0, 1, 20000, 20, 0.3, 0.03, -0.1, 0.38, 0.1, 0],
        "Recognition":[false, 0, 240, 2000, 400, 0, 30000, 1, 0, 1, 20000, 20, 0.32, 0.08, -0.3, 0.32, 0.08, -0.3],
        "AecParam":[false, 0, 240, 2000, 400, 0, 30000, 1, 1, 1, 20000, 20, 0.32, 0.08, -0.3, 0.32, 0.08, -0.3],
        "E2ERecognition":[false, 0, 240, 2000, 400, 0, 30000, 1, 0, 1, 20000, 20, 0.28, 0.02, -0.5, 0.28, 0.02, -0.5],
        "BoundaryParam":[false, 0, 240, 2000, 400, 0, 30000, 1, 0, 1, 20000, 20, -0.99, -0.99, -0.99, -0.99, -0.99, -0.99]
    },
    "SensibilityParams":{
        "comment":"array element 0:low, 1:middle, 2:high",
        "AsrUnconfidentPhonesNum":[0, 1, 2],
        "DspSentenceThresholds":{
            "Default":[84, 84, 77, 73, 73, 67],
            "UserDefined":[97, 97, 97, 88, 88, 88]
        }
    },
	"DefaultPhrase":{
        "你好小E":[84, 84, 77, 73, 73, 67],
        "你好小易":[84, 84, 77, 73, 73, 67],
        "你好华为":[84, 84, 77, 73, 73, 67],
        "小艺小艺":[84, 84, 77, 73, 73, 67],
        "你好悠悠":[97, 97, 97, 85, 80, 77],
        "我的荣耀":[84, 84, 77, 73, 73, 67]
	},
	"Features":["conf_upgrade","drv_optimization","unencrypted","third_platform","multi_cmds"],
	"ControlParams":["no_prune","half_model","skip_frame","aec_slide","pcm_encrypt"],
	"PruneType":[1,1,6,4],
	"EnrollSnrThrd":15.0
}