{
    "Header": {
        "magic": 11,
        "version": 1
    },
    "BleScanCfg": [
        {
            "PackageName": "fr.gouv.android.stopcovid",
            "ScanType": 1,
            "ScanMode": 1,
            "ScanInt": 5000,
            "ScanWin": 500
        },
        {
            "PackageName": "com.orange.contacttracing.sample",
            "ScanType": 1,
            "ScanMode": 1,
            "ScanInt": 5000,
            "ScanWin": 500
        }
    ],
    "AppFeatureCfg": [
        {
            "PackageName": "fr.gouv.android.stopcovid",
            "FeatureType": 0
        },
        {
            "PackageName": "com.orange.contacttracing.sample",
            "FeatureType": 0
        }
    ],
    "HnBlePeripheralCfg": [
        {
            "PencilPid": "4241,4261,9473,9474,9475,9476",
            "KeyboardPid": "4253,4254,4260,4274,1285,17665,1290,1289,1292",
            "KbSupHostDicPid": "4254,4260,1285,1290",
            "KbName": "HONOR Smart Keyboard,HONOR Wireless Keyboard,HONOR Floating Keyboard,HONOR Pad V7 Keyboard,HONOR CHOICE Smart Keyboard",
            "KbModelId": "000106,000104,4D335548"
        }
    ],
    "ForceStartTrackGame": [
        {
            "PackageName": "com.happyelements.AndroidAnimal"
        },
        {
            "PackageName": "com.tencent.feiji"
        }
    ],
    "BleAppWakeup": [
        {
            "PackageName" : "com.chehejia.oc.m01",
            "SHA1": "BC:8F:95:CC:DF:A2:72:98:A2:BD:A4:CF:C0:E6:37:E3:9C:FC:C2:E5",
            "Scan_Span": 604800,
            "rssi_thresh": -90,
            "scan_report_interval" : 10
        }
    ],
    "GattAppMtuKeep": [
        {
            "PackageName": "com.hihonor.nearby"
        },
        {
            "PackageName": "com.hihonor.airlink"
        },
        {
            "PackageName": "com.hihonor.health"
        }
    ],
    "SocketCbAppList": [
        {
            "com.hihonor.health": "E5:8C:E0:27:E5:4E:72:D6:B0:65:0B:71:82:9D:E0:48:95:C2:DC:4E:C6:9A:6A:4E:A6:F1:58:E2:B4:C5:9C:32"
        },
        {
            "com.hihonor.nearby": "48:30:13:CE:65:E1:B0:E1:0A:D7:6A:2E:B8:04:09:A2:A2:B8:B3:5E:BE:81:A3:3B:1F:6E:DD:7F:AC:BD:64:DC"
        }
    ]
}
