#,version,,,,,,,,,,,,,,,,,,,,,,,,,,,,,,,,,,,,
2021,12,10,1,,,,,,,,,,,,,,,,,,,,,,,,,,,,,,,,,,
#,row_col_num,,,,,,,,,,,,,,,,,,,,,,,,,,,,,,,,,,,,
38,33,,,,,,,,,,,,,,,,,,,,,,,,,,,,,,,,,,,,
#,noise,,,,,,,,,,,,,,,,,,,,,,,,,,,,,,,,,,,,
-600,600,,,,,,,,,,,,,,,,,,,,,,,,,,,,,,,,,,,,
#,raw_max,,,,,,,,,,,,,,,,,,,,,,,,,,,,,,,,,,,,
10564,10873,10819,10769,10759,10790,10781,10823,10802,10794,10777,10794,10833,10858,10864,10925,10964,10980,10995,10988,11014,11057,11112,11175,6128,10819,11224,11226,11281,11366,11463,11616,11708,,,,,
11128,10778,10713,10655,10641,10660,10647,10682,10656,10638,10616,10620,10648,10664,10661,10709,10741,10748,10754,10751,10759,10793,10832,10895,8321,10098,10884,10867,10902,10943,10989,11063,11408,,,,,
11439,11099,11037,10981,10969,10988,10977,11014,10985,10967,10943,10947,10979,10993,10990,11042,11073,11083,11085,11081,11085,11125,11155,11163,11162,11176,11197,11179,11210,11245,11283,11339,11627,,,,,
11534,11201,11141,11085,11073,11094,11083,11125,11093,11071,11047,11051,11084,11101,11097,11151,11183,11192,11193,11177,11193,11218,11258,11262,11292,11275,11293,11275,11293,11332,11365,11410,11657,,,,,
11560,11235,11174,11119,11107,11135,11119,11155,11122,11105,11083,11084,11118,11136,11133,11187,11218,11228,11227,11216,11224,11250,11293,11293,11324,11301,11315,11294,11319,11343,11371,11409,11625,,,,,
11595,11279,11214,11161,11151,11170,11157,11200,11168,11154,11131,11133,11164,11185,11183,11235,11267,11275,11276,11257,11272,11297,11328,11336,11374,11343,11348,11328,11339,11372,11397,11423,11622,,,,,
11242,10950,10893,10843,10837,10862,10852,10895,10868,10855,10834,10837,10867,10884,10881,10933,10968,10973,10973,10954,10971,10995,11024,11028,11058,11032,11031,11014,11023,11051,11071,11090,11268,,,,,
11571,11267,11207,11153,11146,11171,11164,11210,11184,11175,11150,11153,11189,11200,11200,11244,11267,11275,11291,11271,11275,11310,11339,11341,11366,11341,11336,11318,11326,11353,11370,11385,11557,,,,,
11618,11309,11249,11194,11187,11210,11203,11250,11223,11215,11193,11194,11224,11244,11240,11289,11327,11330,11330,11313,11324,11350,11375,11375,11401,11372,11366,11349,11353,11378,11392,11400,11567,,,,,
11604,11293,11235,11177,11171,11194,11189,11235,11209,11202,11181,11176,11201,11219,11226,11261,11289,11297,11320,11294,11294,11326,11352,11352,11376,11350,11343,11320,11324,11348,11358,11362,11526,,,,,
11631,11324,11265,11207,11201,11223,11215,11263,11239,11232,11209,11210,11245,11262,11255,11310,11318,11333,11340,11319,11318,11349,11374,11374,11398,11372,11362,11343,11343,11365,11372,11374,11532,,,,,
11358,11051,10992,10937,10930,10951,10943,10992,10967,10958,10937,10940,10966,10994,10980,11015,11040,11045,11058,11040,11037,11066,11089,11089,11110,11085,11077,11055,11055,11075,11080,11079,11229,,,,,
11619,11307,11248,11193,11185,11206,11200,11248,11219,11214,11192,11201,11213,11239,11235,11270,11294,11298,11313,11292,11288,11319,11344,11340,11363,11335,11327,11307,11306,11324,11328,11326,11475,,,,,
11567,11254,11194,11141,11135,11154,11148,11203,11162,11145,11124,11127,11158,11175,11167,11213,11236,11242,11242,11233,11231,11261,11281,11279,11300,11271,11266,11244,11242,11259,11261,11258,11402,,,,,
11635,11317,11258,11206,11198,11218,11207,11258,11228,11227,11194,11189,11219,11239,11245,11274,11297,11301,11301,11292,11287,11318,11337,11332,11356,11326,11318,11298,11297,11311,11313,11307,11452,,,,,
11531,11216,11159,11110,11099,11116,11109,11157,11133,11107,11085,11085,11118,11135,11135,11170,11192,11196,11194,11184,11177,11209,11231,11226,11248,11219,11210,11190,11188,11201,11201,11193,11339,,,,,
11275,10964,10910,10863,10852,10867,10858,10903,10878,10862,10833,10832,10864,10881,10890,10915,10934,10940,10938,10928,10923,10951,10971,10967,10988,10959,10949,10927,10928,10941,10940,10932,11071,,,,,
11561,11242,11188,11140,11128,11142,11133,11177,11150,11142,11124,11105,11136,11154,11155,11187,11207,11214,11218,11200,11193,11224,11244,11240,11259,11229,11222,11197,11197,11211,11209,11200,11344,,,,,
11317,11014,10954,10906,10897,10910,10898,10936,10902,10894,10869,10868,10897,10914,10903,10946,10967,10972,10971,10959,10953,10981,11002,10998,11018,10988,10977,10954,10951,10964,10963,10955,11098,,,,,
11216,10903,10858,10810,10799,10812,10807,10830,10806,10797,10771,10768,10797,10813,10806,10850,10869,10872,10871,10860,10854,10878,10899,10895,10915,10886,10876,10854,10851,10863,10862,10858,10998,,,,,
11413,11098,11059,11011,10993,11018,10988,11032,11006,10995,10969,10968,10998,11015,11008,11054,11073,11077,11076,11063,11057,11083,11103,11099,11120,11094,11081,11058,11058,11071,11071,11064,11213,,,,,
11421,11106,11076,11024,10998,11019,10998,11044,11016,11006,10982,10981,11011,11028,11021,11068,11088,11092,11089,11077,11070,11097,11118,11112,11135,11109,11097,11073,11073,11086,11086,11083,11231,,,,,
11527,11214,11162,11112,11102,11114,11105,11150,11122,11114,11086,11086,11118,11136,11131,11177,11198,11201,11197,11184,11179,11205,11226,11223,11245,11216,11206,11184,11185,11200,11200,11196,11345,,,,,
11153,10830,10790,10741,10732,10748,10734,10771,10746,10737,10716,10713,10742,10760,10754,10799,10820,10824,10823,10808,10802,10828,10847,10846,10867,10839,10833,10812,10813,10829,10829,10826,10969,,,,,
11138,10839,10785,10741,10725,10747,10739,10784,10758,10750,10729,10726,10755,10773,10767,10811,10832,10837,10836,10823,10815,10842,10863,10860,10881,10856,10850,10832,10834,10849,10851,10850,10994,,,,,
11483,11168,11123,11067,11071,11085,11066,11112,11086,11080,11057,11054,11088,11106,11098,11146,11168,11172,11167,11157,11148,11176,11198,11198,11222,11196,11187,11168,11172,11189,11196,11198,11346,,,,,
11552,11241,11183,11128,11120,11144,11138,11184,11158,11151,11129,11127,11162,11180,11175,11223,11242,11246,11245,11233,11224,11253,11278,11276,11297,11275,11267,11248,11252,11271,11279,11285,11439,,,,,
11479,11175,11125,11083,11054,11079,11071,11118,11092,11084,11063,11064,11096,11116,11109,11157,11180,11184,11181,11171,11163,11193,11219,11218,11240,11216,11209,11193,11197,11218,11227,11237,11393,,,,,
11353,11050,10997,10941,10932,10954,10947,10995,10969,10960,10938,10943,10975,10994,10989,11038,11063,11067,11060,11051,11047,11076,11102,11101,11123,11101,11093,11080,11086,11111,11120,11132,11289,,,,,
11086,10791,10739,10686,10676,10696,10691,10738,10713,10702,10683,10686,10716,10735,10735,10784,10808,10813,10808,10799,10794,10824,10849,10849,10871,10850,10846,10832,10838,10864,10878,10893,11055,,,,,
11349,11054,11001,10946,10936,10956,10954,10999,10973,10963,10942,10946,10980,10998,10997,11047,11073,11079,11076,11066,11060,11092,11115,11119,11142,11124,11119,11105,11115,11144,11162,11181,11357,,,,,
11258,10969,10915,10862,10852,10875,10869,10916,10889,10880,10858,10862,10894,10915,10914,10967,10993,10999,10995,10986,10982,11011,11038,11045,11068,11050,11049,11037,11047,11079,11101,11125,11310,,,,,
11305,10997,10940,10880,10865,10882,10873,10920,10894,10882,10864,10864,10895,10917,10920,10972,10998,11003,11003,10992,10989,11020,11047,11054,11079,11063,11064,11051,11064,11098,11124,11155,11356,,,,,
10979,10672,10611,10553,10540,10563,10553,10592,10566,10553,10534,10537,10569,10591,10591,10639,10667,10673,10673,10664,10664,10694,10722,10730,10755,10743,10747,10735,10748,10784,10811,10852,11068,,,,,
11236,10921,10858,10799,10787,10810,10802,10847,10819,10799,10777,10782,10815,10838,10836,10885,10912,10923,10921,10914,10915,10947,10977,10985,11014,11002,11010,11001,11018,11058,11092,11141,11392,,,,,
11280,10955,10893,10832,10819,10839,10830,10875,10850,10836,10811,10815,10845,10867,10864,10912,10941,10949,10953,10946,10945,10980,11010,11020,11051,11042,11050,11045,11063,11110,11150,11211,11508,,,,,
11248,10898,10834,10774,10759,10778,10768,10810,10784,10768,10745,10747,10774,10798,10795,10843,10872,10882,10884,10878,10881,10916,10947,10962,10994,10988,10999,10999,11024,11077,11128,11205,11567,,,,,
10612,10940,10880,10826,10815,10837,10832,10877,10856,10843,10823,10836,10871,10897,10906,10960,10999,11016,11025,11025,11036,11083,11127,11151,11194,11201,11232,11248,11297,11380,11479,11632,11661,,,,,
#,raw_min,,,,,,,,,,,,,,,,,,,,,,,,,,,,,,,,,,,,
5688,5855,5825,5799,5793,5810,5805,5828,5816,5812,5803,5812,5833,5846,5850,5883,5904,5912,5921,5916,5930,5954,5984,6017,3300,5825,6044,6045,6075,6120,6173,6255,6304,,,,,
5992,5804,5769,5737,5730,5740,5733,5752,5738,5728,5716,5718,5734,5742,5741,5767,5783,5788,5790,5789,5793,5811,5832,5867,4481,5438,5860,5851,5870,5893,5917,5957,6143,,,,,
6159,5977,5943,5913,5907,5916,5911,5930,5915,5905,5893,5895,5912,5919,5918,5946,5963,5968,5969,5967,5969,5991,6007,6011,6010,6018,6029,6019,6036,6055,6075,6105,6261,,,,,
6210,6031,5999,5969,5963,5974,5968,5991,5973,5961,5949,5951,5968,5977,5975,6005,6021,6026,6027,6019,6027,6040,6062,6064,6080,6071,6081,6071,6081,6102,6119,6144,6277,,,,,
6224,6049,6017,5987,5981,5996,5987,6007,5989,5979,5968,5968,5986,5996,5995,6024,6040,6046,6045,6040,6044,6058,6081,6081,6098,6085,6093,6082,6095,6108,6123,6143,6259,,,,,
6243,6073,6038,6010,6005,6014,6007,6031,6014,6006,5993,5995,6012,6023,6021,6049,6067,6071,6072,6061,6070,6083,6100,6104,6124,6108,6110,6100,6105,6124,6137,6151,6258,,,,,
6054,5896,5865,5839,5835,5849,5844,5867,5852,5845,5834,5835,5851,5860,5859,5887,5906,5909,5909,5898,5907,5921,5936,5938,5954,5940,5940,5930,5935,5951,5961,5972,6068,,,,,
6231,6067,6035,6005,6002,6015,6012,6036,6022,6017,6004,6005,6025,6031,6031,6054,6067,6071,6080,6069,6071,6090,6105,6107,6120,6107,6104,6094,6098,6113,6122,6131,6223,,,,,
6256,6089,6057,6028,6024,6036,6033,6058,6043,6039,6027,6028,6044,6054,6052,6079,6099,6101,6101,6091,6098,6112,6125,6125,6139,6124,6120,6111,6113,6126,6134,6138,6229,,,,,
6248,6081,6049,6019,6015,6028,6025,6049,6035,6032,6021,6018,6031,6041,6045,6063,6079,6083,6096,6082,6082,6098,6112,6112,6126,6112,6108,6096,6098,6110,6116,6118,6206,,,,,
6263,6098,6066,6035,6031,6043,6039,6065,6052,6048,6035,6036,6055,6064,6061,6090,6094,6103,6106,6095,6094,6111,6124,6124,6138,6124,6118,6108,6108,6119,6124,6124,6210,,,,,
6116,5951,5919,5889,5886,5897,5893,5919,5905,5900,5889,5891,5905,5920,5912,5931,5944,5947,5954,5944,5943,5958,5971,5971,5982,5969,5965,5953,5953,5963,5966,5965,6047,,,,,
6257,6089,6056,6027,6023,6034,6031,6056,6041,6038,6026,6031,6038,6052,6049,6068,6082,6084,6091,6080,6078,6095,6108,6106,6119,6103,6099,6089,6088,6098,6100,6098,6179,,,,,
6229,6060,6028,5999,5996,6006,6003,6033,6010,6001,5990,5991,6008,6017,6013,6038,6050,6054,6054,6049,6047,6063,6075,6073,6084,6069,6066,6054,6054,6063,6063,6062,6140,,,,,
6265,6094,6062,6034,6030,6040,6035,6062,6046,6045,6028,6025,6041,6052,6055,6070,6083,6085,6085,6080,6077,6094,6105,6102,6115,6098,6094,6084,6083,6091,6091,6089,6166,,,,,
6209,6040,6009,5982,5977,5986,5982,6007,5995,5981,5969,5969,5986,5996,5996,6014,6026,6028,6028,6022,6019,6035,6047,6045,6056,6041,6036,6026,6024,6031,6031,6027,6105,,,,,
6071,5904,5874,5849,5844,5851,5846,5871,5858,5849,5833,5832,5850,5859,5864,5877,5888,5891,5890,5884,5881,5897,5907,5905,5916,5901,5895,5884,5884,5891,5891,5886,5961,,,,,
6225,6054,6024,5998,5992,6000,5995,6019,6004,6000,5990,5979,5996,6006,6007,6024,6035,6038,6040,6031,6027,6044,6054,6052,6063,6047,6042,6029,6029,6037,6035,6031,6108,,,,,
6094,5930,5898,5872,5867,5874,5868,5888,5870,5866,5853,5852,5867,5877,5871,5894,5905,5908,5907,5901,5898,5913,5924,5922,5933,5916,5911,5898,5897,5904,5903,5899,5976,,,,,
6040,5871,5846,5821,5815,5822,5819,5832,5818,5814,5800,5798,5814,5823,5818,5842,5853,5854,5853,5848,5844,5858,5869,5867,5877,5862,5856,5844,5843,5849,5849,5846,5922,,,,,
6145,5976,5955,5929,5919,5933,5916,5940,5926,5921,5907,5906,5922,5931,5928,5952,5963,5965,5964,5957,5954,5968,5979,5977,5988,5974,5967,5954,5954,5961,5961,5958,6038,,,,,
6150,5980,5964,5936,5922,5933,5922,5947,5932,5926,5914,5913,5929,5938,5935,5960,5970,5972,5971,5965,5961,5975,5986,5984,5996,5982,5975,5963,5963,5970,5970,5968,6047,,,,,
6207,6038,6010,5984,5978,5984,5979,6004,5989,5984,5970,5970,5986,5996,5993,6019,6030,6031,6029,6022,6019,6033,6045,6043,6055,6040,6034,6022,6023,6031,6031,6028,6109,,,,,
6005,5832,5810,5783,5779,5788,5780,5800,5786,5781,5770,5769,5784,5794,5790,5815,5826,5828,5828,5820,5816,5830,5841,5840,5851,5837,5833,5822,5823,5831,5831,5830,5907,,,,,
5998,5837,5807,5783,5775,5787,5783,5807,5793,5788,5777,5776,5791,5801,5797,5821,5832,5835,5835,5828,5823,5838,5849,5848,5859,5846,5842,5832,5834,5842,5843,5842,5920,,,,,
6183,6014,5989,5959,5961,5969,5958,5984,5970,5966,5954,5952,5970,5980,5976,6002,6014,6016,6013,6007,6003,6018,6030,6030,6042,6028,6024,6014,6016,6025,6028,6030,6110,,,,,
6220,6053,6021,5992,5988,6000,5998,6022,6008,6005,5993,5991,6010,6020,6017,6043,6054,6056,6055,6049,6044,6059,6073,6072,6083,6071,6067,6056,6059,6069,6073,6077,6159,,,,,
6181,6017,5991,5968,5952,5965,5961,5986,5972,5968,5957,5958,5975,5986,5982,6007,6020,6022,6021,6015,6011,6027,6041,6040,6052,6040,6035,6027,6029,6040,6045,6051,6135,,,,,
6113,5950,5921,5891,5886,5898,5895,5921,5907,5902,5890,5893,5909,5920,5917,5944,5957,5959,5956,5951,5949,5964,5978,5977,5989,5977,5973,5966,5970,5983,5988,5994,6079,,,,,
5970,5811,5783,5754,5748,5760,5757,5782,5769,5762,5753,5754,5770,5781,5781,5807,5820,5823,5820,5815,5812,5828,5842,5842,5853,5842,5840,5832,5836,5850,5858,5865,5953,,,,,
6111,5952,5923,5894,5888,5900,5898,5923,5909,5903,5892,5894,5912,5922,5921,5949,5963,5965,5964,5958,5956,5972,5985,5987,6000,5990,5987,5979,5985,6000,6010,6021,6115,,,,,
6062,5907,5877,5849,5844,5856,5853,5878,5863,5858,5846,5849,5866,5877,5877,5905,5919,5923,5921,5916,5914,5929,5944,5947,5960,5950,5949,5943,5949,5965,5977,5991,6090,,,,,
6087,5921,5891,5858,5851,5860,5855,5880,5866,5860,5850,5850,5867,5879,5880,5908,5922,5925,5925,5919,5917,5934,5949,5952,5965,5957,5958,5951,5958,5976,5990,6007,6115,,,,,
5912,5746,5713,5683,5676,5688,5683,5704,5690,5683,5672,5674,5691,5703,5703,5729,5744,5747,5747,5742,5742,5758,5774,5778,5791,5785,5787,5781,5788,5807,5821,5844,5960,,,,,
6050,5881,5846,5815,5809,5821,5816,5841,5825,5815,5803,5806,5823,5836,5835,5861,5876,5881,5881,5877,5877,5895,5911,5915,5930,5924,5928,5923,5933,5954,5972,5999,6134,,,,,
6074,5899,5865,5832,5825,5837,5832,5856,5842,5835,5821,5823,5839,5851,5850,5876,5891,5895,5898,5894,5893,5912,5928,5934,5951,5946,5950,5947,5957,5982,6004,6037,6196,,,,,
6056,5868,5834,5802,5793,5804,5798,5821,5807,5798,5786,5787,5802,5814,5813,5839,5854,5860,5860,5858,5859,5878,5895,5902,5920,5916,5923,5923,5936,5965,5992,6033,6229,,,,,
5714,5891,5858,5830,5823,5835,5832,5857,5846,5839,5828,5835,5853,5867,5872,5902,5923,5932,5937,5937,5942,5968,5991,6005,6028,6031,6048,6056,6083,6128,6181,6264,6279,,,,,
#,raw_row_delta_max,,,,,,,,,,,,,,,,,,,,,,,,,,,,,,,,,,,,
1200,1200,1200,1200,1200,1200,1200,1200,1200,1200,1200,1200,1200,1200,1200,1200,1200,1200,1200,1200,1200,1200,1200,1200,4000,1200,1200,1200,1200,1200,1200,1200,1200,,,,,
1000,1000,1000,1000,1000,1000,1000,1000,1000,1000,1000,1000,1000,1000,1000,1000,1000,1000,1000,1000,1000,1000,1000,1000,4000,2000,1000,1000,1000,1000,1000,1000,1000,,,,,
600,600,600,600,600,600,600,600,600,600,600,600,600,600,600,600,600,600,600,600,600,600,600,600,600,600,600,600,600,600,600,600,600,,,,,
600,600,600,600,600,600,600,600,600,600,600,600,600,600,600,600,600,600,600,600,600,600,600,600,600,600,600,600,600,600,600,600,600,,,,,
600,600,600,600,600,600,600,600,600,600,600,600,600,600,600,600,600,600,600,600,600,600,600,600,600,600,600,600,600,600,600,600,600,,,,,
800,800,800,800,800,800,800,800,800,800,800,800,800,800,800,800,800,800,800,800,800,800,800,800,800,800,800,800,800,800,800,800,800,,,,,
1000,1000,1000,1000,1000,1000,1000,1000,1000,1000,1000,1000,1000,1000,1000,1000,1000,1000,1000,1000,1000,1000,1000,1000,1000,1000,1000,1000,1000,1000,1000,1000,1000,,,,,
600,600,600,600,600,600,600,600,600,600,600,600,600,600,600,600,600,600,600,600,600,600,600,600,600,600,600,600,600,600,600,600,600,,,,,
600,600,600,600,600,600,600,600,600,600,600,600,600,600,600,600,600,600,600,600,600,600,600,600,600,600,600,600,600,600,600,600,600,,,,,
600,600,600,600,600,600,600,600,600,600,600,600,600,600,600,600,600,600,600,600,600,600,600,600,600,600,600,600,600,600,600,600,600,,,,,
1000,1000,1000,1000,1000,1000,1000,1000,1000,1000,1000,1000,1000,1000,1000,1000,1000,1000,1000,1000,1000,1000,1000,1000,1000,1000,1000,1000,1000,1000,1000,1000,1000,,,,,
800,800,800,800,800,800,800,800,800,800,800,800,800,800,800,800,800,800,800,800,800,800,800,800,800,800,800,800,800,800,800,800,800,,,,,
600,600,600,600,600,600,600,600,600,600,600,600,600,600,600,600,600,600,600,600,600,600,600,600,600,600,600,600,600,600,600,600,600,,,,,
600,600,600,600,600,600,600,600,600,600,600,600,600,600,600,600,600,600,600,600,600,600,600,600,600,600,600,600,600,600,600,600,600,,,,,
600,600,600,600,600,600,600,600,600,600,600,600,600,600,600,600,600,600,600,600,600,600,600,600,600,600,600,600,600,600,600,600,600,,,,,
1000,1000,1000,1000,1000,1000,1000,1000,1000,1000,1000,1000,1000,1000,1000,1000,1000,1000,1000,1000,1000,1000,1000,1000,1000,1000,1000,1000,1000,1000,1000,1000,1000,,,,,
800,800,800,800,800,800,800,800,800,800,800,800,800,800,800,800,800,800,800,800,800,800,800,800,800,800,800,800,800,800,800,800,800,,,,,
800,800,800,800,800,800,800,800,800,800,800,800,800,800,800,800,800,800,800,800,800,800,800,800,800,800,800,800,800,800,800,800,800,,,,,
800,800,800,800,800,800,800,800,800,800,800,800,800,800,800,800,800,800,800,800,800,800,800,800,800,800,800,800,800,800,800,800,800,,,,,
800,800,800,800,800,800,800,800,800,800,800,800,800,800,800,800,800,800,800,800,800,800,800,800,800,800,800,800,800,800,800,800,800,,,,,
600,600,600,600,600,600,600,600,600,600,600,600,600,600,600,600,600,600,600,600,600,600,600,600,600,600,600,600,600,600,600,600,600,,,,,
600,600,600,600,600,600,600,600,600,600,600,600,600,600,600,600,600,600,600,600,600,600,600,600,600,600,600,600,600,600,600,600,600,,,,,
1000,1000,1000,1000,1000,1000,1000,1000,1000,1000,1000,1000,1000,1000,1000,1000,1000,1000,1000,1000,1000,1000,1000,1000,1000,1000,1000,1000,1000,1000,1000,1000,1000,,,,,
600,600,600,600,600,600,600,600,600,600,600,600,600,600,600,600,600,600,600,600,600,600,600,600,600,600,600,600,600,600,600,600,600,,,,,
800,800,800,800,800,800,800,800,800,800,800,800,800,800,800,800,800,800,800,800,800,800,800,800,800,800,800,800,800,800,800,800,800,,,,,
600,600,600,600,600,600,600,600,600,600,600,600,600,600,600,600,600,600,600,600,600,600,600,600,600,600,600,600,600,600,600,600,600,,,,,
600,600,600,600,600,600,600,600,600,600,600,600,600,600,600,600,600,600,600,600,600,600,600,600,600,600,600,600,600,600,600,600,600,,,,,
1000,1000,1000,1000,1000,1000,1000,1000,1000,1000,1000,1000,1000,1000,1000,1000,1000,1000,1000,1000,1000,1000,1000,1000,1000,1000,1000,1000,1000,1000,1000,1000,1000,,,,,
800,800,800,800,800,800,800,800,800,800,800,800,800,800,800,800,800,800,800,800,800,800,800,800,800,800,800,800,800,800,800,800,800,,,,,
800,800,800,800,800,800,800,800,800,800,800,800,800,800,800,800,800,800,800,800,800,800,800,800,800,800,800,800,800,800,800,800,800,,,,,
600,600,600,600,600,600,600,600,600,600,600,600,600,600,600,600,600,600,600,600,600,600,600,600,600,600,600,600,600,600,600,600,600,,,,,
600,600,600,600,600,600,600,600,600,600,600,600,600,600,600,600,600,600,600,600,600,600,600,600,600,600,600,600,600,600,600,600,600,,,,,
800,800,800,800,800,800,800,800,800,800,800,800,800,800,800,800,800,800,800,800,800,800,800,800,800,800,800,800,800,800,800,800,800,,,,,
800,800,800,800,800,800,800,800,800,800,800,800,800,800,800,800,800,800,800,800,800,800,800,800,800,800,800,800,800,800,800,800,800,,,,,
600,600,600,600,600,600,600,600,600,600,600,600,600,600,600,600,600,600,600,600,600,600,600,600,600,600,600,600,600,600,600,600,600,,,,,
1000,600,600,600,600,600,600,600,600,600,600,600,600,600,600,600,600,600,600,600,600,600,600,600,600,600,600,600,600,600,600,600,600,,,,,
2000,1000,1000,1000,1000,1000,1000,1000,1000,1000,1000,1000,1000,1000,1000,1000,1000,1000,1000,1000,1000,1000,1000,1000,1000,1000,1000,1000,1000,1000,1000,1000,1000,,,,,
#,raw_row_delta_min,,,,,,,,,,,,,,,,,,,,,,,,,,,,,,,,,,,,
-1200,-1200,-1200,-1200,-1200,-1200,-1200,-1200,-1200,-1200,-1200,-1200,-1200,-1200,-1200,-1200,-1200,-1200,-1200,-1200,-1200,-1200,-1200,-1200,-4000,-1200,-1200,-1200,-1200,-1200,-1200,-1200,-1200,,,,,
-1000,-1000,-1000,-1000,-1000,-1000,-1000,-1000,-1000,-1000,-1000,-1000,-1000,-1000,-1000,-1000,-1000,-1000,-1000,-1000,-1000,-1000,-1000,-1000,-4000,-2000,-1000,-1000,-1000,-1000,-1000,-1000,-1000,,,,,
-600,-600,-600,-600,-600,-600,-600,-600,-600,-600,-600,-600,-600,-600,-600,-600,-600,-600,-600,-600,-600,-600,-600,-600,-600,-600,-600,-600,-600,-600,-600,-600,-600,,,,,
-600,-600,-600,-600,-600,-600,-600,-600,-600,-600,-600,-600,-600,-600,-600,-600,-600,-600,-600,-600,-600,-600,-600,-600,-600,-600,-600,-600,-600,-600,-600,-600,-600,,,,,
-600,-600,-600,-600,-600,-600,-600,-600,-600,-600,-600,-600,-600,-600,-600,-600,-600,-600,-600,-600,-600,-600,-600,-600,-600,-600,-600,-600,-600,-600,-600,-600,-600,,,,,
-800,-800,-800,-800,-800,-800,-800,-800,-800,-800,-800,-800,-800,-800,-800,-800,-800,-800,-800,-800,-800,-800,-800,-800,-800,-800,-800,-800,-800,-800,-800,-800,-800,,,,,
-1000,-1000,-1000,-1000,-1000,-1000,-1000,-1000,-1000,-1000,-1000,-1000,-1000,-1000,-1000,-1000,-1000,-1000,-1000,-1000,-1000,-1000,-1000,-1000,-1000,-1000,-1000,-1000,-1000,-1000,-1000,-1000,-1000,,,,,
-600,-600,-600,-600,-600,-600,-600,-600,-600,-600,-600,-600,-600,-600,-600,-600,-600,-600,-600,-600,-600,-600,-600,-600,-600,-600,-600,-600,-600,-600,-600,-600,-600,,,,,
-600,-600,-600,-600,-600,-600,-600,-600,-600,-600,-600,-600,-600,-600,-600,-600,-600,-600,-600,-600,-600,-600,-600,-600,-600,-600,-600,-600,-600,-600,-600,-600,-600,,,,,
-600,-600,-600,-600,-600,-600,-600,-600,-600,-600,-600,-600,-600,-600,-600,-600,-600,-600,-600,-600,-600,-600,-600,-600,-600,-600,-600,-600,-600,-600,-600,-600,-600,,,,,
-1000,-1000,-1000,-1000,-1000,-1000,-1000,-1000,-1000,-1000,-1000,-1000,-1000,-1000,-1000,-1000,-1000,-1000,-1000,-1000,-1000,-1000,-1000,-1000,-1000,-1000,-1000,-1000,-1000,-1000,-1000,-1000,-1000,,,,,
-800,-800,-800,-800,-800,-800,-800,-800,-800,-800,-800,-800,-800,-800,-800,-800,-800,-800,-800,-800,-800,-800,-800,-800,-800,-800,-800,-800,-800,-800,-800,-800,-800,,,,,
-600,-600,-600,-600,-600,-600,-600,-600,-600,-600,-600,-600,-600,-600,-600,-600,-600,-600,-600,-600,-600,-600,-600,-600,-600,-600,-600,-600,-600,-600,-600,-600,-600,,,,,
-600,-600,-600,-600,-600,-600,-600,-600,-600,-600,-600,-600,-600,-600,-600,-600,-600,-600,-600,-600,-600,-600,-600,-600,-600,-600,-600,-600,-600,-600,-600,-600,-600,,,,,
-600,-600,-600,-600,-600,-600,-600,-600,-600,-600,-600,-600,-600,-600,-600,-600,-600,-600,-600,-600,-600,-600,-600,-600,-600,-600,-600,-600,-600,-600,-600,-600,-600,,,,,
-1000,-1000,-1000,-1000,-1000,-1000,-1000,-1000,-1000,-1000,-1000,-1000,-1000,-1000,-1000,-1000,-1000,-1000,-1000,-1000,-1000,-1000,-1000,-1000,-1000,-1000,-1000,-1000,-1000,-1000,-1000,-1000,-1000,,,,,
-800,-800,-800,-800,-800,-800,-800,-800,-800,-800,-800,-800,-800,-800,-800,-800,-800,-800,-800,-800,-800,-800,-800,-800,-800,-800,-800,-800,-800,-800,-800,-800,-800,,,,,
-800,-800,-800,-800,-800,-800,-800,-800,-800,-800,-800,-800,-800,-800,-800,-800,-800,-800,-800,-800,-800,-800,-800,-800,-800,-800,-800,-800,-800,-800,-800,-800,-800,,,,,
-800,-800,-800,-800,-800,-800,-800,-800,-800,-800,-800,-800,-800,-800,-800,-800,-800,-800,-800,-800,-800,-800,-800,-800,-800,-800,-800,-800,-800,-800,-800,-800,-800,,,,,
-800,-800,-800,-800,-800,-800,-800,-800,-800,-800,-800,-800,-800,-800,-800,-800,-800,-800,-800,-800,-800,-800,-800,-800,-800,-800,-800,-800,-800,-800,-800,-800,-800,,,,,
-600,-600,-600,-600,-600,-600,-600,-600,-600,-600,-600,-600,-600,-600,-600,-600,-600,-600,-600,-600,-600,-600,-600,-600,-600,-600,-600,-600,-600,-600,-600,-600,-600,,,,,
-600,-600,-600,-600,-600,-600,-600,-600,-600,-600,-600,-600,-600,-600,-600,-600,-600,-600,-600,-600,-600,-600,-600,-600,-600,-600,-600,-600,-600,-600,-600,-600,-600,,,,,
-1000,-1000,-1000,-1000,-1000,-1000,-1000,-1000,-1000,-1000,-1000,-1000,-1000,-1000,-1000,-1000,-1000,-1000,-1000,-1000,-1000,-1000,-1000,-1000,-1000,-1000,-1000,-1000,-1000,-1000,-1000,-1000,-1000,,,,,
-600,-600,-600,-600,-600,-600,-600,-600,-600,-600,-600,-600,-600,-600,-600,-600,-600,-600,-600,-600,-600,-600,-600,-600,-600,-600,-600,-600,-600,-600,-600,-600,-600,,,,,
-800,-800,-800,-800,-800,-800,-800,-800,-800,-800,-800,-800,-800,-800,-800,-800,-800,-800,-800,-800,-800,-800,-800,-800,-800,-800,-800,-800,-800,-800,-800,-800,-800,,,,,
-600,-600,-600,-600,-600,-600,-600,-600,-600,-600,-600,-600,-600,-600,-600,-600,-600,-600,-600,-600,-600,-600,-600,-600,-600,-600,-600,-600,-600,-600,-600,-600,-600,,,,,
-600,-600,-600,-600,-600,-600,-600,-600,-600,-600,-600,-600,-600,-600,-600,-600,-600,-600,-600,-600,-600,-600,-600,-600,-600,-600,-600,-600,-600,-600,-600,-600,-600,,,,,
-1000,-1000,-1000,-1000,-1000,-1000,-1000,-1000,-1000,-1000,-1000,-1000,-1000,-1000,-1000,-1000,-1000,-1000,-1000,-1000,-1000,-1000,-1000,-1000,-1000,-1000,-1000,-1000,-1000,-1000,-1000,-1000,-1000,,,,,
-800,-800,-800,-800,-800,-800,-800,-800,-800,-800,-800,-800,-800,-800,-800,-800,-800,-800,-800,-800,-800,-800,-800,-800,-800,-800,-800,-800,-800,-800,-800,-800,-800,,,,,
-800,-800,-800,-800,-800,-800,-800,-800,-800,-800,-800,-800,-800,-800,-800,-800,-800,-800,-800,-800,-800,-800,-800,-800,-800,-800,-800,-800,-800,-800,-800,-800,-800,,,,,
-600,-600,-600,-600,-600,-600,-600,-600,-600,-600,-600,-600,-600,-600,-600,-600,-600,-600,-600,-600,-600,-600,-600,-600,-600,-600,-600,-600,-600,-600,-600,-600,-600,,,,,
-600,-600,-600,-600,-600,-600,-600,-600,-600,-600,-600,-600,-600,-600,-600,-600,-600,-600,-600,-600,-600,-600,-600,-600,-600,-600,-600,-600,-600,-600,-600,-600,-600,,,,,
-800,-800,-800,-800,-800,-800,-800,-800,-800,-800,-800,-800,-800,-800,-800,-800,-800,-800,-800,-800,-800,-800,-800,-800,-800,-800,-800,-800,-800,-800,-800,-800,-800,,,,,
-800,-800,-800,-800,-800,-800,-800,-800,-800,-800,-800,-800,-800,-800,-800,-800,-800,-800,-800,-800,-800,-800,-800,-800,-800,-800,-800,-800,-800,-800,-800,-800,-800,,,,,
-600,-600,-600,-600,-600,-600,-600,-600,-600,-600,-600,-600,-600,-600,-600,-600,-600,-600,-600,-600,-600,-600,-600,-600,-600,-600,-600,-600,-600,-600,-600,-600,-600,,,,,
-1000,-600,-600,-600,-600,-600,-600,-600,-600,-600,-600,-600,-600,-600,-600,-600,-600,-600,-600,-600,-600,-600,-600,-600,-600,-600,-600,-600,-600,-600,-600,-600,-600,,,,,
-2000,-1000,-1000,-1000,-1000,-1000,-1000,-1000,-1000,-1000,-1000,-1000,-1000,-1000,-1000,-1000,-1000,-1000,-1000,-1000,-1000,-1000,-1000,-1000,-1000,-1000,-1000,-1000,-1000,-1000,-1000,-1000,-1000,,,,,
#,raw_col_delta_max,,,,,,,,,,,,,,,,,,,,,,,,,,,,,,,,,,,,
1500,1500,1500,1500,1500,1500,1500,1500,1500,1500,1500,1500,1500,1500,1500,1500,1500,1500,1500,1500,1500,1500,1500,6000,6000,2000,1500,1500,1500,1500,1500,1500,,,,,,
1500,1500,1500,1500,1500,1500,1500,1500,1500,1500,1500,1500,1500,1500,1500,1500,1500,1500,1500,1500,1500,1500,1500,5000,5000,2000,1500,1500,1500,1500,1500,1500,,,,,,
1500,1500,1500,1500,1500,1500,1500,1500,1500,1500,1500,1500,1500,1500,1500,1500,1500,1500,1500,1500,1500,1500,1500,1500,1500,1500,1500,1500,1500,1500,1500,1500,,,,,,
1500,1500,1500,1500,1500,1500,1500,1500,1500,1500,1500,1500,1500,1500,1500,1500,1500,1500,1500,1500,1500,1500,1500,1500,1500,1500,1500,1500,1500,1500,1500,1500,,,,,,
1500,1500,1500,1500,1500,1500,1500,1500,1500,1500,1500,1500,1500,1500,1500,1500,1500,1500,1500,1500,1500,1500,1500,1500,1500,1500,1500,1500,1500,1500,1500,1500,,,,,,
1500,1500,1500,1500,1500,1500,1500,1500,1500,1500,1500,1500,1500,1500,1500,1500,1500,1500,1500,1500,1500,1500,1500,1500,1500,1500,1500,1500,1500,1500,1500,1500,,,,,,
1500,1500,1500,1500,1500,1500,1500,1500,1500,1500,1500,1500,1500,1500,1500,1500,1500,1500,1500,1500,1500,1500,1500,1500,1500,1500,1500,1500,1500,1500,1500,1500,,,,,,
1500,1500,1500,1500,1500,1500,1500,1500,1500,1500,1500,1500,1500,1500,1500,1500,1500,1500,1500,1500,1500,1500,1500,1500,1500,1500,1500,1500,1500,1500,1500,1500,,,,,,
1500,1500,1500,1500,1500,1500,1500,1500,1500,1500,1500,1500,1500,1500,1500,1500,1500,1500,1500,1500,1500,1500,1500,1500,1500,1500,1500,1500,1500,1500,1500,1500,,,,,,
1500,1500,1500,1500,1500,1500,1500,1500,1500,1500,1500,1500,1500,1500,1500,1500,1500,1500,1500,1500,1500,1500,1500,1500,1500,1500,1500,1500,1500,1500,1500,1500,,,,,,
1500,1500,1500,1500,1500,1500,1500,1500,1500,1500,1500,1500,1500,1500,1500,1500,1500,1500,1500,1500,1500,1500,1500,1500,1500,1500,1500,1500,1500,1500,1500,1500,,,,,,
1500,1500,1500,1500,1500,1500,1500,1500,1500,1500,1500,1500,1500,1500,1500,1500,1500,1500,1500,1500,1500,1500,1500,1500,1500,1500,1500,1500,1500,1500,1500,1500,,,,,,
1500,1500,1500,1500,1500,1500,1500,1500,1500,1500,1500,1500,1500,1500,1500,1500,1500,1500,1500,1500,1500,1500,1500,1500,1500,1500,1500,1500,1500,1500,1500,1500,,,,,,
1500,1500,1500,1500,1500,1500,1500,1500,1500,1500,1500,1500,1500,1500,1500,1500,1500,1500,1500,1500,1500,1500,1500,1500,1500,1500,1500,1500,1500,1500,1500,1500,,,,,,
1500,1500,1500,1500,1500,1500,1500,1500,1500,1500,1500,1500,1500,1500,1500,1500,1500,1500,1500,1500,1500,1500,1500,1500,1500,1500,1500,1500,1500,1500,1500,1500,,,,,,
1500,1500,1500,1500,1500,1500,1500,1500,1500,1500,1500,1500,1500,1500,1500,1500,1500,1500,1500,1500,1500,1500,1500,1500,1500,1500,1500,1500,1500,1500,1500,1500,,,,,,
1500,1500,1500,1500,1500,1500,1500,1500,1500,1500,1500,1500,1500,1500,1500,1500,1500,1500,1500,1500,1500,1500,1500,1500,1500,1500,1500,1500,1500,1500,1500,1500,,,,,,
1500,1500,1500,1500,1500,1500,1500,1500,1500,1500,1500,1500,1500,1500,1500,1500,1500,1500,1500,1500,1500,1500,1500,1500,1500,1500,1500,1500,1500,1500,1500,1500,,,,,,
1500,1500,1500,1500,1500,1500,1500,1500,1500,1500,1500,1500,1500,1500,1500,1500,1500,1500,1500,1500,1500,1500,1500,1500,1500,1500,1500,1500,1500,1500,1500,1500,,,,,,
1500,1500,1500,1500,1500,1500,1500,1500,1500,1500,1500,1500,1500,1500,1500,1500,1500,1500,1500,1500,1500,1500,1500,1500,1500,1500,1500,1500,1500,1500,1500,1500,,,,,,
1500,1500,1500,1500,1500,1500,1500,1500,1500,1500,1500,1500,1500,1500,1500,1500,1500,1500,1500,1500,1500,1500,1500,1500,1500,1500,1500,1500,1500,1500,1500,1500,,,,,,
1500,1500,1500,1500,1500,1500,1500,1500,1500,1500,1500,1500,1500,1500,1500,1500,1500,1500,1500,1500,1500,1500,1500,1500,1500,1500,1500,1500,1500,1500,1500,1500,,,,,,
1500,1500,1500,1500,1500,1500,1500,1500,1500,1500,1500,1500,1500,1500,1500,1500,1500,1500,1500,1500,1500,1500,1500,1500,1500,1500,1500,1500,1500,1500,1500,1500,,,,,,
1500,1500,1500,1500,1500,1500,1500,1500,1500,1500,1500,1500,1500,1500,1500,1500,1500,1500,1500,1500,1500,1500,1500,1500,1500,1500,1500,1500,1500,1500,1500,1500,,,,,,
1500,1500,1500,1500,1500,1500,1500,1500,1500,1500,1500,1500,1500,1500,1500,1500,1500,1500,1500,1500,1500,1500,1500,1500,1500,1500,1500,1500,1500,1500,1500,1500,,,,,,
1500,1500,1500,1500,1500,1500,1500,1500,1500,1500,1500,1500,1500,1500,1500,1500,1500,1500,1500,1500,1500,1500,1500,1500,1500,1500,1500,1500,1500,1500,1500,1500,,,,,,
1500,1500,1500,1500,1500,1500,1500,1500,1500,1500,1500,1500,1500,1500,1500,1500,1500,1500,1500,1500,1500,1500,1500,1500,1500,1500,1500,1500,1500,1500,1500,1500,,,,,,
1500,1500,1500,1500,1500,1500,1500,1500,1500,1500,1500,1500,1500,1500,1500,1500,1500,1500,1500,1500,1500,1500,1500,1500,1500,1500,1500,1500,1500,1500,1500,1500,,,,,,
1500,1500,1500,1500,1500,1500,1500,1500,1500,1500,1500,1500,1500,1500,1500,1500,1500,1500,1500,1500,1500,1500,1500,1500,1500,1500,1500,1500,1500,1500,1500,1500,,,,,,
1500,1500,1500,1500,1500,1500,1500,1500,1500,1500,1500,1500,1500,1500,1500,1500,1500,1500,1500,1500,1500,1500,1500,1500,1500,1500,1500,1500,1500,1500,1500,1500,,,,,,
1500,1500,1500,1500,1500,1500,1500,1500,1500,1500,1500,1500,1500,1500,1500,1500,1500,1500,1500,1500,1500,1500,1500,1500,1500,1500,1500,1500,1500,1500,1500,1500,,,,,,
1500,1500,1500,1500,1500,1500,1500,1500,1500,1500,1500,1500,1500,1500,1500,1500,1500,1500,1500,1500,1500,1500,1500,1500,1500,1500,1500,1500,1500,1500,1500,1500,,,,,,
1500,1500,1500,1500,1500,1500,1500,1500,1500,1500,1500,1500,1500,1500,1500,1500,1500,1500,1500,1500,1500,1500,1500,1500,1500,1500,1500,1500,1500,1500,1500,1500,,,,,,
1500,1500,1500,1500,1500,1500,1500,1500,1500,1500,1500,1500,1500,1500,1500,1500,1500,1500,1500,1500,1500,1500,1500,1500,1500,1500,1500,1500,1500,1500,1500,1500,,,,,,
1500,1500,1500,1500,1500,1500,1500,1500,1500,1500,1500,1500,1500,1500,1500,1500,1500,1500,1500,1500,1500,1500,1500,1500,1500,1500,1500,1500,1500,1500,1500,1500,,,,,,
1500,1500,1500,1500,1500,1500,1500,1500,1500,1500,1500,1500,1500,1500,1500,1500,1500,1500,1500,1500,1500,1500,1500,1500,1500,1500,1500,1500,1500,1500,1500,1500,,,,,,
1500,1500,1500,1500,1500,1500,1500,1500,1500,1500,1500,1500,1500,1500,1500,1500,1500,1500,1500,1500,1500,1500,1500,1500,1500,1500,1500,1500,1500,1500,1500,1500,,,,,,
1500,1500,1500,1500,1500,1500,1500,1500,1500,1500,1500,1500,1500,1500,1500,1500,1500,1500,1500,1500,1500,1500,1500,1500,1500,1500,1500,1500,1500,1500,1500,1500,,,,,,
#,raw_col_delta_min,,,,,,,,,,,,,,,,,,,,,,,,,,,,,,,,,,,,
-1500,-1500,-1500,-1500,-1500,-1500,-1500,-1500,-1500,-1500,-1500,-1500,-1500,-1500,-1500,-1500,-1500,-1500,-1500,-1500,-1500,-1500,-1500,-6000,-6000,-2000,-1500,-1500,-1500,-1500,-1500,-1500,,,,,,
-1500,-1500,-1500,-1500,-1500,-1500,-1500,-1500,-1500,-1500,-1500,-1500,-1500,-1500,-1500,-1500,-1500,-1500,-1500,-1500,-1500,-1500,-1500,-5000,-5000,-2000,-1500,-1500,-1500,-1500,-1500,-1500,,,,,,
-1500,-1500,-1500,-1500,-1500,-1500,-1500,-1500,-1500,-1500,-1500,-1500,-1500,-1500,-1500,-1500,-1500,-1500,-1500,-1500,-1500,-1500,-1500,-1500,-1500,-1500,-1500,-1500,-1500,-1500,-1500,-1500,,,,,,
-1500,-1500,-1500,-1500,-1500,-1500,-1500,-1500,-1500,-1500,-1500,-1500,-1500,-1500,-1500,-1500,-1500,-1500,-1500,-1500,-1500,-1500,-1500,-1500,-1500,-1500,-1500,-1500,-1500,-1500,-1500,-1500,,,,,,
-1500,-1500,-1500,-1500,-1500,-1500,-1500,-1500,-1500,-1500,-1500,-1500,-1500,-1500,-1500,-1500,-1500,-1500,-1500,-1500,-1500,-1500,-1500,-1500,-1500,-1500,-1500,-1500,-1500,-1500,-1500,-1500,,,,,,
-1500,-1500,-1500,-1500,-1500,-1500,-1500,-1500,-1500,-1500,-1500,-1500,-1500,-1500,-1500,-1500,-1500,-1500,-1500,-1500,-1500,-1500,-1500,-1500,-1500,-1500,-1500,-1500,-1500,-1500,-1500,-1500,,,,,,
-1500,-1500,-1500,-1500,-1500,-1500,-1500,-1500,-1500,-1500,-1500,-1500,-1500,-1500,-1500,-1500,-1500,-1500,-1500,-1500,-1500,-1500,-1500,-1500,-1500,-1500,-1500,-1500,-1500,-1500,-1500,-1500,,,,,,
-1500,-1500,-1500,-1500,-1500,-1500,-1500,-1500,-1500,-1500,-1500,-1500,-1500,-1500,-1500,-1500,-1500,-1500,-1500,-1500,-1500,-1500,-1500,-1500,-1500,-1500,-1500,-1500,-1500,-1500,-1500,-1500,,,,,,
-1500,-1500,-1500,-1500,-1500,-1500,-1500,-1500,-1500,-1500,-1500,-1500,-1500,-1500,-1500,-1500,-1500,-1500,-1500,-1500,-1500,-1500,-1500,-1500,-1500,-1500,-1500,-1500,-1500,-1500,-1500,-1500,,,,,,
-1500,-1500,-1500,-1500,-1500,-1500,-1500,-1500,-1500,-1500,-1500,-1500,-1500,-1500,-1500,-1500,-1500,-1500,-1500,-1500,-1500,-1500,-1500,-1500,-1500,-1500,-1500,-1500,-1500,-1500,-1500,-1500,,,,,,
-1500,-1500,-1500,-1500,-1500,-1500,-1500,-1500,-1500,-1500,-1500,-1500,-1500,-1500,-1500,-1500,-1500,-1500,-1500,-1500,-1500,-1500,-1500,-1500,-1500,-1500,-1500,-1500,-1500,-1500,-1500,-1500,,,,,,
-1500,-1500,-1500,-1500,-1500,-1500,-1500,-1500,-1500,-1500,-1500,-1500,-1500,-1500,-1500,-1500,-1500,-1500,-1500,-1500,-1500,-1500,-1500,-1500,-1500,-1500,-1500,-1500,-1500,-1500,-1500,-1500,,,,,,
-1500,-1500,-1500,-1500,-1500,-1500,-1500,-1500,-1500,-1500,-1500,-1500,-1500,-1500,-1500,-1500,-1500,-1500,-1500,-1500,-1500,-1500,-1500,-1500,-1500,-1500,-1500,-1500,-1500,-1500,-1500,-1500,,,,,,
-1500,-1500,-1500,-1500,-1500,-1500,-1500,-1500,-1500,-1500,-1500,-1500,-1500,-1500,-1500,-1500,-1500,-1500,-1500,-1500,-1500,-1500,-1500,-1500,-1500,-1500,-1500,-1500,-1500,-1500,-1500,-1500,,,,,,
-1500,-1500,-1500,-1500,-1500,-1500,-1500,-1500,-1500,-1500,-1500,-1500,-1500,-1500,-1500,-1500,-1500,-1500,-1500,-1500,-1500,-1500,-1500,-1500,-1500,-1500,-1500,-1500,-1500,-1500,-1500,-1500,,,,,,
-1500,-1500,-1500,-1500,-1500,-1500,-1500,-1500,-1500,-1500,-1500,-1500,-1500,-1500,-1500,-1500,-1500,-1500,-1500,-1500,-1500,-1500,-1500,-1500,-1500,-1500,-1500,-1500,-1500,-1500,-1500,-1500,,,,,,
-1500,-1500,-1500,-1500,-1500,-1500,-1500,-1500,-1500,-1500,-1500,-1500,-1500,-1500,-1500,-1500,-1500,-1500,-1500,-1500,-1500,-1500,-1500,-1500,-1500,-1500,-1500,-1500,-1500,-1500,-1500,-1500,,,,,,
-1500,-1500,-1500,-1500,-1500,-1500,-1500,-1500,-1500,-1500,-1500,-1500,-1500,-1500,-1500,-1500,-1500,-1500,-1500,-1500,-1500,-1500,-1500,-1500,-1500,-1500,-1500,-1500,-1500,-1500,-1500,-1500,,,,,,
-1500,-1500,-1500,-1500,-1500,-1500,-1500,-1500,-1500,-1500,-1500,-1500,-1500,-1500,-1500,-1500,-1500,-1500,-1500,-1500,-1500,-1500,-1500,-1500,-1500,-1500,-1500,-1500,-1500,-1500,-1500,-1500,,,,,,
-1500,-1500,-1500,-1500,-1500,-1500,-1500,-1500,-1500,-1500,-1500,-1500,-1500,-1500,-1500,-1500,-1500,-1500,-1500,-1500,-1500,-1500,-1500,-1500,-1500,-1500,-1500,-1500,-1500,-1500,-1500,-1500,,,,,,
-1500,-1500,-1500,-1500,-1500,-1500,-1500,-1500,-1500,-1500,-1500,-1500,-1500,-1500,-1500,-1500,-1500,-1500,-1500,-1500,-1500,-1500,-1500,-1500,-1500,-1500,-1500,-1500,-1500,-1500,-1500,-1500,,,,,,
-1500,-1500,-1500,-1500,-1500,-1500,-1500,-1500,-1500,-1500,-1500,-1500,-1500,-1500,-1500,-1500,-1500,-1500,-1500,-1500,-1500,-1500,-1500,-1500,-1500,-1500,-1500,-1500,-1500,-1500,-1500,-1500,,,,,,
-1500,-1500,-1500,-1500,-1500,-1500,-1500,-1500,-1500,-1500,-1500,-1500,-1500,-1500,-1500,-1500,-1500,-1500,-1500,-1500,-1500,-1500,-1500,-1500,-1500,-1500,-1500,-1500,-1500,-1500,-1500,-1500,,,,,,
-1500,-1500,-1500,-1500,-1500,-1500,-1500,-1500,-1500,-1500,-1500,-1500,-1500,-1500,-1500,-1500,-1500,-1500,-1500,-1500,-1500,-1500,-1500,-1500,-1500,-1500,-1500,-1500,-1500,-1500,-1500,-1500,,,,,,
-1500,-1500,-1500,-1500,-1500,-1500,-1500,-1500,-1500,-1500,-1500,-1500,-1500,-1500,-1500,-1500,-1500,-1500,-1500,-1500,-1500,-1500,-1500,-1500,-1500,-1500,-1500,-1500,-1500,-1500,-1500,-1500,,,,,,
-1500,-1500,-1500,-1500,-1500,-1500,-1500,-1500,-1500,-1500,-1500,-1500,-1500,-1500,-1500,-1500,-1500,-1500,-1500,-1500,-1500,-1500,-1500,-1500,-1500,-1500,-1500,-1500,-1500,-1500,-1500,-1500,,,,,,
-1500,-1500,-1500,-1500,-1500,-1500,-1500,-1500,-1500,-1500,-1500,-1500,-1500,-1500,-1500,-1500,-1500,-1500,-1500,-1500,-1500,-1500,-1500,-1500,-1500,-1500,-1500,-1500,-1500,-1500,-1500,-1500,,,,,,
-1500,-1500,-1500,-1500,-1500,-1500,-1500,-1500,-1500,-1500,-1500,-1500,-1500,-1500,-1500,-1500,-1500,-1500,-1500,-1500,-1500,-1500,-1500,-1500,-1500,-1500,-1500,-1500,-1500,-1500,-1500,-1500,,,,,,
-1500,-1500,-1500,-1500,-1500,-1500,-1500,-1500,-1500,-1500,-1500,-1500,-1500,-1500,-1500,-1500,-1500,-1500,-1500,-1500,-1500,-1500,-1500,-1500,-1500,-1500,-1500,-1500,-1500,-1500,-1500,-1500,,,,,,
-1500,-1500,-1500,-1500,-1500,-1500,-1500,-1500,-1500,-1500,-1500,-1500,-1500,-1500,-1500,-1500,-1500,-1500,-1500,-1500,-1500,-1500,-1500,-1500,-1500,-1500,-1500,-1500,-1500,-1500,-1500,-1500,,,,,,
-1500,-1500,-1500,-1500,-1500,-1500,-1500,-1500,-1500,-1500,-1500,-1500,-1500,-1500,-1500,-1500,-1500,-1500,-1500,-1500,-1500,-1500,-1500,-1500,-1500,-1500,-1500,-1500,-1500,-1500,-1500,-1500,,,,,,
-1500,-1500,-1500,-1500,-1500,-1500,-1500,-1500,-1500,-1500,-1500,-1500,-1500,-1500,-1500,-1500,-1500,-1500,-1500,-1500,-1500,-1500,-1500,-1500,-1500,-1500,-1500,-1500,-1500,-1500,-1500,-1500,,,,,,
-1500,-1500,-1500,-1500,-1500,-1500,-1500,-1500,-1500,-1500,-1500,-1500,-1500,-1500,-1500,-1500,-1500,-1500,-1500,-1500,-1500,-1500,-1500,-1500,-1500,-1500,-1500,-1500,-1500,-1500,-1500,-1500,,,,,,
-1500,-1500,-1500,-1500,-1500,-1500,-1500,-1500,-1500,-1500,-1500,-1500,-1500,-1500,-1500,-1500,-1500,-1500,-1500,-1500,-1500,-1500,-1500,-1500,-1500,-1500,-1500,-1500,-1500,-1500,-1500,-1500,,,,,,
-1500,-1500,-1500,-1500,-1500,-1500,-1500,-1500,-1500,-1500,-1500,-1500,-1500,-1500,-1500,-1500,-1500,-1500,-1500,-1500,-1500,-1500,-1500,-1500,-1500,-1500,-1500,-1500,-1500,-1500,-1500,-1500,,,,,,
-1500,-1500,-1500,-1500,-1500,-1500,-1500,-1500,-1500,-1500,-1500,-1500,-1500,-1500,-1500,-1500,-1500,-1500,-1500,-1500,-1500,-1500,-1500,-1500,-1500,-1500,-1500,-1500,-1500,-1500,-1500,-1500,,,,,,
-1500,-1500,-1500,-1500,-1500,-1500,-1500,-1500,-1500,-1500,-1500,-1500,-1500,-1500,-1500,-1500,-1500,-1500,-1500,-1500,-1500,-1500,-1500,-1500,-1500,-1500,-1500,-1500,-1500,-1500,-1500,-1500,,,,,,
-1500,-1500,-1500,-1500,-1500,-1500,-1500,-1500,-1500,-1500,-1500,-1500,-1500,-1500,-1500,-1500,-1500,-1500,-1500,-1500,-1500,-1500,-1500,-1500,-1500,-1500,-1500,-1500,-1500,-1500,-1500,-1500,,,,,,
#,line_max,,,,,,,,,,,,,,,,,,,,,,,,,,,,,,,,,,,,
8000,8000,8000,8000,8000,8000,8000,8000,8000,8000,8000,8000,8000,8000,8000,8000,8000,8000,8000,8000,8000,8000,8000,8000,8000,8000,8000,8000,8000,8000,8000,8000,8000,,,,,
8000,8000,8000,8000,8000,8000,8000,8000,8000,8000,8000,8000,8000,8000,8000,8000,8000,8000,8000,8000,8000,8000,8000,8000,8000,8000,8000,8000,8000,8000,8000,8000,8000,8000,8000,8000,8000,8000
#,line_min,,,,,,,,,,,,,,,,,,,,,,,,,,,,,,,,,,,,
300,300,300,300,300,300,300,300,300,300,300,300,300,300,300,300,300,300,300,300,300,300,300,300,300,300,300,300,300,300,300,300,300,,,,,
300,300,300,300,300,300,300,300,300,300,300,300,300,300,300,300,300,300,300,300,300,300,300,300,300,300,300,300,300,300,300,300,300,300,300,300,300,300
