{
	"blue_controllist":
	{
		"com.huawei.android.pushagent":["com.huawei.hifolder","com.huawei.hidisk","com.huawei.hicloud","com.huawei.android.thememanager","com.huawei.android.hsf","com.huawei.appmarket","com.huawei.appgallery.overlay","com.huawei.search","com.huawei.wallet","com.huawei.wallet.sdk.walletsdk","com.huawei.gameassistant","com.huawei.fastapp","com.huawei.android.findmyphone","com.huawei.gamebox","com.huawei.gamebox.overlay","com.huawei.lives","com.huawei.music","com.huawei.browser","com.huawei.welinknow","com.android.packageinstaller","com.huawei.hwireader","com.huawei.hnreader","com.huawei.filemanager","com.huawei.himovie","com.sohu.sohuvideo.emplayer","com.huawei.himovie.partner1","com.huawei.himovie.partner2","com.huawei.webview","com.huawei.triwebviewlib","com.huawei.android.pushagent","com.android.permissioncontroller","com.huawei.skytone","com.huawei.hiskytone","com.huawei.hbm","com.huawei.android.FMRadio","com.huawei.intelligent","com.huawei.educenter","com.huawei.educenter.overlay","com.huawei.hwid","com.huawei.cloudtwopizza.apkmanager","com.petal.litegames","com.android.emergency","com.huawei.hwread.dz","com.huawei.vassistant","com.huawei.scanner","com.huawei.meetime","com.huawei.health"]	
	}
}