[
  {
    "name": "high_school",
    "support": true,
    "path": "/product_h/etc/HnStylusFeature/assets/math/high_school",
    "dialects": []
  },
  {
    "name": "math",
    "support": true,
    "path": "/product_h/etc/HnStylusFeature/assets/math/math",
    "dialects": []
  },
  {
    "name": "math_calculator",
    "support": true,
    "path": "/product_h/etc/HnStylusFeature/assets/math/math_calculator",
    "dialects": []
  },
  {
    "name": "math_chem",
    "support": true,
    "path": "/product_h/etc/HnStylusFeature/assets/math/math_chem",
    "dialects": []
  },
  {
    "name": "math_crohme",
    "support": true,
    "path": "/product_h/etc/HnStylusFeature/assets/math/math_crohme",
    "dialects": []
  },
  {
    "name": "math_generic",
    "support": true,
    "path": "/product_h/etc/HnStylusFeature/assets/math/math_generic",
    "dialects": []
  },
  {
    "name": "math_sunia",
    "support": true,
    "path": "/product_h/etc/HnStylusFeature/assets/math/math_sunia",
    "dialects": []
  },
  {
    "name": "middle_school",
    "support": true,
    "path": "/product_h/etc/HnStylusFeature/assets/math/middle_school",
    "dialects": []
  },
  {
    "name": "primary_school",
    "support": true,
    "path": "/product_h/etc/HnStylusFeature/assets/math/primary_school",
    "dialects": []
  },
  {
    "name": "primary_school_strict",
    "support": true,
    "path": "/product_h/etc/HnStylusFeature/assets/math/primary_school_strict",
    "dialects": []
  },
  {
    "name": "shape",
    "support": true,
    "path": "/product_h/etc/HnStylusFeature/assets/shape",
    "dialects": []
  },
  {
    "name": "af_ZA",
    "support": false,
    "path": "",
    "dialects": []
  },
  {
    "name": "az_AZ",
    "support": false,
    "path": "",
    "dialects": []
  },
  {
    "name": "be_BY",
    "support": false,
    "path": "",
    "dialects": []
  },
  {
    "name": "bg_BG",
    "support": false,
    "path": "",
    "dialects": []
  },
  {
    "name": "bs_BA",
    "support": false,
    "path": "",
    "dialects": []
  },
  {
    "name": "ca_ES",
    "support": false,
    "path": "",
    "dialects": [
      "ca_AD",
      "ca_FR",
      "ca_IT"
    ]
  },
  {
    "name": "ceb_PH",
    "support": false,
    "path": "",
    "dialects": []
  },
  {
    "name": "cs_CZ",
    "support": false,
    "path": "",
    "dialects": []
  },
  {
    "name": "da_DK",
    "support": false,
    "path": "",
    "dialects": [
      "da_GL"
    ]
  },
  {
    "name": "de_DE",
    "support": true,
    "path": "/product_h/etc/HnStylusFeature/assets/text/de_DE",
    "dialects": [
      "de_AT",
      "de_BE",
      "de_CH",
      "de_LI",
      "de_LU"
    ]
  },
  {
    "name": "de_AT",
    "support": false,
    "path": "",
    "dialects": []
  },
  {
    "name": "el_GR",
    "support": false,
    "path": "",
    "dialects": [
      "el_CY"
    ]
  },
  {
    "name": "en_US",
    "support": true,
    "path": "/product_h/etc/HnStylusFeature/assets/text/en_US",
    "dialects": [
      "en_AS",
      "en_AT",
      "en_BI",
      "en_BW",
      "en_CA",
      "en_CH",
      "en_CM",
      "en_CY",
      "en_DE",
      "en_DK",
      "en_DM",
      "en_FI",
      "en_FJ",
      "en_GH",
      "en_GM",
      "en_GU",
      "en_IL",
      "en_JM",
      "en_KE",
      "en_MG",
      "en_MH",
      "en_MP",
      "en_MU",
      "en_MW",
      "en_NA",
      "en_NG",
      "en_NL",
      "en_PH",
      "en_PR",
      "en_RW",
      "en_SE",
      "en_SI",
      "en_TO",
      "en_TZ",
      "en_UG",
      "en_UM",
      "en_VI",
      "en_VU",
      "en_ZA",
      "en_ZM",
      "en_ZW"
    ]
  },
  {
    "name": "en_CA",
    "support": false,
    "path": "",
    "dialects": []
  },
  {
    "name": "en_GB",
    "support": false,
    "path": "",
    "dialects": [
      "en_AG",
      "en_AI",
      "en_AU",
      "en_BB",
      "en_BE",
      "en_BM",
      "en_BS",
      "en_BZ",
      "en_CC",
      "en_CK",
      "en_CX",
      "en_DG",
      "en_ER",
      "en_FK",
      "en_FM",
      "en_GD",
      "en_GG",
      "en_GI",
      "en_GY",
      "en_HK",
      "en_IE",
      "en_IM",
      "en_IN",
      "en_IO",
      "en_JE",
      "en_KI",
      "en_KN",
      "en_KY",
      "en_LC",
      "en_LR",
      "en_LS",
      "en_MM",
      "en_MO",
      "en_MS",
      "en_MT",
      "en_MY",
      "en_NF",
      "en_NR",
      "en_NU",
      "en_NZ",
      "en_PG",
      "en_PK",
      "en_PN",
      "en_PW",
      "en_SB",
      "en_SC",
      "en_SG",
      "en_SH",
      "en_SL",
      "en_SS",
      "en_SX",
      "en_SZ",
      "en_TC",
      "en_TK",
      "en_TT",
      "en_TV",
      "en_VC",
      "en_VG",
      "en_WS"
    ]
  },
  {
    "name": "en_PH",
    "support": false,
    "path": "",
    "dialects": []
  },
  {
    "name": "es_ES",
    "support": true,
    "path": "/product_h/etc/HnStylusFeature/assets/text/es_ES",
    "dialects": [
      "es_EA",
      "es_GQ",
      "es_IC",
      "es_PH"
    ]
  },
  {
    "name": "es_CO",
    "support": false,
    "path": "",
    "dialects": []
  },
  {
    "name": "es_MX",
    "support": false,
    "path": "",
    "dialects": []
  },
  {
    "name": "et_EE",
    "support": false,
    "path": "",
    "dialects": []
  },
  {
    "name": "eu_ES",
    "support": false,
    "path": "",
    "dialects": []
  },
  {
    "name": "fi_FI",
    "support": false,
    "path": "",
    "dialects": []
  },
  {
    "name": "fil_PH",
    "support": false,
    "path": "",
    "dialects": []
  },
  {
    "name": "fr_FR",
    "support": true,
    "path": "/product_h/etc/HnStylusFeature/assets/text/fr_FR",
    "dialects": [
      "fr_BE",
      "fr_BF",
      "fr_BI",
      "fr_BJ",
      "fr_BL",
      "fr_CD",
      "fr_CF",
      "fr_CG",
      "fr_CH",
      "fr_CI",
      "fr_CM",
      "fr_DJ",
      "fr_DZ",
      "fr_GA",
      "fr_GF",
      "fr_GN",
      "fr_GP",
      "fr_GQ",
      "fr_HT",
      "fr_KM",
      "fr_LU",
      "fr_MA",
      "fr_MC",
      "fr_MF",
      "fr_MG",
      "fr_ML",
      "fr_MQ",
      "fr_MR",
      "fr_MU",
      "fr_NC",
      "fr_NE",
      "fr_PF",
      "fr_PM",
      "fr_RE",
      "fr_RW",
      "fr_SC",
      "fr_SN",
      "fr_TD",
      "fr_TG",
      "fr_TN",
      "fr_VU",
      "fr_WF",
      "fr_YT"
    ]
  },
  {
    "name": "fr_CA",
    "support": false,
    "path": "",
    "dialects": []
  },
  {
    "name": "ga_IE",
    "support": false,
    "path": "",
    "dialects": []
  },
  {
    "name": "gl_ES",
    "support": false,
    "path": "",
    "dialects": []
  },
  {
    "name": "hr_HR",
    "support": false,
    "path": "",
    "dialects": [
      "hr_BA"
    ]
  },
  {
    "name": "hu_HU",
    "support": false,
    "path": "",
    "dialects": []
  },
  {
    "name": "hy_AM",
    "support": false,
    "path": "",
    "dialects": []
  },
  {
    "name": "id_ID",
    "support": false,
    "path": "",
    "dialects": []
  },
  {
    "name": "is_IS",
    "support": false,
    "path": "",
    "dialects": []
  },
  {
    "name": "it_IT",
    "support": true,
    "path": "/product_h/etc/HnStylusFeature/assets/text/it_IT",
    "dialects": [
      "it_CH",
      "it_SM"
    ]
  },
  {
    "name": "ja_JP",
    "support": true,
    "path": "/product_h/etc/HnStylusFeature/assets/text/ja_JP",
    "dialects": []
  },
  {
    "name": "ka_GE",
    "support": false,
    "path": "",
    "dialects": []
  },
  {
    "name": "kk_KZ",
    "support": false,
    "path": "",
    "dialects": []
  },
  {
    "name": "ko_KR",
    "support": true,
    "path": "/product_h/etc/HnStylusFeature/assets/text/ko_KR",
    "dialects": []
  },
  {
    "name": "lt_LT",
    "support": false,
    "path": "",
    "dialects": []
  },
  {
    "name": "lv_LV",
    "support": false,
    "path": "",
    "dialects": []
  },
  {
    "name": "mg_MG",
    "support": false,
    "path": "",
    "dialects": []
  },
  {
    "name": "mk_MK",
    "support": false,
    "path": "",
    "dialects": []
  },
  {
    "name": "mn_MN",
    "support": false,
    "path": "",
    "dialects": []
  },
  {
    "name": "ms_MY",
    "support": false,
    "path": "",
    "dialects": [
      "ms_BN",
      "ms_SG"
    ]
  },
  {
    "name": "nl_NL",
    "support": true,
    "path": "/product_h/etc/HnStylusFeature/assets/text/nl_NL",
    "dialects": [
      "nl_AW",
      "nl_BQ",
      "nl_CW",
      "nl_SR",
      "nl_SX"
    ]
  },
  {
    "name": "nl_BE",
    "support": false,
    "path": "",
    "dialects": []
  },
  {
    "name": "no",
    "support": true,
    "path": "/product_h/etc/HnStylusFeature/assets/text/no",
    "dialects": []
  },
  {
    "name": "pl_PL",
    "support": false,
    "path": "",
    "dialects": []
  },
  {
    "name": "pt_PT",
    "support": false,
    "path": "",
    "dialects": [
      "pt_AO",
      "pt_CV",
      "pt_GW",
      "pt_MO",
      "pt_MZ",
      "pt_ST",
      "pt_TL"
    ]
  },
  {
    "name": "pt_BR",
    "support": true,
    "path": "/product_h/etc/HnStylusFeature/assets/text/pt_BR",
    "dialects": []
  },
  {
    "name": "ro_RO",
    "support": false,
    "path": "",
    "dialects": [
      "ro_MD"
    ]
  },
  {
    "name": "ru_RU",
    "support": true,
    "path": "/product_h/etc/HnStylusFeature/assets/text/ru_RU",
    "dialects": [
      "ru_BY",
      "ru_KG",
      "ru_KZ",
      "ru_MD",
      "ru_UA"
    ]
  },
  {
    "name": "sk_SK",
    "support": false,
    "path": "",
    "dialects": []
  },
  {
    "name": "sl_SI",
    "support": false,
    "path": "",
    "dialects": []
  },
  {
    "name": "sq_AL",
    "support": false,
    "path": "",
    "dialects": [
      "sq_MK",
      "sq_XK"
    ]
  },
  {
    "name": "sr_RS",
    "support": false,
    "path": "",
    "dialects": [
      "sr_BA",
      "sr_ME"
    ]
  },
  {
    "name": "sr_Latn_RS",
    "support": false,
    "path": "",
    "dialects": [
    ]
  },
  {
    "name": "sv_SE",
    "support": false,
    "path": "",
    "dialects": [
      "sv_AX",
      "sv_FI"
    ]
  },
  {
    "name": "sw_TZ",
    "support": false,
    "path": "",
    "dialects": [
      "sw_CD",
      "sw_KE",
      "sw_UG"
    ]
  },
  {
    "name": "tr_TR",
    "support": true,
    "path": "/product_h/etc/HnStylusFeature/assets/text/tr_TR",
    "dialects": [
      "tr_CY"
    ]
  },
  {
    "name": "tt_RU",
    "support": false,
    "path": "",
    "dialects": []
  },
  {
    "name": "uk_UA",
    "support": false,
    "path": "",
    "dialects": []
  },
  {
    "name": "vi_VN",
    "support": false,
    "path": "",
    "dialects": []
  },
  {
    "name": "zh_CN",
    "support": true,
    "path": "/product_h/etc/HnStylusFeature/assets/text/zh_CN",
    "dialects": [
      "zh_MO",
      "zh_SG"
    ]
  },
  {
    "name": "zh_HK",
    "support": true,
    "path": "/product_h/etc/HnStylusFeature/assets/text/zh_HK",
    "dialects": []
  },
  {
    "name": "zh_TW",
    "support": true,
    "path": "/product_h/etc/HnStylusFeature/assets/text/zh_TW",
    "dialects": []
  }
]