#,version,,,,,,,,,,,,,,,,,,,,,,,,,,,,,,,,,,,,,,,,,,,,,,,,,,,,,,,,,,,,,,,,
2022,3,4,1,,,,,,,,,,,,,,,,,,,,,,,,,,,,,,,,,,,,,,,,,,,,,,,,,,,,,,,,,,,,,,
#,row_col_num,,,,,,,,,,,,,,,,,,,,,,,,,,,,,,,,,,,,,,,,,,,,,,,,,,,,,,,,,,,,,,,,
38,33,,,,,,,,,,,,,,,,,,,,,,,,,,,,,,,,,,,,,,,,,,,,,,,,,,,,,,,,,,,,,,,,
#,noise,,,,,,,,,,,,,,,,,,,,,,,,,,,,,,,,,,,,,,,,,,,,,,,,,,,,,,,,,,,,,,,,
-600,600,,,,,,,,,,,,,,,,,,,,,,,,,,,,,,,,,,,,,,,,,,,,,,,,,,,,,,,,,,,,,,,,
#,raw_max,,,,,,,,,,,,,,,,,,,,,,,,,,,,,,,,,,,,,,,,,,,,,,,,,,,,,,,,,,,,,,,,
9430,8865,8798,8767,8771,8797,8819,8856,8876,8880,8886,8899,8935,8941,8957,8984,8967,8965,8977,8990,9016,9042,9065,9151,8388,8741,9188,9246,9320,9490,9749,10292,12108,,,,,,,,,,,,,,,,,,,,,,,,,,,,,,,,,
9211,8811,8779,8756,8757,8775,8804,8818,8840,8830,8835,8834,8865,8865,8876,8901,8879,8873,8883,8893,8918,8938,8953,9026,8186,9036,9023,9058,9107,9195,9326,9568,10417,,,,,,,,,,,,,,,,,,,,,,,,,,,,,,,,,
9071,8767,8761,8750,8774,8783,8815,8832,8856,8845,8858,8852,8883,8893,8899,8921,8896,8893,8901,8912,8935,8954,8966,8996,8999,9005,9023,9045,9075,9139,9213,9351,9876,,,,,,,,,,,,,,,,,,,,,,,,,,,,,,,,,
9047,8776,8783,8780,8802,8822,8860,8876,8901,8892,8905,8897,8928,8932,8947,8970,8944,8940,8949,8960,8984,9001,9012,9042,9036,9038,9056,9070,9090,9138,9182,9268,9656,,,,,,,,,,,,,,,,,,,,,,,,,,,,,,,,,
8727,8470,8481,8483,8515,8535,8572,8592,8616,8607,8620,8618,8644,8663,8665,8685,8662,8659,8670,8679,8702,8719,8727,8756,8746,8744,8758,8767,8783,8814,8840,8895,9208,,,,,,,,,,,,,,,,,,,,,,,,,,,,,,,,,
8988,8715,8727,8727,8748,8784,8811,8848,8858,8862,8861,8867,8887,8909,8923,8953,8913,8922,8930,8939,8965,8982,8988,9016,9005,9001,9013,9019,9025,9049,9070,9105,9389,,,,,,,,,,,,,,,,,,,,,,,,,,,,,,,,,
8983,8700,8710,8710,8730,8767,8795,8828,8844,8850,8850,8858,8876,8897,8913,8925,8889,8915,8918,8930,8956,8971,8978,9004,8992,8983,8993,8997,9001,9019,9031,9056,9317,,,,,,,,,,,,,,,,,,,,,,,,,,,,,,,,,
8971,8691,8705,8705,8724,8759,8787,8824,8836,8841,8843,8852,8870,8892,8906,8912,8886,8896,8915,8928,8960,8969,8974,8997,8987,8977,8983,8984,8986,9000,9005,9022,9268,,,,,,,,,,,,,,,,,,,,,,,,,,,,,,,,,
8960,8679,8694,8697,8714,8749,8775,8814,8828,8835,8837,8847,8875,8886,8900,8925,8906,8900,8912,8922,8944,8961,8966,8990,8974,8964,8971,8970,8969,8982,8984,8993,9233,,,,,,,,,,,,,,,,,,,,,,,,,,,,,,,,,
8956,8668,8685,8689,8707,8741,8775,8808,8839,8831,8834,8844,8878,8886,8900,8922,8899,8899,8909,8918,8941,8956,8961,8986,8965,8954,8962,8958,8953,8965,8964,8974,9207,,,,,,,,,,,,,,,,,,,,,,,,,,,,,,,,,
8837,8546,8562,8564,8585,8619,8644,8681,8700,8707,8707,8720,8740,8761,8759,8779,8754,8756,8776,8775,8797,8810,8815,8840,8848,8830,8835,8828,8823,8832,8828,8830,9061,,,,,,,,,,,,,,,,,,,,,,,,,,,,,,,,,
8675,8389,8405,8406,8427,8460,8488,8524,8542,8551,8554,8564,8584,8603,8619,8622,8598,8598,8623,8639,8644,8666,8668,8691,8675,8665,8668,8665,8658,8665,8662,8663,8888,,,,,,,,,,,,,,,,,,,,,,,,,,,,,,,,,
8863,8570,8585,8589,8607,8645,8672,8710,8728,8737,8740,8754,8772,8793,8792,8809,8784,8784,8813,8801,8822,8835,8845,8886,8861,8849,8854,8849,8841,8849,8843,8844,9071,,,,,,,,,,,,,,,,,,,,,,,,,,,,,,,,,
8598,8311,8328,8333,8353,8386,8414,8451,8470,8479,8483,8496,8515,8535,8533,8550,8525,8524,8557,8540,8559,8571,8572,8603,8597,8584,8588,8581,8576,8583,8575,8575,8796,,,,,,,,,,,,,,,,,,,,,,,,,,,,,,,,,
8819,8518,8538,8548,8564,8598,8626,8665,8684,8692,8696,8711,8731,8750,8766,8766,8740,8740,8763,8762,8774,8810,8802,8824,8806,8795,8801,8795,8788,8793,8785,8785,9013,,,,,,,,,,,,,,,,,,,,,,,,,,,,,,,,,
8776,8476,8501,8514,8529,8559,8587,8624,8644,8652,8657,8671,8692,8711,8736,8727,8700,8701,8723,8711,8732,8753,8761,8783,8765,8752,8759,8752,8744,8749,8741,8737,8964,,,,,,,,,,,,,,,,,,,,,,,,,,,,,,,,,
8685,8392,8418,8429,8445,8476,8499,8537,8557,8564,8570,8583,8601,8620,8622,8639,8611,8611,8618,8622,8642,8652,8653,8675,8667,8671,8671,8663,8655,8659,8652,8648,8870,,,,,,,,,,,,,,,,,,,,,,,,,,,,,,,,,
8709,8415,8440,8453,8468,8502,8524,8562,8580,8589,8593,8607,8626,8646,8654,8661,8636,8635,8657,8646,8667,8676,8700,8715,8697,8685,8692,8683,8678,8681,8672,8670,8892,,,,,,,,,,,,,,,,,,,,,,,,,,,,,,,,,
8499,8204,8232,8245,8260,8289,8312,8349,8367,8376,8381,8394,8411,8432,8432,8446,8423,8420,8428,8432,8451,8460,8460,8484,8468,8464,8485,8470,8463,8467,8458,8454,8674,,,,,,,,,,,,,,,,,,,,,,,,,,,,,,,,,
8369,8082,8109,8124,8139,8160,8169,8202,8219,8225,8233,8247,8263,8278,8284,8301,8277,8276,8284,8285,8303,8314,8312,8337,8333,8332,8346,8353,8338,8342,8332,8330,8553,,,,,,,,,,,,,,,,,,,,,,,,,,,,,,,,,
8546,8264,8290,8306,8320,8343,8354,8385,8402,8408,8415,8431,8445,8460,8466,8483,8458,8457,8463,8464,8484,8493,8492,8518,8512,8512,8519,8512,8514,8532,8498,8515,8740,,,,,,,,,,,,,,,,,,,,,,,,,,,,,,,,,
8555,8271,8298,8314,8328,8349,8362,8392,8408,8414,8421,8436,8451,8467,8471,8488,8463,8462,8467,8470,8489,8497,8497,8523,8519,8518,8525,8516,8510,8524,8505,8523,8754,,,,,,,,,,,,,,,,,,,,,,,,,,,,,,,,,
8654,8366,8392,8405,8419,8444,8454,8485,8502,8507,8512,8529,8545,8562,8564,8581,8554,8553,8558,8561,8579,8588,8588,8613,8610,8610,8619,8610,8602,8609,8600,8601,8830,,,,,,,,,,,,,,,,,,,,,,,,,,,,,,,,,
8375,8096,8117,8125,8141,8167,8178,8210,8224,8232,8237,8251,8265,8281,8286,8302,8275,8275,8278,8281,8298,8304,8306,8330,8329,8329,8337,8337,8338,8342,8343,8336,8559,,,,,,,,,,,,,,,,,,,,,,,,,,,,,,,,,
8412,8137,8155,8158,8176,8204,8217,8250,8265,8272,8280,8293,8304,8321,8324,8341,8316,8312,8317,8317,8334,8343,8343,8369,8368,8368,8376,8371,8364,8371,8364,8373,8593,,,,,,,,,,,,,,,,,,,,,,,,,,,,,,,,,
8672,8390,8407,8410,8428,8458,8471,8505,8520,8528,8535,8546,8562,8576,8579,8596,8568,8564,8568,8568,8587,8597,8600,8627,8623,8624,8633,8627,8646,8646,8632,8644,8876,,,,,,,,,,,,,,,,,,,,,,,,,,,,,,,,,
8736,8453,8471,8472,8489,8518,8532,8563,8580,8588,8594,8607,8620,8636,8637,8655,8628,8624,8627,8629,8645,8655,8658,8683,8683,8683,8692,8688,8685,8694,8689,8697,8932,,,,,,,,,,,,,,,,,,,,,,,,,,,,,,,,,
8704,8423,8438,8441,8458,8485,8498,8531,8545,8553,8559,8572,8585,8600,8601,8619,8592,8587,8592,8592,8610,8619,8622,8648,8646,8648,8658,8655,8653,8665,8662,8694,8914,,,,,,,,,,,,,,,,,,,,,,,,,,,,,,,,,
8438,8172,8187,8190,8207,8232,8247,8277,8290,8298,8303,8315,8327,8342,8342,8359,8333,8329,8330,8333,8353,8359,8363,8386,8386,8389,8399,8401,8398,8411,8412,8423,8654,,,,,,,,,,,,,,,,,,,,,,,,,,,,,,,,,
8629,8363,8377,8379,8395,8421,8436,8466,8479,8485,8490,8503,8514,8528,8529,8546,8518,8514,8518,8519,8537,8548,8551,8576,8579,8581,8594,8596,8596,8609,8616,8629,8873,,,,,,,,,,,,,,,,,,,,,,,,,,,,,,,,,
8649,8381,8395,8398,8414,8440,8451,8481,8497,8502,8507,8519,8531,8545,8542,8561,8532,8528,8531,8533,8551,8561,8563,8592,8593,8600,8610,8614,8618,8636,8645,8666,8918,,,,,,,,,,,,,,,,,,,,,,,,,,,,,,,,,
8654,8388,8402,8402,8421,8442,8458,8488,8498,8503,8510,8519,8531,8542,8544,8558,8529,8524,8529,8532,8549,8558,8563,8592,8596,8603,8618,8622,8627,8649,8662,8689,8958,,,,,,,,,,,,,,,,,,,,,,,,,,,,,,,,,
8654,8399,8411,8412,8427,8453,8463,8497,8507,8510,8515,8524,8535,8549,8549,8567,8537,8532,8533,8537,8555,8566,8572,8600,8606,8614,8629,8637,8646,8672,8693,8733,9023,,,,,,,,,,,,,,,,,,,,,,,,,,,,,,,,,
8455,8207,8217,8215,8228,8251,8260,8290,8301,8306,8310,8319,8332,8345,8342,8362,8333,8328,8329,8333,8351,8362,8367,8395,8402,8412,8431,8442,8457,8489,8520,8574,8891,,,,,,,,,,,,,,,,,,,,,,,,,,,,,,,,,
8749,8485,8488,8479,8488,8507,8515,8545,8554,8559,8562,8570,8583,8594,8594,8611,8583,8576,8579,8583,8602,8611,8616,8649,8657,8670,8692,8709,8730,8774,8821,8904,9295,,,,,,,,,,,,,,,,,,,,,,,,,,,,,,,,,
8782,8486,8475,8460,8464,8481,8485,8512,8522,8524,8525,8532,8545,8557,8555,8572,8545,8538,8541,8545,8563,8574,8584,8616,8628,8642,8668,8692,8723,8782,8860,8992,9511,,,,,,,,,,,,,,,,,,,,,,,,,,,,,,,,,
8883,8501,8470,8444,8441,8454,8454,8479,8486,8489,8489,8494,8506,8518,8516,8533,8505,8498,8502,8506,8524,8538,8550,8581,8597,8618,8649,8683,8730,8818,8945,9181,10005,,,,,,,,,,,,,,,,,,,,,,,,,,,,,,,,,
9238,8572,8489,8451,8449,8462,8467,8498,8509,8516,8520,8531,8548,8566,8568,8588,8564,8561,8570,8581,8602,8623,8640,8676,8704,8736,8784,8845,8925,9091,9350,9885,11727,,,,,,,,,,,,,,,,,,,,,,,,,,,,,,,,,
#,raw_min,,,,,,,,,,,,,,,,,,,,,,,,,,,,,,,,,,,,,,,,,,,,,,,,,,,,,,,,,,,,,,,,
5078,4773,4738,4721,4723,4737,4749,4768,4780,4782,4785,4792,4811,4815,4823,4838,4829,4827,4834,4841,4855,4869,4881,4927,4516,4707,4948,4978,5018,5110,5249,5542,6520,,,,,,,,,,,,,,,,,,,,,,,,,,,,,,,,,
4960,4745,4727,4715,4715,4725,4740,4748,4760,4754,4757,4757,4773,4773,4780,4793,4781,4778,4783,4789,4802,4813,4821,4860,4408,4866,4859,4878,4904,4951,5022,5152,5609,,,,,,,,,,,,,,,,,,,,,,,,,,,,,,,,,
4885,4721,4717,4712,4724,4729,4747,4756,4768,4763,4770,4766,4783,4789,4792,4803,4790,4789,4793,4799,4811,4822,4828,4844,4845,4849,4859,4871,4887,4921,4961,5035,5318,,,,,,,,,,,,,,,,,,,,,,,,,,,,,,,,,
4871,4726,4729,4728,4740,4750,4771,4780,4793,4788,4795,4791,4808,4810,4817,4830,4816,4814,4819,4824,4838,4847,4852,4869,4866,4866,4876,4884,4894,4920,4944,4990,5200,,,,,,,,,,,,,,,,,,,,,,,,,,,,,,,,,
4699,4561,4567,4568,4585,4596,4616,4626,4640,4635,4642,4640,4654,4665,4666,4677,4664,4663,4668,4673,4686,4695,4699,4715,4710,4708,4716,4721,4729,4746,4760,4789,4958,,,,,,,,,,,,,,,,,,,,,,,,,,,,,,,,,
4840,4693,4699,4699,4710,4730,4745,4764,4770,4772,4771,4775,4785,4797,4805,4821,4799,4804,4808,4813,4827,4836,4840,4855,4849,4847,4853,4857,4859,4873,4884,4903,5055,,,,,,,,,,,,,,,,,,,,,,,,,,,,,,,,,
4837,4684,4690,4690,4701,4721,4736,4754,4762,4766,4766,4770,4780,4791,4799,4806,4787,4801,4802,4808,4822,4831,4834,4848,4842,4837,4843,4845,4847,4857,4863,4876,5017,,,,,,,,,,,,,,,,,,,,,,,,,,,,,,,,,
4831,4680,4687,4687,4698,4717,4731,4752,4758,4761,4761,4766,4776,4788,4796,4799,4785,4790,4801,4808,4824,4829,4832,4845,4839,4834,4837,4838,4838,4846,4849,4858,4990,,,,,,,,,,,,,,,,,,,,,,,,,,,,,,,,,
4824,4673,4682,4683,4692,4711,4725,4746,4754,4757,4759,4764,4779,4785,4792,4806,4796,4792,4799,4804,4816,4825,4828,4841,4832,4827,4831,4830,4829,4836,4838,4843,4971,,,,,,,,,,,,,,,,,,,,,,,,,,,,,,,,,
4822,4668,4677,4679,4689,4707,4725,4743,4759,4755,4757,4762,4780,4785,4792,4804,4792,4792,4797,4802,4815,4822,4825,4838,4827,4822,4826,4824,4821,4827,4827,4832,4957,,,,,,,,,,,,,,,,,,,,,,,,,,,,,,,,,
4759,4602,4610,4612,4623,4641,4654,4675,4684,4689,4689,4696,4706,4717,4717,4727,4714,4715,4726,4725,4737,4744,4747,4760,4764,4754,4757,4754,4751,4756,4754,4754,4879,,,,,,,,,,,,,,,,,,,,,,,,,,,,,,,,,
4671,4517,4526,4526,4537,4556,4570,4590,4600,4605,4606,4612,4622,4633,4641,4642,4630,4630,4643,4652,4654,4666,4668,4680,4671,4666,4668,4666,4662,4666,4664,4665,4786,,,,,,,,,,,,,,,,,,,,,,,,,,,,,,,,,
4773,4614,4623,4625,4635,4655,4670,4690,4700,4705,4706,4714,4724,4735,4734,4743,4730,4730,4745,4739,4750,4757,4763,4785,4771,4765,4768,4765,4761,4765,4761,4762,4885,,,,,,,,,,,,,,,,,,,,,,,,,,,,,,,,,
4630,4475,4484,4487,4498,4516,4530,4551,4561,4565,4568,4575,4585,4596,4595,4604,4591,4590,4607,4598,4609,4615,4616,4633,4629,4622,4624,4621,4618,4621,4617,4617,4736,,,,,,,,,,,,,,,,,,,,,,,,,,,,,,,,,
4749,4586,4598,4603,4612,4630,4645,4666,4676,4680,4682,4691,4701,4712,4720,4720,4706,4706,4719,4718,4724,4744,4740,4752,4742,4736,4739,4736,4732,4735,4731,4731,4853,,,,,,,,,,,,,,,,,,,,,,,,,,,,,,,,,
4726,4564,4577,4584,4593,4609,4624,4644,4654,4659,4661,4669,4680,4691,4704,4699,4684,4685,4697,4691,4702,4713,4717,4729,4719,4712,4717,4712,4708,4711,4707,4705,4827,,,,,,,,,,,,,,,,,,,,,,,,,,,,,,,,,
4677,4519,4533,4539,4547,4564,4577,4597,4607,4612,4614,4621,4631,4642,4642,4652,4637,4637,4640,4642,4654,4659,4659,4671,4667,4669,4669,4665,4661,4663,4659,4656,4776,,,,,,,,,,,,,,,,,,,,,,,,,,,,,,,,,
4689,4531,4544,4551,4560,4578,4590,4610,4620,4625,4627,4635,4645,4656,4660,4663,4650,4649,4661,4656,4667,4672,4684,4693,4683,4677,4680,4675,4673,4675,4670,4668,4788,,,,,,,,,,,,,,,,,,,,,,,,,,,,,,,,,
4577,4418,4432,4439,4448,4463,4476,4495,4505,4510,4513,4520,4529,4540,4540,4548,4535,4534,4538,4540,4551,4556,4556,4568,4560,4558,4569,4561,4557,4559,4554,4552,4670,,,,,,,,,,,,,,,,,,,,,,,,,,,,,,,,,
4507,4352,4367,4374,4383,4394,4399,4416,4425,4429,4433,4441,4449,4458,4460,4470,4457,4456,4460,4461,4471,4477,4476,4489,4487,4486,4494,4498,4490,4492,4486,4486,4605,,,,,,,,,,,,,,,,,,,,,,,,,,,,,,,,,
4602,4450,4464,4472,4480,4493,4498,4515,4524,4528,4531,4540,4547,4556,4558,4568,4554,4554,4557,4558,4568,4573,4572,4586,4584,4584,4587,4584,4584,4594,4576,4585,4706,,,,,,,,,,,,,,,,,,,,,,,,,,,,,,,,,
4607,4453,4468,4477,4484,4495,4502,4519,4528,4530,4535,4542,4551,4559,4561,4570,4557,4556,4559,4561,4571,4575,4575,4589,4587,4586,4591,4586,4582,4590,4579,4589,4714,,,,,,,,,,,,,,,,,,,,,,,,,,,,,,,,,
4660,4505,4519,4526,4533,4547,4552,4569,4578,4581,4584,4593,4601,4610,4612,4621,4606,4605,4608,4610,4619,4624,4624,4638,4636,4636,4641,4636,4632,4635,4631,4631,4754,,,,,,,,,,,,,,,,,,,,,,,,,,,,,,,,,
4509,4360,4371,4375,4383,4397,4404,4421,4428,4432,4435,4443,4451,4459,4462,4470,4456,4456,4458,4459,4468,4472,4472,4486,4485,4485,4489,4489,4490,4492,4493,4488,4609,,,,,,,,,,,,,,,,,,,,,,,,,,,,,,,,,
4530,4381,4391,4393,4402,4418,4425,4442,4451,4454,4458,4465,4472,4481,4482,4491,4478,4476,4479,4479,4488,4493,4493,4507,4506,4506,4510,4507,4504,4507,4504,4509,4627,,,,,,,,,,,,,,,,,,,,,,,,,,,,,,,,,
4670,4518,4527,4528,4538,4554,4561,4579,4588,4592,4596,4602,4610,4618,4619,4628,4614,4612,4614,4614,4624,4629,4631,4645,4643,4644,4649,4645,4656,4656,4648,4654,4780,,,,,,,,,,,,,,,,,,,,,,,,,,,,,,,,,
4704,4551,4561,4562,4571,4586,4594,4611,4620,4624,4628,4635,4642,4650,4651,4661,4646,4644,4645,4647,4655,4661,4662,4675,4675,4675,4680,4678,4677,4682,4679,4683,4810,,,,,,,,,,,,,,,,,,,,,,,,,,,,,,,,,
4687,4535,4544,4545,4554,4569,4576,4593,4601,4605,4609,4616,4623,4631,4631,4641,4626,4624,4626,4626,4636,4641,4642,4656,4656,4656,4662,4661,4659,4666,4664,4682,4800,,,,,,,,,,,,,,,,,,,,,,,,,,,,,,,,,
4544,4400,4409,4410,4419,4432,4441,4457,4464,4468,4471,4477,4484,4492,4492,4501,4487,4485,4486,4487,4498,4501,4503,4516,4516,4517,4523,4523,4522,4529,4530,4535,4660,,,,,,,,,,,,,,,,,,,,,,,,,,,,,,,,,
4647,4503,4511,4512,4521,4535,4542,4558,4565,4569,4572,4579,4584,4592,4593,4602,4586,4584,4586,4587,4597,4603,4605,4618,4619,4621,4628,4628,4628,4635,4640,4647,4778,,,,,,,,,,,,,,,,,,,,,,,,,,,,,,,,,
4657,4513,4521,4522,4530,4544,4551,4567,4575,4578,4581,4587,4593,4601,4600,4610,4594,4592,4593,4595,4605,4610,4611,4626,4627,4631,4636,4638,4640,4650,4655,4666,4802,,,,,,,,,,,,,,,,,,,,,,,,,,,,,,,,,
4660,4516,4524,4524,4535,4546,4554,4570,4576,4579,4582,4587,4593,4600,4600,4608,4593,4590,4593,4594,4603,4608,4611,4626,4628,4633,4640,4642,4645,4657,4664,4679,4824,,,,,,,,,,,,,,,,,,,,,,,,,,,,,,,,,
4660,4523,4529,4530,4537,4551,4557,4575,4581,4582,4585,4590,4596,4603,4603,4613,4597,4594,4595,4597,4607,4612,4616,4631,4634,4638,4647,4651,4656,4670,4681,4703,4859,,,,,,,,,,,,,,,,,,,,,,,,,,,,,,,,,
4553,4419,4425,4423,4430,4443,4448,4464,4470,4472,4474,4479,4486,4493,4492,4502,4487,4484,4485,4487,4497,4502,4505,4521,4524,4530,4540,4546,4554,4571,4588,4617,4787,,,,,,,,,,,,,,,,,,,,,,,,,,,,,,,,,
4711,4569,4570,4565,4570,4581,4585,4601,4606,4609,4610,4614,4621,4628,4628,4637,4621,4618,4619,4621,4632,4637,4640,4657,4661,4668,4680,4689,4701,4724,4750,4794,5005,,,,,,,,,,,,,,,,,,,,,,,,,,,,,,,,,
4729,4570,4563,4556,4558,4567,4569,4584,4589,4590,4591,4594,4601,4607,4607,4616,4601,4598,4599,4601,4611,4617,4622,4640,4646,4654,4668,4680,4697,4729,4771,4842,5121,,,,,,,,,,,,,,,,,,,,,,,,,,,,,,,,,
4783,4577,4561,4547,4545,4552,4552,4565,4570,4571,4571,4574,4580,4586,4586,4595,4579,4576,4578,4580,4590,4598,4604,4621,4629,4640,4657,4675,4701,4748,4817,4943,5387,,,,,,,,,,,,,,,,,,,,,,,,,,,,,,,,,
4974,4616,4571,4551,4549,4556,4559,4576,4582,4586,4588,4593,4603,4612,4614,4624,4612,4610,4614,4621,4632,4643,4652,4672,4687,4704,4730,4763,4806,4895,5034,5323,6315,,,,,,,,,,,,,,,,,,,,,,,,,,,,,,,,,
#,raw_row_delta_max,,,,,,,,,,,,,,,,,,,,,,,,,,,,,,,,,,,,,,,,,,,,,,,,,,,,,,,,,,,,,,,,
1000,1000,1000,1000,1000,1000,1000,1000,1000,1000,1000,1000,1000,1000,1000,1000,1000,1000,1000,1000,1000,1000,1000,1000,1000,1000,1000,1000,1000,1000,2000,2000,3500,,,,,,,,,,,,,,,,,,,,,,,,,,,,,,,,,
800,800,800,800,800,800,800,800,800,800,800,800,800,800,800,800,800,800,800,800,800,800,800,800,2000,800,800,800,800,800,800,800,1500,,,,,,,,,,,,,,,,,,,,,,,,,,,,,,,,,
800,800,800,800,800,800,800,800,800,800,800,800,800,800,800,800,800,800,800,800,800,800,800,800,800,800,800,800,800,800,800,800,800,,,,,,,,,,,,,,,,,,,,,,,,,,,,,,,,,
1000,1000,1000,1000,1000,1000,1000,1000,1000,1000,1000,1000,1000,1000,1000,1000,1000,1000,1000,1000,1000,1000,1000,1000,1000,1000,1000,1000,1000,1000,1000,1000,1000,,,,,,,,,,,,,,,,,,,,,,,,,,,,,,,,,
1000,1000,1000,1000,1000,1000,1000,1000,1000,1000,1000,1000,1000,1000,1000,1000,1000,1000,1000,1000,1000,1000,1000,1000,1000,1000,1000,1000,1000,1000,1000,1000,1000,,,,,,,,,,,,,,,,,,,,,,,,,,,,,,,,,
800,800,800,800,800,800,800,800,800,800,800,800,800,800,800,800,800,800,800,800,800,800,800,800,800,800,800,800,800,800,800,800,800,,,,,,,,,,,,,,,,,,,,,,,,,,,,,,,,,
800,800,800,800,800,800,800,800,800,800,800,800,800,800,800,800,800,800,800,800,800,800,800,800,800,800,800,800,800,800,800,800,800,,,,,,,,,,,,,,,,,,,,,,,,,,,,,,,,,
800,800,800,800,800,800,800,800,800,800,800,800,800,800,800,800,800,800,800,800,800,800,800,800,800,800,800,800,800,800,800,800,800,,,,,,,,,,,,,,,,,,,,,,,,,,,,,,,,,
800,800,800,800,800,800,800,800,800,800,800,800,800,800,800,800,800,800,800,800,800,800,800,800,800,800,800,800,800,800,800,800,800,,,,,,,,,,,,,,,,,,,,,,,,,,,,,,,,,
1000,1000,1000,1000,1000,1000,1000,1000,1000,1000,1000,1000,1000,1000,1000,1000,1000,1000,1000,1000,1000,1000,1000,1000,1000,1000,1000,1000,1000,1000,1000,1000,1000,,,,,,,,,,,,,,,,,,,,,,,,,,,,,,,,,
800,800,800,800,800,800,800,800,800,800,800,800,800,800,800,800,800,800,800,800,800,800,800,800,800,800,800,800,800,800,800,800,800,,,,,,,,,,,,,,,,,,,,,,,,,,,,,,,,,
800,800,800,800,800,800,800,800,800,800,800,800,800,800,800,800,800,800,800,800,800,800,800,800,800,800,800,800,800,800,800,800,800,,,,,,,,,,,,,,,,,,,,,,,,,,,,,,,,,
1000,1000,1000,1000,1000,1000,1000,1000,1000,1000,1000,1000,1000,1000,1000,1000,1000,1000,1000,1000,1000,1000,1000,1000,1000,1000,1000,1000,1000,1000,1000,1000,1000,,,,,,,,,,,,,,,,,,,,,,,,,,,,,,,,,
800,800,800,800,800,800,800,800,800,800,800,800,800,800,800,800,800,800,800,800,800,800,800,800,800,800,800,800,800,800,800,800,800,,,,,,,,,,,,,,,,,,,,,,,,,,,,,,,,,
800,800,800,800,800,800,800,800,800,800,800,800,800,800,800,800,800,800,800,800,800,800,800,800,800,800,800,800,800,800,800,800,800,,,,,,,,,,,,,,,,,,,,,,,,,,,,,,,,,
800,800,800,800,800,800,800,800,800,800,800,800,800,800,800,800,800,800,800,800,800,800,800,800,800,800,800,800,800,800,800,800,800,,,,,,,,,,,,,,,,,,,,,,,,,,,,,,,,,
800,800,800,800,800,800,800,800,800,800,800,800,800,800,800,800,800,800,800,800,800,800,800,800,800,800,800,800,800,800,800,800,800,,,,,,,,,,,,,,,,,,,,,,,,,,,,,,,,,
1000,1000,1000,1000,1000,1000,1000,1000,1000,1000,1000,1000,1000,1000,1000,1000,1000,1000,1000,1000,1000,1000,1000,1000,1000,1000,1000,1000,1000,1000,1000,1000,1000,,,,,,,,,,,,,,,,,,,,,,,,,,,,,,,,,
800,800,800,800,800,800,800,800,800,800,800,800,800,800,800,800,800,800,800,800,800,800,800,800,800,800,800,800,800,800,800,800,800,,,,,,,,,,,,,,,,,,,,,,,,,,,,,,,,,
800,800,800,800,800,800,800,800,800,800,800,800,800,800,800,800,800,800,800,800,800,800,800,800,800,800,800,800,800,800,800,800,800,,,,,,,,,,,,,,,,,,,,,,,,,,,,,,,,,
800,800,800,800,800,800,800,800,800,800,800,800,800,800,800,800,800,800,800,800,800,800,800,800,800,800,800,800,800,800,800,800,800,,,,,,,,,,,,,,,,,,,,,,,,,,,,,,,,,
800,800,800,800,800,800,800,800,800,800,800,800,800,800,800,800,800,800,800,800,800,800,800,800,800,800,800,800,800,800,800,800,800,,,,,,,,,,,,,,,,,,,,,,,,,,,,,,,,,
1000,1000,1000,1000,1000,1000,1000,1000,1000,1000,1000,1000,1000,1000,1000,1000,1000,1000,1000,1000,1000,1000,1000,1000,1000,1000,1000,1000,1000,1000,1000,1000,1000,,,,,,,,,,,,,,,,,,,,,,,,,,,,,,,,,
800,800,800,800,800,800,800,800,800,800,800,800,800,800,800,800,800,800,800,800,800,800,800,800,800,800,800,800,800,800,800,800,800,,,,,,,,,,,,,,,,,,,,,,,,,,,,,,,,,
1000,1000,1000,1000,1000,1000,1000,1000,1000,1000,1000,1000,1000,1000,1000,1000,1000,1000,1000,1000,1000,1000,1000,1000,1000,1000,1000,1000,1000,1000,1000,1000,1000,,,,,,,,,,,,,,,,,,,,,,,,,,,,,,,,,
800,800,800,800,800,800,800,800,800,800,800,800,800,800,800,800,800,800,800,800,800,800,800,800,800,800,800,800,800,800,800,800,800,,,,,,,,,,,,,,,,,,,,,,,,,,,,,,,,,
800,800,800,800,800,800,800,800,800,800,800,800,800,800,800,800,800,800,800,800,800,800,800,800,800,800,800,800,800,800,800,800,800,,,,,,,,,,,,,,,,,,,,,,,,,,,,,,,,,
1000,1000,1000,1000,1000,1000,1000,1000,1000,1000,1000,1000,1000,1000,1000,1000,1000,1000,1000,1000,1000,1000,1000,1000,1000,1000,1000,1000,1000,1000,1000,1000,1000,,,,,,,,,,,,,,,,,,,,,,,,,,,,,,,,,
1000,1000,1000,1000,1000,1000,1000,1000,1000,1000,1000,1000,1000,1000,1000,1000,1000,1000,1000,1000,1000,1000,1000,1000,1000,1000,1000,1000,1000,1000,1000,1000,1000,,,,,,,,,,,,,,,,,,,,,,,,,,,,,,,,,
800,800,800,800,800,800,800,800,800,800,800,800,800,800,800,800,800,800,800,800,800,800,800,800,800,800,800,800,800,800,800,800,800,,,,,,,,,,,,,,,,,,,,,,,,,,,,,,,,,
800,800,800,800,800,800,800,800,800,800,800,800,800,800,800,800,800,800,800,800,800,800,800,800,800,800,800,800,800,800,800,800,800,,,,,,,,,,,,,,,,,,,,,,,,,,,,,,,,,
800,800,800,800,800,800,800,800,800,800,800,800,800,800,800,800,800,800,800,800,800,800,800,800,800,800,800,800,800,800,800,800,800,,,,,,,,,,,,,,,,,,,,,,,,,,,,,,,,,
1000,1000,1000,1000,1000,1000,1000,1000,1000,1000,1000,1000,1000,1000,1000,1000,1000,1000,1000,1000,1000,1000,1000,1000,1000,1000,1000,1000,1000,1000,1000,1000,1000,,,,,,,,,,,,,,,,,,,,,,,,,,,,,,,,,
1000,1000,1000,1000,1000,1000,1000,1000,1000,1000,1000,1000,1000,1000,1000,1000,1000,1000,1000,1000,1000,1000,1000,1000,1000,1000,1000,1000,1000,1000,1000,1000,1200,,,,,,,,,,,,,,,,,,,,,,,,,,,,,,,,,
800,800,800,800,800,800,800,800,800,800,800,800,800,800,800,800,800,800,800,800,800,800,800,800,800,800,800,800,800,800,800,800,800,,,,,,,,,,,,,,,,,,,,,,,,,,,,,,,,,
800,800,800,800,800,800,800,800,800,800,800,800,800,800,800,800,800,800,800,800,800,800,800,800,800,800,800,800,800,800,800,800,1500,,,,,,,,,,,,,,,,,,,,,,,,,,,,,,,,,
1200,1000,1000,1000,1000,1000,1000,1000,1000,1000,1000,1000,1000,1000,1000,1000,1000,1000,1000,1000,1000,1000,1000,1000,1000,1000,1000,1000,1000,1200,1200,1500,3500,,,,,,,,,,,,,,,,,,,,,,,,,,,,,,,,,
#,raw_row_delta_min,,,,,,,,,,,,,,,,,,,,,,,,,,,,,,,,,,,,,,,,,,,,,,,,,,,,,,,,,,,,,,,,
-1000,-1000,-1000,-1000,-1000,-1000,-1000,-1000,-1000,-1000,-1000,-1000,-1000,-1000,-1000,-1000,-1000,-1000,-1000,-1000,-1000,-1000,-1000,-1000,-1000,-1000,-1000,-1000,-1000,-1000,-2000,-2000,-3500,,,,,,,,,,,,,,,,,,,,,,,,,,,,,,,,,
-800,-800,-800,-800,-800,-800,-800,-800,-800,-800,-800,-800,-800,-800,-800,-800,-800,-800,-800,-800,-800,-800,-800,-800,-2000,-800,-800,-800,-800,-800,-800,-800,-1500,,,,,,,,,,,,,,,,,,,,,,,,,,,,,,,,,
-800,-800,-800,-800,-800,-800,-800,-800,-800,-800,-800,-800,-800,-800,-800,-800,-800,-800,-800,-800,-800,-800,-800,-800,-800,-800,-800,-800,-800,-800,-800,-800,-800,,,,,,,,,,,,,,,,,,,,,,,,,,,,,,,,,
-1000,-1000,-1000,-1000,-1000,-1000,-1000,-1000,-1000,-1000,-1000,-1000,-1000,-1000,-1000,-1000,-1000,-1000,-1000,-1000,-1000,-1000,-1000,-1000,-1000,-1000,-1000,-1000,-1000,-1000,-1000,-1000,-1000,,,,,,,,,,,,,,,,,,,,,,,,,,,,,,,,,
-1000,-1000,-1000,-1000,-1000,-1000,-1000,-1000,-1000,-1000,-1000,-1000,-1000,-1000,-1000,-1000,-1000,-1000,-1000,-1000,-1000,-1000,-1000,-1000,-1000,-1000,-1000,-1000,-1000,-1000,-1000,-1000,-1000,,,,,,,,,,,,,,,,,,,,,,,,,,,,,,,,,
-800,-800,-800,-800,-800,-800,-800,-800,-800,-800,-800,-800,-800,-800,-800,-800,-800,-800,-800,-800,-800,-800,-800,-800,-800,-800,-800,-800,-800,-800,-800,-800,-800,,,,,,,,,,,,,,,,,,,,,,,,,,,,,,,,,
-800,-800,-800,-800,-800,-800,-800,-800,-800,-800,-800,-800,-800,-800,-800,-800,-800,-800,-800,-800,-800,-800,-800,-800,-800,-800,-800,-800,-800,-800,-800,-800,-800,,,,,,,,,,,,,,,,,,,,,,,,,,,,,,,,,
-800,-800,-800,-800,-800,-800,-800,-800,-800,-800,-800,-800,-800,-800,-800,-800,-800,-800,-800,-800,-800,-800,-800,-800,-800,-800,-800,-800,-800,-800,-800,-800,-800,,,,,,,,,,,,,,,,,,,,,,,,,,,,,,,,,
-800,-800,-800,-800,-800,-800,-800,-800,-800,-800,-800,-800,-800,-800,-800,-800,-800,-800,-800,-800,-800,-800,-800,-800,-800,-800,-800,-800,-800,-800,-800,-800,-800,,,,,,,,,,,,,,,,,,,,,,,,,,,,,,,,,
-1000,-1000,-1000,-1000,-1000,-1000,-1000,-1000,-1000,-1000,-1000,-1000,-1000,-1000,-1000,-1000,-1000,-1000,-1000,-1000,-1000,-1000,-1000,-1000,-1000,-1000,-1000,-1000,-1000,-1000,-1000,-1000,-1000,,,,,,,,,,,,,,,,,,,,,,,,,,,,,,,,,
-800,-800,-800,-800,-800,-800,-800,-800,-800,-800,-800,-800,-800,-800,-800,-800,-800,-800,-800,-800,-800,-800,-800,-800,-800,-800,-800,-800,-800,-800,-800,-800,-800,,,,,,,,,,,,,,,,,,,,,,,,,,,,,,,,,
-800,-800,-800,-800,-800,-800,-800,-800,-800,-800,-800,-800,-800,-800,-800,-800,-800,-800,-800,-800,-800,-800,-800,-800,-800,-800,-800,-800,-800,-800,-800,-800,-800,,,,,,,,,,,,,,,,,,,,,,,,,,,,,,,,,
-1000,-1000,-1000,-1000,-1000,-1000,-1000,-1000,-1000,-1000,-1000,-1000,-1000,-1000,-1000,-1000,-1000,-1000,-1000,-1000,-1000,-1000,-1000,-1000,-1000,-1000,-1000,-1000,-1000,-1000,-1000,-1000,-1000,,,,,,,,,,,,,,,,,,,,,,,,,,,,,,,,,
-800,-800,-800,-800,-800,-800,-800,-800,-800,-800,-800,-800,-800,-800,-800,-800,-800,-800,-800,-800,-800,-800,-800,-800,-800,-800,-800,-800,-800,-800,-800,-800,-800,,,,,,,,,,,,,,,,,,,,,,,,,,,,,,,,,
-800,-800,-800,-800,-800,-800,-800,-800,-800,-800,-800,-800,-800,-800,-800,-800,-800,-800,-800,-800,-800,-800,-800,-800,-800,-800,-800,-800,-800,-800,-800,-800,-800,,,,,,,,,,,,,,,,,,,,,,,,,,,,,,,,,
-800,-800,-800,-800,-800,-800,-800,-800,-800,-800,-800,-800,-800,-800,-800,-800,-800,-800,-800,-800,-800,-800,-800,-800,-800,-800,-800,-800,-800,-800,-800,-800,-800,,,,,,,,,,,,,,,,,,,,,,,,,,,,,,,,,
-800,-800,-800,-800,-800,-800,-800,-800,-800,-800,-800,-800,-800,-800,-800,-800,-800,-800,-800,-800,-800,-800,-800,-800,-800,-800,-800,-800,-800,-800,-800,-800,-800,,,,,,,,,,,,,,,,,,,,,,,,,,,,,,,,,
-1000,-1000,-1000,-1000,-1000,-1000,-1000,-1000,-1000,-1000,-1000,-1000,-1000,-1000,-1000,-1000,-1000,-1000,-1000,-1000,-1000,-1000,-1000,-1000,-1000,-1000,-1000,-1000,-1000,-1000,-1000,-1000,-1000,,,,,,,,,,,,,,,,,,,,,,,,,,,,,,,,,
-800,-800,-800,-800,-800,-800,-800,-800,-800,-800,-800,-800,-800,-800,-800,-800,-800,-800,-800,-800,-800,-800,-800,-800,-800,-800,-800,-800,-800,-800,-800,-800,-800,,,,,,,,,,,,,,,,,,,,,,,,,,,,,,,,,
-800,-800,-800,-800,-800,-800,-800,-800,-800,-800,-800,-800,-800,-800,-800,-800,-800,-800,-800,-800,-800,-800,-800,-800,-800,-800,-800,-800,-800,-800,-800,-800,-800,,,,,,,,,,,,,,,,,,,,,,,,,,,,,,,,,
-800,-800,-800,-800,-800,-800,-800,-800,-800,-800,-800,-800,-800,-800,-800,-800,-800,-800,-800,-800,-800,-800,-800,-800,-800,-800,-800,-800,-800,-800,-800,-800,-800,,,,,,,,,,,,,,,,,,,,,,,,,,,,,,,,,
-800,-800,-800,-800,-800,-800,-800,-800,-800,-800,-800,-800,-800,-800,-800,-800,-800,-800,-800,-800,-800,-800,-800,-800,-800,-800,-800,-800,-800,-800,-800,-800,-800,,,,,,,,,,,,,,,,,,,,,,,,,,,,,,,,,
-1000,-1000,-1000,-1000,-1000,-1000,-1000,-1000,-1000,-1000,-1000,-1000,-1000,-1000,-1000,-1000,-1000,-1000,-1000,-1000,-1000,-1000,-1000,-1000,-1000,-1000,-1000,-1000,-1000,-1000,-1000,-1000,-1000,,,,,,,,,,,,,,,,,,,,,,,,,,,,,,,,,
-800,-800,-800,-800,-800,-800,-800,-800,-800,-800,-800,-800,-800,-800,-800,-800,-800,-800,-800,-800,-800,-800,-800,-800,-800,-800,-800,-800,-800,-800,-800,-800,-800,,,,,,,,,,,,,,,,,,,,,,,,,,,,,,,,,
-1000,-1000,-1000,-1000,-1000,-1000,-1000,-1000,-1000,-1000,-1000,-1000,-1000,-1000,-1000,-1000,-1000,-1000,-1000,-1000,-1000,-1000,-1000,-1000,-1000,-1000,-1000,-1000,-1000,-1000,-1000,-1000,-1000,,,,,,,,,,,,,,,,,,,,,,,,,,,,,,,,,
-800,-800,-800,-800,-800,-800,-800,-800,-800,-800,-800,-800,-800,-800,-800,-800,-800,-800,-800,-800,-800,-800,-800,-800,-800,-800,-800,-800,-800,-800,-800,-800,-800,,,,,,,,,,,,,,,,,,,,,,,,,,,,,,,,,
-800,-800,-800,-800,-800,-800,-800,-800,-800,-800,-800,-800,-800,-800,-800,-800,-800,-800,-800,-800,-800,-800,-800,-800,-800,-800,-800,-800,-800,-800,-800,-800,-800,,,,,,,,,,,,,,,,,,,,,,,,,,,,,,,,,
-1000,-1000,-1000,-1000,-1000,-1000,-1000,-1000,-1000,-1000,-1000,-1000,-1000,-1000,-1000,-1000,-1000,-1000,-1000,-1000,-1000,-1000,-1000,-1000,-1000,-1000,-1000,-1000,-1000,-1000,-1000,-1000,-1000,,,,,,,,,,,,,,,,,,,,,,,,,,,,,,,,,
-1000,-1000,-1000,-1000,-1000,-1000,-1000,-1000,-1000,-1000,-1000,-1000,-1000,-1000,-1000,-1000,-1000,-1000,-1000,-1000,-1000,-1000,-1000,-1000,-1000,-1000,-1000,-1000,-1000,-1000,-1000,-1000,-1000,,,,,,,,,,,,,,,,,,,,,,,,,,,,,,,,,
-800,-800,-800,-800,-800,-800,-800,-800,-800,-800,-800,-800,-800,-800,-800,-800,-800,-800,-800,-800,-800,-800,-800,-800,-800,-800,-800,-800,-800,-800,-800,-800,-800,,,,,,,,,,,,,,,,,,,,,,,,,,,,,,,,,
-800,-800,-800,-800,-800,-800,-800,-800,-800,-800,-800,-800,-800,-800,-800,-800,-800,-800,-800,-800,-800,-800,-800,-800,-800,-800,-800,-800,-800,-800,-800,-800,-800,,,,,,,,,,,,,,,,,,,,,,,,,,,,,,,,,
-800,-800,-800,-800,-800,-800,-800,-800,-800,-800,-800,-800,-800,-800,-800,-800,-800,-800,-800,-800,-800,-800,-800,-800,-800,-800,-800,-800,-800,-800,-800,-800,-800,,,,,,,,,,,,,,,,,,,,,,,,,,,,,,,,,
-1000,-1000,-1000,-1000,-1000,-1000,-1000,-1000,-1000,-1000,-1000,-1000,-1000,-1000,-1000,-1000,-1000,-1000,-1000,-1000,-1000,-1000,-1000,-1000,-1000,-1000,-1000,-1000,-1000,-1000,-1000,-1000,-1000,,,,,,,,,,,,,,,,,,,,,,,,,,,,,,,,,
-1000,-1000,-1000,-1000,-1000,-1000,-1000,-1000,-1000,-1000,-1000,-1000,-1000,-1000,-1000,-1000,-1000,-1000,-1000,-1000,-1000,-1000,-1000,-1000,-1000,-1000,-1000,-1000,-1000,-1000,-1000,-1000,-1200,,,,,,,,,,,,,,,,,,,,,,,,,,,,,,,,,
-800,-800,-800,-800,-800,-800,-800,-800,-800,-800,-800,-800,-800,-800,-800,-800,-800,-800,-800,-800,-800,-800,-800,-800,-800,-800,-800,-800,-800,-800,-800,-800,-800,,,,,,,,,,,,,,,,,,,,,,,,,,,,,,,,,
-800,-800,-800,-800,-800,-800,-800,-800,-800,-800,-800,-800,-800,-800,-800,-800,-800,-800,-800,-800,-800,-800,-800,-800,-800,-800,-800,-800,-800,-800,-800,-800,-1500,,,,,,,,,,,,,,,,,,,,,,,,,,,,,,,,,
-1200,-1000,-1000,-1000,-1000,-1000,-1000,-1000,-1000,-1000,-1000,-1000,-1000,-1000,-1000,-1000,-1000,-1000,-1000,-1000,-1000,-1000,-1000,-1000,-1000,-1000,-1000,-1000,-1000,-1200,-1200,-1500,-3500,,,,,,,,,,,,,,,,,,,,,,,,,,,,,,,,,
#,raw_col_delta_max,,,,,,,,,,,,,,,,,,,,,,,,,,,,,,,,,,,,,,,,,,,,,,,,,,,,,,,,,,,,,,,,
1500,800,800,800,800,800,800,800,800,800,800,800,800,800,800,800,800,800,800,800,800,800,800,2000,1500,1500,800,800,800,1000,1500,3500,,,-1500,-800,-800,-800,-800,-800,-800,-800,-800,-800,-800,-800,-800,-800,-800,-800,-800,-800,-800,-800,-800,-800,-800,-2000,-1500,-1500,-800,-800,-800,-1000,-1500,-3500
1500,800,800,800,800,800,800,800,800,800,800,800,800,800,800,800,800,800,800,800,800,800,800,2000,2000,800,800,800,800,800,800,2000,,,-1500,-800,-800,-800,-800,-800,-800,-800,-800,-800,-800,-800,-800,-800,-800,-800,-800,-800,-800,-800,-800,-800,-800,-2000,-2000,-800,-800,-800,-800,-800,-800,-2000
1500,800,800,800,800,800,800,800,800,800,800,800,800,800,800,800,800,800,800,800,800,800,800,800,800,800,800,800,800,800,800,1500,,,-1500,-800,-800,-800,-800,-800,-800,-800,-800,-800,-800,-800,-800,-800,-800,-800,-800,-800,-800,-800,-800,-800,-800,-800,-800,-800,-800,-800,-800,-800,-800,-1500
1500,800,800,800,800,800,800,800,800,800,800,800,800,800,800,800,800,800,800,800,800,800,800,800,800,800,800,800,800,800,800,1000,,,-1500,-800,-800,-800,-800,-800,-800,-800,-800,-800,-800,-800,-800,-800,-800,-800,-800,-800,-800,-800,-800,-800,-800,-800,-800,-800,-800,-800,-800,-800,-800,-1000
1500,800,800,800,800,800,800,800,800,800,800,800,800,800,800,800,800,800,800,800,800,800,800,800,800,800,800,800,800,800,800,1000,,,-1500,-800,-800,-800,-800,-800,-800,-800,-800,-800,-800,-800,-800,-800,-800,-800,-800,-800,-800,-800,-800,-800,-800,-800,-800,-800,-800,-800,-800,-800,-800,-1000
1500,800,800,800,800,800,800,800,800,800,800,800,800,800,800,800,800,800,800,800,800,800,800,800,800,800,800,800,800,800,800,1000,,,-1500,-800,-800,-800,-800,-800,-800,-800,-800,-800,-800,-800,-800,-800,-800,-800,-800,-800,-800,-800,-800,-800,-800,-800,-800,-800,-800,-800,-800,-800,-800,-1000
1500,800,800,800,800,800,800,800,800,800,800,800,800,800,800,800,800,800,800,800,800,800,800,800,800,800,800,800,800,800,800,1000,,,-1500,-800,-800,-800,-800,-800,-800,-800,-800,-800,-800,-800,-800,-800,-800,-800,-800,-800,-800,-800,-800,-800,-800,-800,-800,-800,-800,-800,-800,-800,-800,-1000
1500,800,800,800,800,800,800,800,800,800,800,800,800,800,800,800,800,800,800,800,800,800,800,800,800,800,800,800,800,800,800,1000,,,-1500,-800,-800,-800,-800,-800,-800,-800,-800,-800,-800,-800,-800,-800,-800,-800,-800,-800,-800,-800,-800,-800,-800,-800,-800,-800,-800,-800,-800,-800,-800,-1000
1500,800,800,800,800,800,800,800,800,800,800,800,800,800,800,800,800,800,800,800,800,800,800,800,800,800,800,800,800,800,800,1000,,,-1500,-800,-800,-800,-800,-800,-800,-800,-800,-800,-800,-800,-800,-800,-800,-800,-800,-800,-800,-800,-800,-800,-800,-800,-800,-800,-800,-800,-800,-800,-800,-1000
1500,800,800,800,800,800,800,800,800,800,800,800,800,800,800,800,800,800,800,800,800,800,800,800,800,800,800,800,800,800,800,1000,,,-1500,-800,-800,-800,-800,-800,-800,-800,-800,-800,-800,-800,-800,-800,-800,-800,-800,-800,-800,-800,-800,-800,-800,-800,-800,-800,-800,-800,-800,-800,-800,-1000
1500,800,800,800,800,800,800,800,800,800,800,800,800,800,800,800,800,800,800,800,800,800,800,800,800,800,800,800,800,800,800,1000,,,-1500,-800,-800,-800,-800,-800,-800,-800,-800,-800,-800,-800,-800,-800,-800,-800,-800,-800,-800,-800,-800,-800,-800,-800,-800,-800,-800,-800,-800,-800,-800,-1000
1500,800,800,800,800,800,800,800,800,800,800,800,800,800,800,800,800,800,800,800,800,800,800,800,800,800,800,800,800,800,800,1000,,,-1500,-800,-800,-800,-800,-800,-800,-800,-800,-800,-800,-800,-800,-800,-800,-800,-800,-800,-800,-800,-800,-800,-800,-800,-800,-800,-800,-800,-800,-800,-800,-1000
1500,800,800,800,800,800,800,800,800,800,800,800,800,800,800,800,800,800,800,800,800,800,800,800,800,800,800,800,800,800,800,1000,,,-1500,-800,-800,-800,-800,-800,-800,-800,-800,-800,-800,-800,-800,-800,-800,-800,-800,-800,-800,-800,-800,-800,-800,-800,-800,-800,-800,-800,-800,-800,-800,-1000
1500,800,800,800,800,800,800,800,800,800,800,800,800,800,800,800,800,800,800,800,800,800,800,800,800,800,800,800,800,800,800,1000,,,-1500,-800,-800,-800,-800,-800,-800,-800,-800,-800,-800,-800,-800,-800,-800,-800,-800,-800,-800,-800,-800,-800,-800,-800,-800,-800,-800,-800,-800,-800,-800,-1000
1500,800,800,800,800,800,800,800,800,800,800,800,800,800,800,800,800,800,800,800,800,800,800,800,800,800,800,800,800,800,800,1000,,,-1500,-800,-800,-800,-800,-800,-800,-800,-800,-800,-800,-800,-800,-800,-800,-800,-800,-800,-800,-800,-800,-800,-800,-800,-800,-800,-800,-800,-800,-800,-800,-1000
1500,800,800,800,800,800,800,800,800,800,800,800,800,800,800,800,800,800,800,800,800,800,800,800,800,800,800,800,800,800,800,1000,,,-1500,-800,-800,-800,-800,-800,-800,-800,-800,-800,-800,-800,-800,-800,-800,-800,-800,-800,-800,-800,-800,-800,-800,-800,-800,-800,-800,-800,-800,-800,-800,-1000
1500,800,800,800,800,800,800,800,800,800,800,800,800,800,800,800,800,800,800,800,800,800,800,800,800,800,800,800,800,800,800,1000,,,-1500,-800,-800,-800,-800,-800,-800,-800,-800,-800,-800,-800,-800,-800,-800,-800,-800,-800,-800,-800,-800,-800,-800,-800,-800,-800,-800,-800,-800,-800,-800,-1000
1500,800,800,800,800,800,800,800,800,800,800,800,800,800,800,800,800,800,800,800,800,800,800,800,800,800,800,800,800,800,800,1000,,,-1500,-800,-800,-800,-800,-800,-800,-800,-800,-800,-800,-800,-800,-800,-800,-800,-800,-800,-800,-800,-800,-800,-800,-800,-800,-800,-800,-800,-800,-800,-800,-1000
1500,800,800,800,800,800,800,800,800,800,800,800,800,800,800,800,800,800,800,800,800,800,800,800,800,800,800,800,800,800,800,1000,,,-1500,-800,-800,-800,-800,-800,-800,-800,-800,-800,-800,-800,-800,-800,-800,-800,-800,-800,-800,-800,-800,-800,-800,-800,-800,-800,-800,-800,-800,-800,-800,-1000
1500,800,800,800,800,800,800,800,800,800,800,800,800,800,800,800,800,800,800,800,800,800,800,800,800,800,800,800,800,800,800,1000,,,-1500,-800,-800,-800,-800,-800,-800,-800,-800,-800,-800,-800,-800,-800,-800,-800,-800,-800,-800,-800,-800,-800,-800,-800,-800,-800,-800,-800,-800,-800,-800,-1000
1500,800,800,800,800,800,800,800,800,800,800,800,800,800,800,800,800,800,800,800,800,800,800,800,800,800,800,800,800,800,800,1000,,,-1500,-800,-800,-800,-800,-800,-800,-800,-800,-800,-800,-800,-800,-800,-800,-800,-800,-800,-800,-800,-800,-800,-800,-800,-800,-800,-800,-800,-800,-800,-800,-1000
1500,800,800,800,800,800,800,800,800,800,800,800,800,800,800,800,800,800,800,800,800,800,800,800,800,800,800,800,800,800,800,1000,,,-1500,-800,-800,-800,-800,-800,-800,-800,-800,-800,-800,-800,-800,-800,-800,-800,-800,-800,-800,-800,-800,-800,-800,-800,-800,-800,-800,-800,-800,-800,-800,-1000
1500,800,800,800,800,800,800,800,800,800,800,800,800,800,800,800,800,800,800,800,800,800,800,800,800,800,800,800,800,800,800,1000,,,-1500,-800,-800,-800,-800,-800,-800,-800,-800,-800,-800,-800,-800,-800,-800,-800,-800,-800,-800,-800,-800,-800,-800,-800,-800,-800,-800,-800,-800,-800,-800,-1000
1500,800,800,800,800,800,800,800,800,800,800,800,800,800,800,800,800,800,800,800,800,800,800,800,800,800,800,800,800,800,800,1000,,,-1500,-800,-800,-800,-800,-800,-800,-800,-800,-800,-800,-800,-800,-800,-800,-800,-800,-800,-800,-800,-800,-800,-800,-800,-800,-800,-800,-800,-800,-800,-800,-1000
1500,800,800,800,800,800,800,800,800,800,800,800,800,800,800,800,800,800,800,800,800,800,800,800,800,800,800,800,800,800,800,1000,,,-1500,-800,-800,-800,-800,-800,-800,-800,-800,-800,-800,-800,-800,-800,-800,-800,-800,-800,-800,-800,-800,-800,-800,-800,-800,-800,-800,-800,-800,-800,-800,-1000
1500,800,800,800,800,800,800,800,800,800,800,800,800,800,800,800,800,800,800,800,800,800,800,800,800,800,800,800,800,800,800,1000,,,-1500,-800,-800,-800,-800,-800,-800,-800,-800,-800,-800,-800,-800,-800,-800,-800,-800,-800,-800,-800,-800,-800,-800,-800,-800,-800,-800,-800,-800,-800,-800,-1000
1500,800,800,800,800,800,800,800,800,800,800,800,800,800,800,800,800,800,800,800,800,800,800,800,800,800,800,800,800,800,800,1000,,,-1500,-800,-800,-800,-800,-800,-800,-800,-800,-800,-800,-800,-800,-800,-800,-800,-800,-800,-800,-800,-800,-800,-800,-800,-800,-800,-800,-800,-800,-800,-800,-1000
1500,800,800,800,800,800,800,800,800,800,800,800,800,800,800,800,800,800,800,800,800,800,800,800,800,800,800,800,800,800,800,1000,,,-1500,-800,-800,-800,-800,-800,-800,-800,-800,-800,-800,-800,-800,-800,-800,-800,-800,-800,-800,-800,-800,-800,-800,-800,-800,-800,-800,-800,-800,-800,-800,-1000
1500,800,800,800,800,800,800,800,800,800,800,800,800,800,800,800,800,800,800,800,800,800,800,800,800,800,800,800,800,800,800,1000,,,-1500,-800,-800,-800,-800,-800,-800,-800,-800,-800,-800,-800,-800,-800,-800,-800,-800,-800,-800,-800,-800,-800,-800,-800,-800,-800,-800,-800,-800,-800,-800,-1000
1500,800,800,800,800,800,800,800,800,800,800,800,800,800,800,800,800,800,800,800,800,800,800,800,800,800,800,800,800,800,800,1000,,,-1500,-800,-800,-800,-800,-800,-800,-800,-800,-800,-800,-800,-800,-800,-800,-800,-800,-800,-800,-800,-800,-800,-800,-800,-800,-800,-800,-800,-800,-800,-800,-1000
1500,800,800,800,800,800,800,800,800,800,800,800,800,800,800,800,800,800,800,800,800,800,800,800,800,800,800,800,800,800,800,1000,,,-1500,-800,-800,-800,-800,-800,-800,-800,-800,-800,-800,-800,-800,-800,-800,-800,-800,-800,-800,-800,-800,-800,-800,-800,-800,-800,-800,-800,-800,-800,-800,-1000
1500,800,800,800,800,800,800,800,800,800,800,800,800,800,800,800,800,800,800,800,800,800,800,800,800,800,800,800,800,800,800,1000,,,-1500,-800,-800,-800,-800,-800,-800,-800,-800,-800,-800,-800,-800,-800,-800,-800,-800,-800,-800,-800,-800,-800,-800,-800,-800,-800,-800,-800,-800,-800,-800,-1000
1500,800,800,800,800,800,800,800,800,800,800,800,800,800,800,800,800,800,800,800,800,800,800,800,800,800,800,800,800,800,800,1000,,,-1500,-800,-800,-800,-800,-800,-800,-800,-800,-800,-800,-800,-800,-800,-800,-800,-800,-800,-800,-800,-800,-800,-800,-800,-800,-800,-800,-800,-800,-800,-800,-1000
1500,800,800,800,800,800,800,800,800,800,800,800,800,800,800,800,800,800,800,800,800,800,800,800,800,800,800,800,800,800,800,1000,,,-1500,-800,-800,-800,-800,-800,-800,-800,-800,-800,-800,-800,-800,-800,-800,-800,-800,-800,-800,-800,-800,-800,-800,-800,-800,-800,-800,-800,-800,-800,-800,-1000
1500,800,800,800,800,800,800,800,800,800,800,800,800,800,800,800,800,800,800,800,800,800,800,800,800,800,800,800,800,800,800,1500,,,-1500,-800,-800,-800,-800,-800,-800,-800,-800,-800,-800,-800,-800,-800,-800,-800,-800,-800,-800,-800,-800,-800,-800,-800,-800,-800,-800,-800,-800,-800,-800,-1500
1500,800,800,800,800,800,800,800,800,800,800,800,800,800,800,800,800,800,800,800,800,800,800,800,800,800,800,800,800,800,800,2000,,,-1500,-800,-800,-800,-800,-800,-800,-800,-800,-800,-800,-800,-800,-800,-800,-800,-800,-800,-800,-800,-800,-800,-800,-800,-800,-800,-800,-800,-800,-800,-800,-2000
1500,800,800,800,800,800,800,800,800,800,800,800,800,800,800,800,800,800,800,800,800,800,800,800,800,800,800,800,800,800,800,2000,,,-1500,-800,-800,-800,-800,-800,-800,-800,-800,-800,-800,-800,-800,-800,-800,-800,-800,-800,-800,-800,-800,-800,-800,-800,-800,-800,-800,-800,-800,-800,-800,-2000
1500,800,800,800,800,800,800,800,800,800,800,800,800,800,800,800,800,800,800,800,800,800,800,800,800,800,800,800,800,1000,1500,3500,,,-1500,-800,-800,-800,-800,-800,-800,-800,-800,-800,-800,-800,-800,-800,-800,-800,-800,-800,-800,-800,-800,-800,-800,-800,-800,-800,-800,-800,-800,-1000,-1500,-3500
#,raw_col_delta_min,,,,,,,,,,,,,,,,,,,,,,,,,,,,,,,,,,,,,,,,,,,,,,,,,,,,,,,,,,,,,,,,
-1500,-800,-800,-800,-800,-800,-800,-800,-800,-800,-800,-800,-800,-800,-800,-800,-800,-800,-800,-800,-800,-800,-800,-2000,-1500,-1500,-800,-800,-800,-1000,-1500,-3500,,,,,,,,,,,,,,,,,,,,,,,,,,,,,,,,,,
-1500,-800,-800,-800,-800,-800,-800,-800,-800,-800,-800,-800,-800,-800,-800,-800,-800,-800,-800,-800,-800,-800,-800,-2000,-2000,-800,-800,-800,-800,-800,-800,-2000,,,,,,,,,,,,,,,,,,,,,,,,,,,,,,,,,,
-1500,-800,-800,-800,-800,-800,-800,-800,-800,-800,-800,-800,-800,-800,-800,-800,-800,-800,-800,-800,-800,-800,-800,-800,-800,-800,-800,-800,-800,-800,-800,-1500,,,,,,,,,,,,,,,,,,,,,,,,,,,,,,,,,,
-1500,-800,-800,-800,-800,-800,-800,-800,-800,-800,-800,-800,-800,-800,-800,-800,-800,-800,-800,-800,-800,-800,-800,-800,-800,-800,-800,-800,-800,-800,-800,-1000,,,,,,,,,,,,,,,,,,,,,,,,,,,,,,,,,,
-1500,-800,-800,-800,-800,-800,-800,-800,-800,-800,-800,-800,-800,-800,-800,-800,-800,-800,-800,-800,-800,-800,-800,-800,-800,-800,-800,-800,-800,-800,-800,-1000,,,,,,,,,,,,,,,,,,,,,,,,,,,,,,,,,,
-1500,-800,-800,-800,-800,-800,-800,-800,-800,-800,-800,-800,-800,-800,-800,-800,-800,-800,-800,-800,-800,-800,-800,-800,-800,-800,-800,-800,-800,-800,-800,-1000,,,,,,,,,,,,,,,,,,,,,,,,,,,,,,,,,,
-1500,-800,-800,-800,-800,-800,-800,-800,-800,-800,-800,-800,-800,-800,-800,-800,-800,-800,-800,-800,-800,-800,-800,-800,-800,-800,-800,-800,-800,-800,-800,-1000,,,,,,,,,,,,,,,,,,,,,,,,,,,,,,,,,,
-1500,-800,-800,-800,-800,-800,-800,-800,-800,-800,-800,-800,-800,-800,-800,-800,-800,-800,-800,-800,-800,-800,-800,-800,-800,-800,-800,-800,-800,-800,-800,-1000,,,,,,,,,,,,,,,,,,,,,,,,,,,,,,,,,,
-1500,-800,-800,-800,-800,-800,-800,-800,-800,-800,-800,-800,-800,-800,-800,-800,-800,-800,-800,-800,-800,-800,-800,-800,-800,-800,-800,-800,-800,-800,-800,-1000,,,,,,,,,,,,,,,,,,,,,,,,,,,,,,,,,,
-1500,-800,-800,-800,-800,-800,-800,-800,-800,-800,-800,-800,-800,-800,-800,-800,-800,-800,-800,-800,-800,-800,-800,-800,-800,-800,-800,-800,-800,-800,-800,-1000,,,,,,,,,,,,,,,,,,,,,,,,,,,,,,,,,,
-1500,-800,-800,-800,-800,-800,-800,-800,-800,-800,-800,-800,-800,-800,-800,-800,-800,-800,-800,-800,-800,-800,-800,-800,-800,-800,-800,-800,-800,-800,-800,-1000,,,,,,,,,,,,,,,,,,,,,,,,,,,,,,,,,,
-1500,-800,-800,-800,-800,-800,-800,-800,-800,-800,-800,-800,-800,-800,-800,-800,-800,-800,-800,-800,-800,-800,-800,-800,-800,-800,-800,-800,-800,-800,-800,-1000,,,,,,,,,,,,,,,,,,,,,,,,,,,,,,,,,,
-1500,-800,-800,-800,-800,-800,-800,-800,-800,-800,-800,-800,-800,-800,-800,-800,-800,-800,-800,-800,-800,-800,-800,-800,-800,-800,-800,-800,-800,-800,-800,-1000,,,,,,,,,,,,,,,,,,,,,,,,,,,,,,,,,,
-1500,-800,-800,-800,-800,-800,-800,-800,-800,-800,-800,-800,-800,-800,-800,-800,-800,-800,-800,-800,-800,-800,-800,-800,-800,-800,-800,-800,-800,-800,-800,-1000,,,,,,,,,,,,,,,,,,,,,,,,,,,,,,,,,,
-1500,-800,-800,-800,-800,-800,-800,-800,-800,-800,-800,-800,-800,-800,-800,-800,-800,-800,-800,-800,-800,-800,-800,-800,-800,-800,-800,-800,-800,-800,-800,-1000,,,,,,,,,,,,,,,,,,,,,,,,,,,,,,,,,,
-1500,-800,-800,-800,-800,-800,-800,-800,-800,-800,-800,-800,-800,-800,-800,-800,-800,-800,-800,-800,-800,-800,-800,-800,-800,-800,-800,-800,-800,-800,-800,-1000,,,,,,,,,,,,,,,,,,,,,,,,,,,,,,,,,,
-1500,-800,-800,-800,-800,-800,-800,-800,-800,-800,-800,-800,-800,-800,-800,-800,-800,-800,-800,-800,-800,-800,-800,-800,-800,-800,-800,-800,-800,-800,-800,-1000,,,,,,,,,,,,,,,,,,,,,,,,,,,,,,,,,,
-1500,-800,-800,-800,-800,-800,-800,-800,-800,-800,-800,-800,-800,-800,-800,-800,-800,-800,-800,-800,-800,-800,-800,-800,-800,-800,-800,-800,-800,-800,-800,-1000,,,,,,,,,,,,,,,,,,,,,,,,,,,,,,,,,,
-1500,-800,-800,-800,-800,-800,-800,-800,-800,-800,-800,-800,-800,-800,-800,-800,-800,-800,-800,-800,-800,-800,-800,-800,-800,-800,-800,-800,-800,-800,-800,-1000,,,,,,,,,,,,,,,,,,,,,,,,,,,,,,,,,,
-1500,-800,-800,-800,-800,-800,-800,-800,-800,-800,-800,-800,-800,-800,-800,-800,-800,-800,-800,-800,-800,-800,-800,-800,-800,-800,-800,-800,-800,-800,-800,-1000,,,,,,,,,,,,,,,,,,,,,,,,,,,,,,,,,,
-1500,-800,-800,-800,-800,-800,-800,-800,-800,-800,-800,-800,-800,-800,-800,-800,-800,-800,-800,-800,-800,-800,-800,-800,-800,-800,-800,-800,-800,-800,-800,-1000,,,,,,,,,,,,,,,,,,,,,,,,,,,,,,,,,,
-1500,-800,-800,-800,-800,-800,-800,-800,-800,-800,-800,-800,-800,-800,-800,-800,-800,-800,-800,-800,-800,-800,-800,-800,-800,-800,-800,-800,-800,-800,-800,-1000,,,,,,,,,,,,,,,,,,,,,,,,,,,,,,,,,,
-1500,-800,-800,-800,-800,-800,-800,-800,-800,-800,-800,-800,-800,-800,-800,-800,-800,-800,-800,-800,-800,-800,-800,-800,-800,-800,-800,-800,-800,-800,-800,-1000,,,,,,,,,,,,,,,,,,,,,,,,,,,,,,,,,,
-1500,-800,-800,-800,-800,-800,-800,-800,-800,-800,-800,-800,-800,-800,-800,-800,-800,-800,-800,-800,-800,-800,-800,-800,-800,-800,-800,-800,-800,-800,-800,-1000,,,,,,,,,,,,,,,,,,,,,,,,,,,,,,,,,,
-1500,-800,-800,-800,-800,-800,-800,-800,-800,-800,-800,-800,-800,-800,-800,-800,-800,-800,-800,-800,-800,-800,-800,-800,-800,-800,-800,-800,-800,-800,-800,-1000,,,,,,,,,,,,,,,,,,,,,,,,,,,,,,,,,,
-1500,-800,-800,-800,-800,-800,-800,-800,-800,-800,-800,-800,-800,-800,-800,-800,-800,-800,-800,-800,-800,-800,-800,-800,-800,-800,-800,-800,-800,-800,-800,-1000,,,,,,,,,,,,,,,,,,,,,,,,,,,,,,,,,,
-1500,-800,-800,-800,-800,-800,-800,-800,-800,-800,-800,-800,-800,-800,-800,-800,-800,-800,-800,-800,-800,-800,-800,-800,-800,-800,-800,-800,-800,-800,-800,-1000,,,,,,,,,,,,,,,,,,,,,,,,,,,,,,,,,,
-1500,-800,-800,-800,-800,-800,-800,-800,-800,-800,-800,-800,-800,-800,-800,-800,-800,-800,-800,-800,-800,-800,-800,-800,-800,-800,-800,-800,-800,-800,-800,-1000,,,,,,,,,,,,,,,,,,,,,,,,,,,,,,,,,,
-1500,-800,-800,-800,-800,-800,-800,-800,-800,-800,-800,-800,-800,-800,-800,-800,-800,-800,-800,-800,-800,-800,-800,-800,-800,-800,-800,-800,-800,-800,-800,-1000,,,,,,,,,,,,,,,,,,,,,,,,,,,,,,,,,,
-1500,-800,-800,-800,-800,-800,-800,-800,-800,-800,-800,-800,-800,-800,-800,-800,-800,-800,-800,-800,-800,-800,-800,-800,-800,-800,-800,-800,-800,-800,-800,-1000,,,,,,,,,,,,,,,,,,,,,,,,,,,,,,,,,,
-1500,-800,-800,-800,-800,-800,-800,-800,-800,-800,-800,-800,-800,-800,-800,-800,-800,-800,-800,-800,-800,-800,-800,-800,-800,-800,-800,-800,-800,-800,-800,-1000,,,,,,,,,,,,,,,,,,,,,,,,,,,,,,,,,,
-1500,-800,-800,-800,-800,-800,-800,-800,-800,-800,-800,-800,-800,-800,-800,-800,-800,-800,-800,-800,-800,-800,-800,-800,-800,-800,-800,-800,-800,-800,-800,-1000,,,,,,,,,,,,,,,,,,,,,,,,,,,,,,,,,,
-1500,-800,-800,-800,-800,-800,-800,-800,-800,-800,-800,-800,-800,-800,-800,-800,-800,-800,-800,-800,-800,-800,-800,-800,-800,-800,-800,-800,-800,-800,-800,-1000,,,,,,,,,,,,,,,,,,,,,,,,,,,,,,,,,,
-1500,-800,-800,-800,-800,-800,-800,-800,-800,-800,-800,-800,-800,-800,-800,-800,-800,-800,-800,-800,-800,-800,-800,-800,-800,-800,-800,-800,-800,-800,-800,-1000,,,,,,,,,,,,,,,,,,,,,,,,,,,,,,,,,,
-1500,-800,-800,-800,-800,-800,-800,-800,-800,-800,-800,-800,-800,-800,-800,-800,-800,-800,-800,-800,-800,-800,-800,-800,-800,-800,-800,-800,-800,-800,-800,-1500,,,,,,,,,,,,,,,,,,,,,,,,,,,,,,,,,,
-1500,-800,-800,-800,-800,-800,-800,-800,-800,-800,-800,-800,-800,-800,-800,-800,-800,-800,-800,-800,-800,-800,-800,-800,-800,-800,-800,-800,-800,-800,-800,-2000,,,,,,,,,,,,,,,,,,,,,,,,,,,,,,,,,,
-1500,-800,-800,-800,-800,-800,-800,-800,-800,-800,-800,-800,-800,-800,-800,-800,-800,-800,-800,-800,-800,-800,-800,-800,-800,-800,-800,-800,-800,-800,-800,-2000,,,,,,,,,,,,,,,,,,,,,,,,,,,,,,,,,,
-1500,-800,-800,-800,-800,-800,-800,-800,-800,-800,-800,-800,-800,-800,-800,-800,-800,-800,-800,-800,-800,-800,-800,-800,-800,-800,-800,-800,-800,-1000,-1500,-3500,,,,,,,,,,,,,,,,,,,,,,,,,,,,,,,,,,
#,line_max,,,,,,,,,,,,,,,,,,,,,,,,,,,,,,,,,,,,,,,,,,,,,,,,,,,,,,,,,,,,,,,,
8000,8000,8000,8000,8000,8000,8000,8000,8000,8000,8000,8000,8000,8000,8000,8000,8000,8000,8000,8000,8000,8000,8000,8000,8000,8000,8000,8000,8000,8000,8000,8000,8000,,,,,,,,,,,,,,,,,,,,,,,,,,,,,,,,,
8000,8000,8000,8000,8000,8000,8000,8000,8000,8000,8000,8000,8000,8000,8000,8000,8000,8000,8000,8000,8000,8000,8000,8000,8000,8000,8000,8000,8000,8000,8000,8000,8000,8000,8000,8000,8000,8000,,,,,,,,,,,,,,,,,,,,,,,,,,,,
#,line_min,,,,,,,,,,,,,,,,,,,,,,,,,,,,,,,,,,,,,,,,,,,,,,,,,,,,,,,,,,,,,,,,
300,300,300,300,300,300,300,300,300,300,300,300,300,300,300,300,300,300,300,300,300,300,300,300,300,300,300,300,300,300,300,300,300,,,,,,,,,,,,,,,,,,,,,,,,,,,,,,,,,
300,300,300,300,300,300,300,300,300,300,300,300,300,300,300,300,300,300,300,300,300,300,300,300,300,300,300,300,300,300,300,300,300,300,300,300,300,300,,,,,,,,,,,,,,,,,,,,,,,,,,,,
