#,aft_version,,,,,,,,,,,,,,,,,,,,,,,,,,,,,,,,,,,,,,,,,,,,,,,,,,,,
6,0,15,1,,,,,,,,,,,,,,,,,,,,,,,,,,,,,,,,,,,,,,,,,,,,,,,,,,
#,aft_filter_param,,,,,,,,,,,,,,,,,,,,,,,,,,,,,,,,,,,,,,,,,,,,,,,,,,,,
17,0,3727,1,0,0,0,0,0,0,0,0,0,0,0,1080,2560,40,40,16,38,0,3,0,0,0,0,0,0,0,0,10,0,24,0,50,80,0,0,5,40,40,40,50,30,600,600,200,200,400,400,30,30,0
