{
  "beat": [
    0,192,384,576,736,896,1120,1504,1664,1984,2144,2400,2560,2720,2912,3072,3296,3456,3616,3808,3968,4192,4416,4640,4864,5120,5280,5440,5600,5760,5920,6080,6240,6528,6720,6912,7136,7296,7456,7616,7840,8000,8192,8384,8544,8768,8960,9152,9408,9600,9856,10048,10400,10560,10880,11104,11264,11456,11616,11808,12000,12352,12512,12864,13152,13440,13664,13824,14176,14432,14688,14944,15136,15296,15584,15840,16000,16191,16384,16576,16768,16960,17120,17280,17472,17664,17856,18080,18240,18560,18784,19008,19264,19648,19808,20032,20256,20640,20832,21088,21312,21600,21792,21952,22112,22272,22464,22656,22848,23040,23264,23520,24032,24192,24384,24640,24800,24992,25152,25344,25504,25696,25856,26048,26208,26368,26528,26976,27168,27328,28000,30038
    ],
  "beat_count": 132,
  "downbeat": [
    0,
    576,
    1984,
    4416,
    6720,
    8768,
    11104,
    13152,
    15296,
    17472,
    19648,
    21792,
    24032,
    26048,
    29952,
    30038
    ],
  "downbeat_count": 16
}