-126.277	-126.584
0.215	-126.246
126.708	-125.877
253.2	-125.416
379.723	-124.893
506.246	-124.247
632.738	-123.539
759.23	-122.739
885.599	-121.878
1011.876	-120.955
1137.999	-120.063
1263.937	-119.202
1389.691	-118.494
1515.261	-117.91
1640.707	-117.51
1766.03	-117.264
1891.323	-117.11
2016.584	-117.018
2141.815	-117.018
2267.077	-117.11
2392.37	-117.264
2517.693	-117.541
2643.139	-117.94
2768.709	-118.525
2894.493	-119.232
3020.432	-120.094
3146.555	-121.017
3272.832	-121.909
3399.231	-122.801
3525.693	-123.601
3652.216	-124.277
3778.739	-124.893
3905.262	-125.446
4031.754	-125.877
4158.246	-126.277
-125.969	-0.369
0.584	0
127.138	0.431
253.723	0.923
380.338	1.507
506.953	2.215
633.568	3.015
760.122	3.937
886.553	4.891
1012.83	5.845
1138.891	6.737
1264.676	7.475
1390.245	7.998
1515.63	8.336
1640.922	8.49
1766.153	8.552
1891.384	8.552
2016.584	8.552
2141.815	8.552
2267.016	8.552
2392.247	8.552
2517.478	8.49
2642.77	8.306
2768.155	7.967
2893.755	7.444
3019.54	6.706
3145.601	5.814
3271.909	4.83
3398.339	3.876
3524.893	2.984
3651.508	2.184
3778.124	1.477
3904.739	0.892
4031.323	0.4
4157.877	-0.031
-125.631	125.846
0.984	126.246
127.63	126.677
254.307	127.23
381.015	127.876
507.753	128.646
634.46	129.538
761.076	130.491
887.537	131.506
1013.722	132.398
1139.599	133.106
1265.168	133.537
1390.491	133.752
1515.722	133.783
1640.922	133.69
1766.123	133.598
1891.323	133.506
2016.584	133.475
2141.815	133.475
2267.046	133.506
2392.277	133.598
2517.478	133.69
2642.678	133.783
2767.909	133.752
2893.263	133.537
3018.832	133.075
3144.709	132.368
3270.924	131.445
3397.386	130.46
3524.001	129.476
3650.708	128.615
3777.447	127.846
3904.185	127.2
4030.862	126.646
4157.477	126.215
-125.262	252.031
1.384	252.431
128.123	252.892
254.922	253.477
381.753	254.184
508.614	255.015
635.414	255.937
762.06	256.922
888.429	257.814
1014.429	258.491
1139.998	258.891
1265.291	258.983
1390.46	258.891
1515.599	258.737
1640.769	258.552
1765.999	258.429
1891.261	258.337
2016.554	258.306
2141.846	258.306
2267.139	258.337
2392.4	258.429
2517.631	258.552
2642.801	258.737
2767.94	258.921
2893.109	258.983
3018.401	258.891
3144.001	258.491
3270.001	257.783
3396.401	256.86
3523.047	255.876
3649.878	254.953
3776.708	254.153
3903.57	253.446
4030.339	252.861
4157.077	252.4
-124.923	378.185
1.846	378.584
128.676	379.077
255.568	379.661
382.522	380.399
509.506	381.23
636.368	382.184
762.983	383.076
889.137	383.752
1014.798	384.152
1140.06	384.214
1265.168	384.06
1390.245	383.814
1515.415	383.629
1640.645	383.506
1765.938	383.445
1891.23	383.414
2016.554	383.414
2141.846	383.414
2267.169	383.414
2392.462	383.445
2517.754	383.506
2642.985	383.629
2768.124	383.845
2893.232	384.06
3018.309	384.214
3143.602	384.122
3269.294	383.722
3395.479	383.014
3522.094	382.122
3648.986	381.199
3775.939	380.369
3902.924	379.63
4029.816	379.046
4156.646	378.554
-124.554	504.277
2.276	504.677
129.199	505.169
256.245	505.784
383.322	506.492
510.398	507.322
637.26	508.184
763.69	508.922
889.537	509.353
1014.86	509.414
1139.906	509.26
1264.953	509.045
1390.06	508.83
1515.291	508.737
1640.615	508.737
1765.938	508.768
1891.261	508.86
2016.554	508.891
2141.846	508.891
2267.139	508.83
2392.462	508.768
2517.785	508.737
2643.108	508.737
2768.339	508.83
2893.447	509.045
3018.463	509.291
3143.54	509.414
3268.894	509.322
3394.771	508.891
3521.202	508.153
3648.094	507.292
3775.17	506.461
3902.247	505.753
4029.262	505.138
4156.185	504.646
-124.216	630.338
2.707	630.707
129.753	631.2
256.891	631.784
384.091	632.492
511.198	633.261
637.967	633.968
764.152	634.491
889.66	634.645
1014.706	634.553
1139.691	634.307
1264.737	634.122
1389.968	634.03
1515.322	634.091
1640.707	634.214
1766.061	634.399
1891.353	634.583
2016.584	634.676
2141.815	634.676
2267.046	634.553
2392.339	634.399
2517.693	634.214
2643.078	634.091
2768.432	634.03
2893.632	634.122
3018.709	634.337
3143.663	634.553
3268.74	634.645
3394.279	634.46
3520.463	633.937
3647.263	633.23
3774.401	632.461
3901.601	631.753
4028.739	631.169
4155.754	630.707
-123.877	756.338
3.138	756.707
130.276	757.138
257.537	757.692
384.798	758.338
511.906	758.984
638.521	759.538
764.398	759.845
889.598	759.845
1014.491	759.63
1139.476	759.445
1264.676	759.353
1390.03	759.415
1515.507	759.599
1640.953	759.876
1766.307	760.184
1891.538	760.46
2016.646	760.614
2141.723	760.614
2266.862	760.46
2392.093	760.184
2517.447	759.845
2642.924	759.568
2768.37	759.415
2893.724	759.353
3018.894	759.445
3143.878	759.661
3268.802	759.845
3394.033	759.845
3519.91	759.538
3646.556	758.953
3773.694	758.307
3900.986	757.661
4028.216	757.107
4155.354	756.677
-123.601	882.308
3.507	882.615
130.737	883.015
258.091	883.477
385.444	884.03
512.49	884.584
638.89	884.953
764.429	885.076
889.444	884.984
1014.306	884.799
1139.383	884.676
1264.706	884.707
1390.214	884.861
1515.784	885.138
1641.322	885.538
1766.676	885.968
1891.815	886.368
2016.769	886.583
2141.631	886.583
2266.554	886.337
2391.724	885.937
2517.078	885.507
2642.616	885.138
2768.216	884.83
2893.693	884.676
3019.017	884.676
3144.063	884.83
3268.956	884.984
3393.971	885.076
3519.571	884.953
3646.002	884.553
3773.079	883.999
3900.401	883.477
4027.755	882.984
4154.985	882.615
-123.324	1008.246
3.814	1008.492
131.137	1008.8
258.552	1009.2
385.937	1009.63
512.89	1010.03
639.075	1010.276
764.398	1010.307
889.26	1010.184
1014.183	1010.03
1139.352	1009.999
1264.83	1010.061
1390.46	1010.276
1516.184	1010.615
1641.784	1011.076
1767.138	1011.599
1892.184	1012.06
2016.892	1012.337
2141.477	1012.337
2266.216	1012.03
2391.231	1011.568
2516.616	1011.045
2642.247	1010.615
2767.94	1010.276
2893.601	1010.061
3019.047	1009.999
3144.217	1010.061
3269.109	1010.184
3394.002	1010.307
3519.356	1010.246
3645.571	1009.999
3772.556	1009.6
3899.94	1009.169
4027.386	1008.8
4154.678	1008.461
-123.139	1134.123
4.061	1134.308
131.445	1134.523
258.921	1134.8
386.306	1135.107
513.167	1135.384
639.167	1135.507
764.336	1135.507
889.137	1135.415
1014.091	1135.323
1139.383	1135.323
1264.953	1135.415
1390.737	1135.63
1516.583	1135.938
1642.276	1136.369
1767.661	1136.861
1892.584	1137.353
2017.046	1137.63
2141.323	1137.63
2265.785	1137.322
2390.739	1136.861
2516.124	1136.338
2641.847	1135.938
2767.663	1135.6
2893.447	1135.415
3019.017	1135.323
3144.309	1135.323
3269.232	1135.415
3394.063	1135.507
3519.233	1135.507
3645.294	1135.353
3772.187	1135.107
3899.602	1134.8
4027.078	1134.523
4154.432	1134.277
-123.016	1259.969
4.214	1260.092
131.629	1260.215
259.137	1260.369
386.521	1260.523
513.321	1260.677
639.198	1260.738
764.275	1260.707
889.075	1260.677
1014.06	1260.615
1139.414	1260.646
1265.106	1260.707
1390.983	1260.831
1516.891	1261.046
1642.706	1261.353
1768.122	1261.692
1892.953	1262.03
2017.2	1262.246
2141.169	1262.246
2265.416	1262.03
2390.278	1261.692
2515.724	1261.323
2641.54	1261.046
2767.447	1260.831
2893.324	1260.707
3018.986	1260.646
3144.34	1260.615
3269.325	1260.677
3394.125	1260.738
3519.202	1260.738
3645.141	1260.677
3771.971	1260.523
3899.355	1260.369
4026.863	1260.215
4154.278	1260.092
-122.955	1385.815
4.276	1385.846
131.722	1385.877
259.26	1385.908
386.613	1385.938
513.382	1385.938
639.198	1385.969
764.244	1385.969
889.044	1385.938
1014.06	1385.938
1139.445	1385.938
1265.168	1385.969
1391.076	1385.969
1517.045	1386.031
1642.891	1386.092
1768.337	1386.154
1893.138	1386.215
2017.261	1386.246
2141.077	1386.246
2265.231	1386.215
2390.063	1386.154
2515.54	1386.061
2641.386	1386.031
2767.355	1385.969
2893.263	1385.969
3018.955	1385.938
3144.34	1385.938
3269.355	1385.938
3394.125	1385.969
3519.202	1385.969
3645.048	1385.938
3771.879	1385.938
3899.263	1385.908
4026.771	1385.877
4154.216	1385.846
-122.985	1511.662
4.276	1511.6
131.691	1511.508
259.198	1511.416
386.583	1511.292
513.352	1511.231
639.198	1511.169
764.244	1511.2
889.044	1511.231
1014.06	1511.262
1139.445	1511.231
1265.137	1511.2
1391.045	1511.108
1516.983	1510.954
1642.799	1510.77
1768.245	1510.523
1893.076	1510.277
2017.23	1510.124
2141.108	1510.124
2265.293	1510.277
2390.155	1510.523
2515.601	1510.77
2641.447	1510.954
2767.386	1511.108
2893.294	1511.2
3018.986	1511.262
3144.34	1511.262
3269.325	1511.231
3394.125	1511.2
3519.202	1511.169
3645.079	1511.231
3771.91	1511.323
3899.294	1511.416
4026.832	1511.508
4154.247	1511.6
-123.078	1637.508
4.153	1637.385
131.537	1637.169
259.044	1636.954
386.398	1636.708
513.259	1636.493
639.198	1636.4
764.306	1636.431
889.106	1636.493
1014.091	1636.554
1139.383	1636.554
1265.045	1636.462
1390.86	1636.277
1516.737	1636.001
1642.46	1635.601
1767.876	1635.17
1892.769	1634.739
2017.107	1634.462
2141.231	1634.462
2265.601	1634.739
2390.524	1635.17
2515.94	1635.631
2641.693	1636.001
2767.57	1636.308
2893.386	1636.462
3019.017	1636.554
3144.309	1636.554
3269.263	1636.493
3394.094	1636.431
3519.233	1636.4
3645.202	1636.523
3772.094	1636.739
3899.479	1636.954
4026.955	1637.2
4154.37	1637.385
-123.231	1763.385
3.937	1763.169
131.26	1762.893
258.737	1762.554
386.09	1762.185
513.013	1761.847
639.136	1761.631
764.367	1761.631
889.198	1761.754
1014.122	1761.847
1139.352	1761.877
1264.891	1761.785
1390.583	1761.57
1516.337	1761.231
1641.999	1760.77
1767.384	1760.247
1892.369	1759.755
2016.954	1759.478
2141.416	1759.478
2266.031	1759.786
2391.016	1760.278
2516.401	1760.801
2642.063	1761.262
2767.847	1761.601
2893.54	1761.816
3019.047	1761.877
3144.248	1761.847
3269.171	1761.724
3394.002	1761.631
3519.294	1761.631
3645.448	1761.847
3772.402	1762.185
3899.786	1762.554
4027.232	1762.893
4154.555	1763.169
-123.478	1889.293
3.63	1889.016
130.922	1888.647
258.306	1888.216
385.66	1887.724
512.675	1887.231
638.982	1886.924
764.429	1886.832
889.352	1886.955
1014.245	1887.108
1139.352	1887.201
1264.737	1887.17
1390.307	1886.985
1515.937	1886.647
1641.507	1886.216
1766.861	1885.755
1891.969	1885.324
2016.8	1885.078
2141.569	1885.078
2266.431	1885.324
2391.539	1885.755
2516.893	1886.247
2642.462	1886.678
2768.093	1886.985
2893.663	1887.17
3019.047	1887.201
3144.155	1887.108
3269.017	1886.955
3393.971	1886.832
3519.448	1886.924
3645.787	1887.262
3772.833	1887.724
3900.186	1888.247
4027.57	1888.677
4154.862	1889.046
-123.754	2015.262
3.292	2014.923
130.46	2014.493
257.783	2013.97
385.106	2013.355
512.183	2012.739
638.706	2012.278
764.429	2012.063
889.537	2012.124
1014.429	2012.309
1139.414	2012.462
1264.676	2012.524
1390.091	2012.432
1515.599	2012.186
1641.076	2011.847
1766.461	2011.478
1891.661	2011.17
2016.708	2010.955
2141.692	2010.986
2266.739	2011.17
2391.939	2011.509
2517.324	2011.878
2642.801	2012.186
2768.309	2012.432
2893.724	2012.524
3018.955	2012.462
3143.971	2012.309
3268.863	2012.124
3393.971	2012.063
3519.756	2012.278
3646.31	2012.77
3773.417	2013.385
3900.709	2014.001
4028.032	2014.523
4155.201	2014.923
-124.062	2141.231
2.892	2140.862
129.968	2140.4
257.168	2139.816
384.429	2139.139
511.537	2138.432
638.244	2137.755
764.275	2137.355
889.629	2137.263
1014.645	2137.447
1139.599	2137.663
1264.706	2137.816
1389.999	2137.816
1515.384	2137.724
1640.799	2137.54
1766.153	2137.294
1891.415	2137.078
2016.615	2136.955
2141.785	2136.955
2266.985	2137.078
2392.247	2137.294
2517.601	2137.54
2643.016	2137.724
2768.432	2137.816
2893.693	2137.816
3018.801	2137.632
3143.755	2137.417
3268.74	2137.263
3394.156	2137.386
3520.217	2137.786
3646.956	2138.462
3774.063	2139.17
3901.324	2139.847
4028.524	2140.431
4155.601	2140.893
-124.4	2267.293
2.461	2266.893
129.445	2266.4
256.522	2265.785
383.66	2265.078
510.737	2264.247
637.598	2263.447
763.906	2262.832
889.629	2262.524
1014.829	2262.524
1139.814	2262.74
1264.86	2262.955
1389.999	2263.109
1515.291	2263.14
1640.645	2263.109
1765.969	2262.986
1891.292	2262.894
2016.554	2262.801
2141.846	2262.801
2267.108	2262.894
2392.431	2262.986
2517.785	2263.109
2643.108	2263.14
2768.401	2263.109
2893.54	2262.955
3018.586	2262.709
3143.571	2262.524
3268.802	2262.524
3394.525	2262.863
3520.863	2263.478
3647.725	2264.309
3774.832	2265.108
3901.97	2265.816
4029.047	2266.431
4156	2266.893
-124.77	2393.354
2.03	2392.954
128.892	2392.462
255.845	2391.847
382.86	2391.139
509.875	2390.278
636.768	2389.386
763.291	2388.555
889.352	2387.971
1014.86	2387.725
1140.029	2387.755
1265.076	2387.971
1390.153	2388.217
1515.353	2388.371
1640.615	2388.463
1765.907	2388.463
1891.23	2388.463
2016.554	2388.432
2141.846	2388.432
2267.169	2388.463
2392.493	2388.463
2517.785	2388.463
2643.047	2388.371
2768.216	2388.186
2893.324	2387.971
3018.371	2387.755
3143.54	2387.725
3269.079	2387.971
3395.14	2388.586
3521.694	2389.417
3648.586	2390.309
3775.601	2391.17
3902.616	2391.877
4029.57	2392.493
4156.462	2392.985
-125.108	2519.477
1.6	2519.077
128.369	2518.616
255.199	2518
382.091	2517.293
508.983	2516.462
635.814	2515.509
762.46	2514.586
888.768	2513.755
1014.614	2513.171
1140.06	2512.925
1265.26	2512.956
1390.368	2513.14
1515.507	2513.355
1640.707	2513.509
1765.969	2513.632
1891.261	2513.694
2016.554	2513.725
2141.846	2513.725
2267.139	2513.694
2392.431	2513.632
2517.693	2513.509
2642.862	2513.325
2768.001	2513.14
2893.14	2512.956
3018.34	2512.956
3143.786	2513.202
3269.663	2513.786
3395.971	2514.617
3522.647	2515.57
3649.478	2516.493
3776.401	2517.324
3903.293	2518.031
4030.124	2518.616
4156.893	2519.108
-125.477	2645.662
1.169	2645.262
127.846	2644.8
254.553	2644.247
381.322	2643.57
508.122	2642.77
634.86	2641.847
761.506	2640.894
887.937	2639.909
1014.06	2639.079
1139.814	2638.494
1265.26	2638.217
1390.522	2638.156
1515.691	2638.217
1640.861	2638.371
1766.061	2638.494
1891.323	2638.586
2016.554	2638.648
2141.846	2638.648
2267.077	2638.586
2392.339	2638.494
2517.539	2638.371
2642.709	2638.217
2767.878	2638.156
2893.14	2638.217
3018.617	2638.525
3144.371	2639.109
3270.494	2639.94
3396.955	2640.924
3523.601	2641.909
3650.37	2642.801
3777.139	2643.601
3903.908	2644.277
4030.646	2644.831
4157.323	2645.292
-125.815	2771.846
0.738	2771.477
127.354	2771.046
253.969	2770.523
380.615	2769.908
507.292	2769.17
633.937	2768.339
760.522	2767.386
886.983	2766.401
1013.229	2765.448
1139.199	2764.617
1264.922	2764.002
1390.399	2763.602
1515.722	2763.417
1640.953	2763.356
1766.153	2763.387
1891.353	2763.417
2016.584	2763.448
2141.815	2763.448
2267.016	2763.417
2392.247	2763.387
2517.447	2763.356
2642.678	2763.417
2768.001	2763.602
2893.509	2764.033
3019.201	2764.648
3145.201	2765.479
3271.478	2766.463
3397.939	2767.447
3524.524	2768.37
3651.17	2769.201
3777.847	2769.939
3904.493	2770.554
4031.139	2771.077
4157.723	2771.508
-126.154	2898.062
0.369	2897.723
126.892	2897.323
253.415	2896.831
379.969	2896.277
506.553	2895.631
633.076	2894.893
759.599	2894.032
885.999	2893.109
1012.276	2892.155
1138.399	2891.263
1264.276	2890.433
1389.968	2889.787
1515.445	2889.294
1640.83	2888.987
1766.123	2888.802
1891.353	2888.71
2016.584	2888.679
2141.815	2888.679
2267.046	2888.71
2392.277	2888.802
2517.57	2888.987
2642.955	2889.325
2768.462	2889.817
2894.155	2890.463
3020.032	2891.294
3146.155	2892.217
3272.432	2893.17
3398.862	2894.093
3525.385	2894.924
3651.908	2895.662
3778.493	2896.308
3905.046	2896.862
4031.569	2897.354
4158.092	2897.754
-126.461	3024.308
0	3024
126.461	3023.631
252.923	3023.2
379.415	3022.708
505.876	3022.124
632.338	3021.478
758.769	3020.739
885.107	3019.939
1011.384	3019.078
1137.507	3018.186
1263.507	3017.355
1389.322	3016.617
1514.953	3015.971
1640.492	3015.479
1765.907	3015.141
1891.261	3014.925
2016.554	3014.802
2141.846	3014.833
2267.169	3014.925
2392.493	3015.141
2517.908	3015.51
2643.447	3016.002
2769.108	3016.648
2894.924	3017.417
3020.924	3018.248
3147.078	3019.109
3273.324	3019.97
3399.693	3020.77
3526.124	3021.508
3652.585	3022.154
3779.046	3022.739
3905.508	3023.231
4032	3023.631
4158.461	3024
-126.738	3150.584
-0.338	3150.277
126.092	3149.938
252.492	3149.569
378.923	3149.139
505.323	3148.616
631.692	3148.062
758.03	3147.447
884.338	3146.739
1010.553	3146.032
1136.707	3145.263
1262.707	3144.524
1388.615	3143.817
1514.369	3143.171
1640.03	3142.648
1765.569	3142.248
1891.046	3141.971
2016.492	3141.817
2141.908	3141.848
2267.354	3141.971
2392.831	3142.248
2518.37	3142.648
2644.031	3143.202
2769.816	3143.848
2895.724	3144.555
3021.754	3145.293
3147.877	3146.063
3274.124	3146.77
3400.4	3147.478
3526.77	3148.093
3653.139	3148.646
3779.539	3149.139
3905.969	3149.6
4032.369	3149.969
4158.769	3150.308