#,version,,,,,,,,,,,,,,,,,,,,,,,,,,,,,,,,,,,,,,,,,,,,,,,,,,,,
2023,9,28,1,,,,,,,,,,,,,,,,,,,,,,,,,,,,,,,,,,,,,,,,,,,,,,,,,,
#,row_col_num,,,,,,,,,,,,,,,,,,,,,,,,,,,,,,,,,,,,,,,,,,,,,,,,,,,,
37,17,,,,,,,,,,,,,,,,,,,,,,,,,,,,,,,,,,,,,,,,,,,,,,,,,,,,
#,freq_noise,,,,,,,,,,,,,,,,,,,,,,,,,,,,,,,,,,,,,,,,,,,,,,,,,,,,
-500,500,,,,,,,,,,,,,,,,,,,,,,,,,,,,,,,,,,,,,,,,,,,,,,,,,,,,
#,raw_max,,,,,,,,,,,,,,,,,,,,,,,,,,,,,,,,,,,,,,,,,,,,,,,,,,,,
10377,10434,10372,10579,10490,10453,10441,10472,10397,10502,10447,10522,10396,10383,10468,10507,10359,,,,,,,,,,,,,,,,,,,,,,,,,,,,,,,,,,,,,
10370,10466,10482,10422,10433,10418,10443,10430,10376,10387,10468,10458,10519,10508,10454,10401,10450,,,,,,,,,,,,,,,,,,,,,,,,,,,,,,,,,,,,,
10438,10436,10441,10435,10435,10436,10438,10430,10447,10433,10436,10436,10437,10445,10444,10447,10477,,,,,,,,,,,,,,,,,,,,,,,,,,,,,,,,,,,,,
10446,10446,10454,10448,10449,10452,10450,10444,10456,10446,10447,10450,10450,10458,10456,10458,10486,,,,,,,,,,,,,,,,,,,,,,,,,,,,,,,,,,,,,
10458,10452,10460,10455,10457,10456,10456,10450,10462,10452,10453,10456,10455,10463,10460,10461,10484,,,,,,,,,,,,,,,,,,,,,,,,,,,,,,,,,,,,,
10461,10460,10470,10464,10465,10466,10466,10460,10471,10462,10463,10465,10465,10471,10468,10468,10489,,,,,,,,,,,,,,,,,,,,,,,,,,,,,,,,,,,,,
10447,10442,10451,10447,10448,10450,10452,10444,10455,10447,10446,10449,10448,10455,10451,10450,10464,,,,,,,,,,,,,,,,,,,,,,,,,,,,,,,,,,,,,
10450,10450,10459,10457,10457,10459,10458,10453,10463,10456,10454,10456,10456,10463,10458,10458,10470,,,,,,,,,,,,,,,,,,,,,,,,,,,,,,,,,,,,,
10454,10450,10460,10456,10458,10460,10459,10454,10464,10456,10455,10457,10457,10463,10458,10457,10465,,,,,,,,,,,,,,,,,,,,,,,,,,,,,,,,,,,,,
10469,10515,10466,10462,10464,10466,10465,10461,10470,10463,10461,10464,10463,10469,10464,10462,10469,,,,,,,,,,,,,,,,,,,,,,,,,,,,,,,,,,,,,
10452,10448,10458,10454,10456,10458,10457,10453,10462,10455,10453,10455,10455,10460,10455,10453,10454,,,,,,,,,,,,,,,,,,,,,,,,,,,,,,,,,,,,,
10461,10460,10469,10465,10467,10470,10469,10465,10473,10467,10465,10466,10465,10470,10465,10463,10465,,,,,,,,,,,,,,,,,,,,,,,,,,,,,,,,,,,,,
10451,10451,10454,10450,10452,10454,10453,10450,10458,10451,10449,10450,10448,10453,10448,10447,10446,,,,,,,,,,,,,,,,,,,,,,,,,,,,,,,,,,,,,
10433,10434,10441,10437,10439,10441,10440,10438,10445,10439,10436,10437,10435,10440,10435,10434,10433,,,,,,,,,,,,,,,,,,,,,,,,,,,,,,,,,,,,,
10413,10408,10417,10413,10414,10417,10416,10414,10421,10415,10412,10414,10411,10417,10411,10409,10404,,,,,,,,,,,,,,,,,,,,,,,,,,,,,,,,,,,,,
10406,10436,10412,10408,10409,10418,10411,10409,10416,10411,10407,10408,10406,10411,10406,10404,10398,,,,,,,,,,,,,,,,,,,,,,,,,,,,,,,,,,,,,
10391,10427,10395,10391,10392,10394,10393,10392,10398,10394,10389,10390,10387,10392,10388,10386,10377,,,,,,,,,,,,,,,,,,,,,,,,,,,,,,,,,,,,,
10406,10405,10413,10409,10410,10412,10411,10410,10416,10412,10407,10408,10405,10409,10405,10403,10395,,,,,,,,,,,,,,,,,,,,,,,,,,,,,,,,,,,,,
10411,10399,10406,10401,10402,10404,10403,10403,10408,10404,10400,10400,10397,10401,10397,10395,10384,,,,,,,,,,,,,,,,,,,,,,,,,,,,,,,,,,,,,
10387,10384,10391,10386,10387,10389,10389,10388,10394,10390,10385,10385,10382,10386,10382,10380,10369,,,,,,,,,,,,,,,,,,,,,,,,,,,,,,,,,,,,,
10349,10341,10349,10343,10344,10346,10345,10345,10352,10346,10341,10342,10340,10395,10340,10416,10373,,,,,,,,,,,,,,,,,,,,,,,,,,,,,,,,,,,,,
10351,10345,10353,10348,10348,10350,10349,10349,10353,10351,10345,10346,10344,10348,10344,10343,10330,,,,,,,,,,,,,,,,,,,,,,,,,,,,,,,,,,,,,
10331,10321,10329,10323,10324,10325,10324,10324,10328,10326,10320,10321,10318,10326,10318,10317,10302,,,,,,,,,,,,,,,,,,,,,,,,,,,,,,,,,,,,,
10320,10313,10321,10315,10316,10317,10316,10316,10320,10318,10312,10314,10311,10314,10311,10310,10294,,,,,,,,,,,,,,,,,,,,,,,,,,,,,,,,,,,,,
10308,10295,10302,10296,10297,10298,10297,10297,10301,10299,10292,10294,10291,10295,10292,10293,10273,,,,,,,,,,,,,,,,,,,,,,,,,,,,,,,,,,,,,
10299,10290,10296,10290,10290,10291,10290,10291,10294,10293,10286,10288,10286,10294,10287,10288,10272,,,,,,,,,,,,,,,,,,,,,,,,,,,,,,,,,,,,,
10285,10269,10274,10269,10269,10270,10268,10269,10272,10271,10264,10266,10265,10274,10266,10266,10248,,,,,,,,,,,,,,,,,,,,,,,,,,,,,,,,,,,,,
10273,10261,10267,10261,10261,10261,10260,10263,10264,10263,10256,10258,10260,10267,10259,10260,10245,,,,,,,,,,,,,,,,,,,,,,,,,,,,,,,,,,,,,
10260,10243,10248,10241,10241,10242,10240,10242,10244,10243,10238,10238,10243,10248,10241,10242,10227,,,,,,,,,,,,,,,,,,,,,,,,,,,,,,,,,,,,,
10235,10221,10227,10220,10219,10220,10218,10220,10222,10223,10214,10221,10222,10227,10222,10224,10215,,,,,,,,,,,,,,,,,,,,,,,,,,,,,,,,,,,,,
10207,10189,10195,10188,10187,10188,10186,10188,10189,10189,10182,10191,10192,10196,10190,10194,10184,,,,,,,,,,,,,,,,,,,,,,,,,,,,,,,,,,,,,
10204,10189,10194,10187,10187,10187,10185,10188,10191,10189,10185,10191,10191,10197,10193,10197,10195,,,,,,,,,,,,,,,,,,,,,,,,,,,,,,,,,,,,,
10206,10183,10188,10181,10180,10181,10179,10182,10183,10184,10182,10185,10187,10194,10189,10195,10201,,,,,,,,,,,,,,,,,,,,,,,,,,,,,,,,,,,,,
10196,10177,10182,10175,10175,10176,10174,10177,10177,10182,10177,10183,10183,10189,10186,10195,10216,,,,,,,,,,,,,,,,,,,,,,,,,,,,,,,,,,,,,
10192,10167,10172,10165,10165,10167,10166,10170,10171,10178,10170,10173,10175,10181,10181,10194,10234,,,,,,,,,,,,,,,,,,,,,,,,,,,,,,,,,,,,,
10144,10171,10176,10169,10170,10173,10173,10178,10183,10187,10178,10180,10181,10188,10190,10211,10230,,,,,,,,,,,,,,,,,,,,,,,,,,,,,,,,,,,,,
10302,10251,10177,10212,10254,10244,10261,10279,10205,10209,10320,10176,10269,10054,10223,10124,10261,,,,,,,,,,,,,,,,,,,,,,,,,,,,,,,,,,,,,
#,raw_min,,,,,,,,,,,,,,,,,,,,,,,,,,,,,,,,,,,,,,,,,,,,,,,,,,,,
6226,6260,6223,6347,6294,6272,6265,6283,6238,6301,6268,6313,6238,6230,6280,6304,6215,,,,,,,,,,,,,,,,,,,,,,,,,,,,,,,,,,,,,
6222,6279,6289,6253,6260,6251,6266,6258,6225,6232,6281,6274,6311,6305,6272,6241,6270,,,,,,,,,,,,,,,,,,,,,,,,,,,,,,,,,,,,,
6263,6261,6265,6261,6261,6261,6263,6258,6268,6259,6261,6262,6262,6267,6266,6268,6286,,,,,,,,,,,,,,,,,,,,,,,,,,,,,,,,,,,,,
6268,6267,6272,6269,6269,6271,6270,6266,6273,6267,6268,6270,6270,6274,6273,6274,6291,,,,,,,,,,,,,,,,,,,,,,,,,,,,,,,,,,,,,
6274,6271,6276,6273,6274,6274,6273,6270,6277,6271,6272,6273,6273,6277,6276,6277,6290,,,,,,,,,,,,,,,,,,,,,,,,,,,,,,,,,,,,,
6276,6276,6282,6278,6279,6280,6279,6276,6282,6277,6277,6279,6279,6283,6281,6281,6293,,,,,,,,,,,,,,,,,,,,,,,,,,,,,,,,,,,,,
6268,6265,6271,6268,6269,6270,6271,6266,6273,6268,6268,6269,6269,6273,6270,6270,6278,,,,,,,,,,,,,,,,,,,,,,,,,,,,,,,,,,,,,
6270,6270,6275,6274,6274,6275,6275,6272,6278,6273,6272,6274,6274,6277,6275,6274,6282,,,,,,,,,,,,,,,,,,,,,,,,,,,,,,,,,,,,,
6272,6270,6276,6273,6275,6276,6275,6272,6278,6274,6273,6274,6274,6277,6275,6274,6279,,,,,,,,,,,,,,,,,,,,,,,,,,,,,,,,,,,,,
6281,6309,6279,6277,6278,6279,6279,6276,6282,6278,6276,6278,6278,6281,6278,6277,6281,,,,,,,,,,,,,,,,,,,,,,,,,,,,,,,,,,,,,
6271,6269,6274,6272,6273,6274,6274,6272,6277,6273,6272,6273,6273,6276,6273,6272,6272,,,,,,,,,,,,,,,,,,,,,,,,,,,,,,,,,,,,,
6276,6276,6281,6279,6280,6282,6281,6279,6284,6280,6279,6279,6279,6282,6279,6278,6279,,,,,,,,,,,,,,,,,,,,,,,,,,,,,,,,,,,,,
6270,6270,6272,6270,6271,6272,6272,6270,6274,6271,6269,6270,6268,6272,6269,6268,6267,,,,,,,,,,,,,,,,,,,,,,,,,,,,,,,,,,,,,
6260,6260,6264,6262,6263,6264,6264,6262,6267,6263,6261,6262,6261,6264,6261,6260,6260,,,,,,,,,,,,,,,,,,,,,,,,,,,,,,,,,,,,,
6248,6245,6250,6247,6248,6250,6249,6248,6253,6249,6247,6248,6247,6250,6247,6245,6242,,,,,,,,,,,,,,,,,,,,,,,,,,,,,,,,,,,,,
6243,6262,6247,6245,6245,6250,6246,6245,6250,6246,6244,6245,6243,6246,6243,6242,6239,,,,,,,,,,,,,,,,,,,,,,,,,,,,,,,,,,,,,
6235,6256,6237,6234,6235,6236,6236,6235,6239,6236,6233,6234,6232,6235,6232,6231,6226,,,,,,,,,,,,,,,,,,,,,,,,,,,,,,,,,,,,,
6244,6243,6248,6245,6246,6247,6246,6246,6249,6247,6244,6245,6243,6245,6243,6241,6237,,,,,,,,,,,,,,,,,,,,,,,,,,,,,,,,,,,,,
6247,6239,6244,6241,6241,6242,6242,6241,6245,6242,6240,6240,6238,6241,6238,6237,6230,,,,,,,,,,,,,,,,,,,,,,,,,,,,,,,,,,,,,
6232,6230,6235,6232,6232,6233,6233,6233,6236,6234,6231,6231,6229,6232,6229,6228,6221,,,,,,,,,,,,,,,,,,,,,,,,,,,,,,,,,,,,,
6209,6204,6209,6206,6206,6207,6207,6207,6211,6207,6204,6205,6204,6237,6204,6250,6224,,,,,,,,,,,,,,,,,,,,,,,,,,,,,,,,,,,,,
6210,6207,6212,6208,6209,6210,6209,6209,6212,6210,6207,6207,6206,6209,6206,6205,6198,,,,,,,,,,,,,,,,,,,,,,,,,,,,,,,,,,,,,
6198,6192,6197,6194,6194,6195,6194,6194,6197,6195,6192,6192,6191,6195,6191,6190,6181,,,,,,,,,,,,,,,,,,,,,,,,,,,,,,,,,,,,,
6192,6188,6192,6189,6189,6190,6189,6190,6192,6191,6187,6188,6186,6188,6186,6186,6176,,,,,,,,,,,,,,,,,,,,,,,,,,,,,,,,,,,,,
6184,6177,6181,6177,6178,6178,6178,6178,6180,6179,6175,6176,6175,6177,6175,6175,6163,,,,,,,,,,,,,,,,,,,,,,,,,,,,,,,,,,,,,
6179,6174,6177,6174,6174,6175,6174,6174,6176,6175,6171,6172,6171,6176,6172,6173,6163,,,,,,,,,,,,,,,,,,,,,,,,,,,,,,,,,,,,,
6171,6161,6164,6161,6161,6162,6161,6161,6163,6162,6158,6160,6159,6164,6160,6159,6149,,,,,,,,,,,,,,,,,,,,,,,,,,,,,,,,,,,,,
6163,6157,6160,6156,6156,6157,6156,6158,6158,6158,6153,6155,6156,6160,6155,6156,6147,,,,,,,,,,,,,,,,,,,,,,,,,,,,,,,,,,,,,
6156,6146,6149,6145,6144,6145,6144,6145,6146,6146,6142,6143,6146,6148,6144,6145,6136,,,,,,,,,,,,,,,,,,,,,,,,,,,,,,,,,,,,,
6141,6133,6136,6132,6131,6132,6131,6132,6133,6134,6128,6132,6133,6136,6133,6134,6129,,,,,,,,,,,,,,,,,,,,,,,,,,,,,,,,,,,,,
6124,6113,6117,6112,6112,6112,6111,6113,6113,6113,6109,6114,6115,6118,6114,6116,6110,,,,,,,,,,,,,,,,,,,,,,,,,,,,,,,,,,,,,
6122,6113,6116,6112,6112,6112,6111,6113,6114,6113,6111,6114,6115,6118,6115,6118,6117,,,,,,,,,,,,,,,,,,,,,,,,,,,,,,,,,,,,,
6123,6110,6113,6108,6108,6108,6107,6109,6109,6110,6109,6111,6112,6116,6113,6117,6121,,,,,,,,,,,,,,,,,,,,,,,,,,,,,,,,,,,,,
6118,6106,6109,6105,6105,6105,6104,6106,6106,6109,6106,6109,6109,6113,6111,6117,6130,,,,,,,,,,,,,,,,,,,,,,,,,,,,,,,,,,,,,
6115,6100,6103,6099,6099,6100,6099,6102,6103,6106,6102,6104,6105,6109,6109,6116,6140,,,,,,,,,,,,,,,,,,,,,,,,,,,,,,,,,,,,,
6086,6102,6105,6101,6102,6104,6104,6107,6109,6112,6107,6108,6109,6112,6114,6127,6138,,,,,,,,,,,,,,,,,,,,,,,,,,,,,,,,,,,,,
6181,6150,6106,6127,6152,6146,6156,6167,6123,6125,6192,6105,6161,6032,6134,6074,6156,,,,,,,,,,,,,,,,,,,,,,,,,,,,,,,,,,,,,
#,raw_row_delta_max,,,,,,,,,,,,,,,,,,,,,,,,,,,,,,,,,,,,,,,,,,,,,,,,,,,,
1500,400,400,400,400,400,400,400,400,400,400,400,400,400,400,400,1500,,,,,,,,,,,,,,,,,,,,,,,,,,,,,,,,,,,,,
350,350,350,350,350,350,350,400,400,400,350,350,350,350,350,350,350,,,,,,,,,,,,,,,,,,,,,,,,,,,,,,,,,,,,,
350,350,350,350,350,350,350,350,350,350,350,350,350,350,350,350,350,,,,,,,,,,,,,,,,,,,,,,,,,,,,,,,,,,,,,
350,350,350,350,350,350,350,350,350,350,350,350,350,350,350,350,350,,,,,,,,,,,,,,,,,,,,,,,,,,,,,,,,,,,,,
350,350,350,350,350,350,350,350,350,350,350,350,350,350,350,350,350,,,,,,,,,,,,,,,,,,,,,,,,,,,,,,,,,,,,,
350,350,350,350,350,350,350,350,350,350,350,350,350,350,350,350,350,,,,,,,,,,,,,,,,,,,,,,,,,,,,,,,,,,,,,
350,350,350,350,350,350,350,350,350,350,350,350,350,350,350,350,350,,,,,,,,,,,,,,,,,,,,,,,,,,,,,,,,,,,,,
350,350,350,350,350,350,350,350,350,350,350,350,350,350,350,350,350,,,,,,,,,,,,,,,,,,,,,,,,,,,,,,,,,,,,,
350,350,350,350,350,350,350,350,350,350,350,350,350,350,350,350,350,,,,,,,,,,,,,,,,,,,,,,,,,,,,,,,,,,,,,
350,350,350,350,350,350,350,350,350,350,350,350,350,350,350,350,350,,,,,,,,,,,,,,,,,,,,,,,,,,,,,,,,,,,,,
350,350,350,350,350,350,350,350,350,350,350,350,350,350,350,350,350,,,,,,,,,,,,,,,,,,,,,,,,,,,,,,,,,,,,,
350,350,350,350,350,350,350,350,350,350,350,350,350,350,350,350,350,,,,,,,,,,,,,,,,,,,,,,,,,,,,,,,,,,,,,
350,350,350,350,350,350,350,350,350,350,350,350,350,350,350,350,350,,,,,,,,,,,,,,,,,,,,,,,,,,,,,,,,,,,,,
350,350,350,350,350,350,350,350,350,350,350,350,350,350,350,350,350,,,,,,,,,,,,,,,,,,,,,,,,,,,,,,,,,,,,,
350,350,350,350,350,350,350,350,350,350,350,350,350,350,350,350,350,,,,,,,,,,,,,,,,,,,,,,,,,,,,,,,,,,,,,
350,350,350,350,350,350,350,350,350,350,350,350,350,350,350,350,350,,,,,,,,,,,,,,,,,,,,,,,,,,,,,,,,,,,,,
350,350,350,350,350,350,350,350,350,350,350,350,350,350,350,350,350,,,,,,,,,,,,,,,,,,,,,,,,,,,,,,,,,,,,,
350,350,350,350,350,350,350,350,350,350,350,350,350,350,350,350,350,,,,,,,,,,,,,,,,,,,,,,,,,,,,,,,,,,,,,
350,350,350,350,350,350,350,350,350,350,350,350,350,350,350,350,350,,,,,,,,,,,,,,,,,,,,,,,,,,,,,,,,,,,,,
350,350,350,350,350,350,350,350,350,350,350,350,350,350,350,350,350,,,,,,,,,,,,,,,,,,,,,,,,,,,,,,,,,,,,,
350,350,350,350,350,350,350,350,350,350,350,350,350,350,350,350,350,,,,,,,, ,,,,,,,,,,,,,,,,,,,,,,,,,,,,,
350,350,350,350,350,350,350,350,350,350,350,350,350,350,350,350,350,,,,,,,,,,,,,,,,,,,,,,,,,,,,,,,,,,,,,
350,350,350,350,350,350,350,350,350,350,350,350,350,350,350,350,350,,,,,,,,,,,,,,,,,,,,,,,,,,,,,,,,,,,,,
350,350,350,350,350,350,350,350,350,350,350,350,350,350,350,350,350,,,,,,,,,,,,,,,,,,,,,,,,,,,,,,,,,,,,,
350,350,350,350,350,350,350,350,350,350,350,350,350,350,350,350,350,,,,,,,,,,,,,,,,,,,,,,,,,,,,,,,,,,,,,
350,350,350,350,350,350,350,350,350,350,350,350,350,350,350,350,350,,,,,,,,,,,,,,,,,,,,,,,,,,,,,,,,,,,,,
350,350,350,350,350,350,350,350,350,350,350,350,350,350,350,350,350,,,,,,,,,,,,,,,,,,,,,,,,,,,,,,,,,,,,,
350,350,350,350,350,350,350,350,350,350,350,350,350,350,350,350,350,,,,,,,,,,,,,,,,,,,,,,,,,,,,,,,,,,,,,
350,350,350,350,350,350,350,350,350,350,350,350,350,350,350,350,350,,,,,,,,,,,,,,,,,,,,,,,,,,,,,,,,,,,,,
350,350,350,350,350,350,350,350,350,350,350,350,350,350,350,350,350,,,,,,,,,,,,,,,,,,,,,,,,,,,,,,,,,,,,,
350,350,350,350,350,350,350,350,350,350,350,350,350,350,350,350,350,,,,,,,,,,,,,,,,,,,,,,,,,,,,,,,,,,,,,
350,350,350,350,350,350,350,350,350,350,350,350,350,350,350,350,350,,,,,,,,,,,,,,,,,,,,,,,,,,,,,,,,,,,,,
350,350,350,350,350,350,350,350,350,350,350,350,350,350,350,350,350,,,,,,,,,,,,,,,,,,,,,,,,,,,,,,,,,,,,,
350,350,350,350,350,350,350,350,350,350,350,350,350,350,350,350,350,,,,,,,,,,,,,,,,,,,,,,,,,,,,,,,,,,,,,
350,350,350,350,350,350,350,350,350,350,350,350,350,350,350,350,350,,,,,,,,,,,,,,,,,,,,,,,,,,,,,,,,,,,,,
1500,400,400,400,400,400,400,400,400,400,400,400,400,400,400,400,1500,,,,,,,,,,,,,,,,,,,,,,,,,,,,,,,,,,,,,
#,raw_row_delta_min,,,,,,,,,,,,,,,,,,,,,,,,,,,,,,,,,,,,,,,,,,,,,,,,,,,,
-1500,-400,-400,-400,-400,-400,-400,-400,-400,-400,-400,-400,-400,-400,-400,-400,-1500,,,,,,,,,,,,,,,,,,,,,,,,,,,,,,,,,,,,,
-350,-350,-350,-350,-350,-350,-350,-400,-400,-400,-350,-350,-350,-350,-350,-350,-350,,,,,,,,,,,,,,,,,,,,,,,,,,,,,,,,,,,,,
-350,-350,-350,-350,-350,-350,-350,-350,-350,-350,-350,-350,-350,-350,-350,-350,-350,,,,,,,,,,,,,,,,,,,,,,,,,,,,,,,,,,,,,
-350,-350,-350,-350,-350,-350,-350,-350,-350,-350,-350,-350,-350,-350,-350,-350,-350,,,,,,,,,,,,,,,,,,,,,,,,,,,,,,,,,,,,,
-350,-350,-350,-350,-350,-350,-350,-350,-350,-350,-350,-350,-350,-350,-350,-350,-350,,,,,,,,,,,,,,,,,,,,,,,,,,,,,,,,,,,,,
-350,-350,-350,-350,-350,-350,-350,-350,-350,-350,-350,-350,-350,-350,-350,-350,-350,,,,,,,,,,,,,,,,,,,,,,,,,,,,,,,,,,,,,
-350,-350,-350,-350,-350,-350,-350,-350,-350,-350,-350,-350,-350,-350,-350,-350,-350,,,,,,,,,,,,,,,,,,,,,,,,,,,,,,,,,,,,,
-350,-350,-350,-350,-350,-350,-350,-350,-350,-350,-350,-350,-350,-350,-350,-350,-350,,,,,,,,,,,,,,,,,,,,,,,,,,,,,,,,,,,,,
-350,-350,-350,-350,-350,-350,-350,-350,-350,-350,-350,-350,-350,-350,-350,-350,-350,,,,,,,,,,,,,,,,,,,,,,,,,,,,,,,,,,,,,
-350,-350,-350,-350,-350,-350,-350,-350,-350,-350,-350,-350,-350,-350,-350,-350,-350,,,,,,,,,,,,,,,,,,,,,,,,,,,,,,,,,,,,,
-350,-350,-350,-350,-350,-350,-350,-350,-350,-350,-350,-350,-350,-350,-350,-350,-350,,,,,,,,,,,,,,,,,,,,,,,,,,,,,,,,,,,,,
-350,-350,-350,-350,-350,-350,-350,-350,-350,-350,-350,-350,-350,-350,-350,-350,-350,,,,,,,,,,,,,,,,,,,,,,,,,,,,,,,,,,,,,
-350,-350,-350,-350,-350,-350,-350,-350,-350,-350,-350,-350,-350,-350,-350,-350,-350,,,,,,,,,,,,,,,,,,,,,,,,,,,,,,,,,,,,,
-350,-350,-350,-350,-350,-350,-350,-350,-350,-350,-350,-350,-350,-350,-350,-350,-350,,,,,,,,,,,,,,,,,,,,,,,,,,,,,,,,,,,,,
-350,-350,-350,-350,-350,-350,-350,-350,-350,-350,-350,-350,-350,-350,-350,-350,-350,,,,,,,,,,,,,,,,,,,,,,,,,,,,,,,,,,,,,
-350,-350,-350,-350,-350,-350,-350,-350,-350,-350,-350,-350,-350,-350,-350,-350,-350,,,,,,,,,,,,,,,,,,,,,,,,,,,,,,,,,,,,,
-350,-350,-350,-350,-350,-350,-350,-350,-350,-350,-350,-350,-350,-350,-350,-350,-350,,,,,,,,,,,,,,,,,,,,,,,,,,,,,,,,,,,,,
-350,-350,-350,-350,-350,-350,-350,-350,-350,-350,-350,-350,-350,-350,-350,-350,-350,,,,,,,,,,,,,,,,,,,,,,,,,,,,,,,,,,,,,
-350,-350,-350,-350,-350,-350,-350,-350,-350,-350,-350,-350,-350,-350,-350,-350,-350,,,,,,,,,,,,,,,,,,,,,,,,,,,,,,,,,,,,,
-350,-350,-350,-350,-350,-350,-350,-350,-350,-350,-350,-350,-350,-350,-350,-350,-350,,,,,,,,,,,,,,,,,,,,,,,,,,,,,,,,,,,,,
-350,-350,-350,-350,-350,-350,-350,-350,-350,-350,-350,-350,-350,-350,-350,-350,-350,,,,,,,,,,,,,,,,,,,,,,,,,,,,,,,,,,,,,
-350,-350,-350,-350,-350,-350,-350,-350,-350,-350,-350,-350,-350,-350,-350,-350,-350,,,,,,,,,,,,,,,,,,,,,,,,,,,,,,,,,,,,,
-350,-350,-350,-350,-350,-350,-350,-350,-350,-350,-350,-350,-350,-350,-350,-350,-350,,,,,,,,,,,,,,,,,,,,,,,,,,,,,,,,,,,,,
-350,-350,-350,-350,-350,-350,-350,-350,-350,-350,-350,-350,-350,-350,-350,-350,-350,,,,,,,,,,,,,,,,,,,,,,,,,,,,,,,,,,,,,
-350,-350,-350,-350,-350,-350,-350,-350,-350,-350,-350,-350,-350,-350,-350,-350,-350,,,,,,,,,,,,,,,,,,,,,,,,,,,,,,,,,,,,,
-350,-350,-350,-350,-350,-350,-350,-350,-350,-350,-350,-350,-350,-350,-350,-350,-350,,,,,,,,,,,,,,,,,,,,,,,,,,,,,,,,,,,,,
-350,-350,-350,-350,-350,-350,-350,-350,-350,-350,-350,-350,-350,-350,-350,-350,-350,,,,,,,,,,,,,,,,,,,,,,,,,,,,,,,,,,,,,
-350,-350,-350,-350,-350,-350,-350,-350,-350,-350,-350,-350,-350,-350,-350,-350,-350,,,,,,,,,,,,,,,,,,,,,,,,,,,,,,,,,,,,,
-350,-350,-350,-350,-350,-350,-350,-350,-350,-350,-350,-350,-350,-350,-350,-350,-350,,,,,,,,,,,,,,,,,,,,,,,,,,,,,,,,,,,,,
-350,-350,-350,-350,-350,-350,-350,-350,-350,-350,-350,-350,-350,-350,-350,-350,-350,,,,,,,,,,,,,,,,,,,,,,,,,,,,,,,,,,,,,
-350,-350,-350,-350,-350,-350,-350,-350,-350,-350,-350,-350,-350,-350,-350,-350,-350,,,,,,,,,,,,,,,,,,,,,,,,,,,,,,,,,,,,,
-350,-350,-350,-350,-350,-350,-350,-350,-350,-350,-350,-350,-350,-350,-350,-350,-350,,,,,,,,,,,,,,,,,,,,,,,,,,,,,,,,,,,,,
-350,-350,-350,-350,-350,-350,-350,-350,-350,-350,-350,-350,-350,-350,-350,-350,-350,,,,,,,,,,,,,,,,,,,,,,,,,,,,,,,,,,,,,
-350,-350,-350,-350,-350,-350,-350,-350,-350,-350,-350,-350,-350,-350,-350,-350,-350,,,,,,,,,,,,,,,,,,,,,,,,,,,,,,,,,,,,,
-350,-350,-350,-350,-350,-350,-350,-350,-350,-350,-350,-350,-350,-350,-350,-350,-350,,,,,,,,,,,,,,,,,,,,,,,,,,,,,,,,,,,,,
-1500,-400,-400,-400,-400,-400,-400,-400,-400,-400,-400,-400,-400,-400,-400,-400,-1500,,,,,,,,,,,,,,,,,,,,,,,,,,,,,,,,,,,,,
#,raw_col_delta_max,,,,,,,,,,,,,,,,,,,,,,,,,,,,,,,,,,,,,,,,,,,,,,,,,,,,
1500,400,400,400,400,400,400,400,400,400,400,400,400,400,400,1500,,,,,,,,,,,,,,,,,,,,,,,,,,,,,,,,,,,,,,
350,350,350,350,350,350,400,400,400,400,350,350,350,350,350,350,,,,,,,,,,,,,,,,,,,,,,,,,,,,,,,,,,,,,,
350,350,350,350,350,350,350,350,350,350,350,350,350,350,350,350,,,,,,,,,,,,,,,,,,,,,,,,,,,,,,,,,,,,,,
350,350,350,350,350,350,350,350,350,350,350,350,350,350,350,350,,,,,,,,,,,,,,,,,,,,,,,,,,,,,,,,,,,,,,
350,350,350,350,350,350,350,350,350,350,350,350,350,350,350,350,,,,,,,,,,,,,,,,,,,,,,,,,,,,,,,,,,,,,,
350,350,350,350,350,350,350,350,350,350,350,350,350,350,350,350,,,,,,,,,,,,,,,,,,,,,,,,,,,,,,,,,,,,,,
350,350,350,350,350,350,350,350,350,350,350,350,350,350,350,350,,,,,,,,,,,,,,,,,,,,,,,,,,,,,,,,,,,,,,
350,350,350,350,350,350,350,350,350,350,350,350,350,350,350,350,,,,,,,,,,,,,,,,,,,,,,,,,,,,,,,,,,,,,,
350,350,350,350,350,350,350,350,350,350,350,350,350,350,350,350,,,,,,,,,,,,,,,,,,,,,,,,,,,,,,,,,,,,,,
350,350,350,350,350,350,350,350,350,350,350,350,350,350,350,350,,,,,,,,,,,,,,,,,,,,,,,,,,,,,,,,,,,,,,
350,350,350,350,350,350,350,350,350,350,350,350,350,350,350,350,,,,,,,,,,,,,,,,,,,,,,,,,,,,,,,,,,,,,,
350,350,350,350,350,350,350,350,350,350,350,350,350,350,350,350,,,,,,,,,,,,,,,,,,,,,,,,,,,,,,,,,,,,,,
350,350,350,350,350,350,350,350,350,350,350,350,350,350,350,350,,,,,,,,,,,,,,,,,,,,,,,,,,,,,,,,,,,,,,
350,350,350,350,350,350,350,350,350,350,350,350,350,350,350,350,,,,,,,,,,,,,,,,,,,,,,,,,,,,,,,,,,,,,,
350,350,350,350,350,350,350,350,350,350,350,350,350,350,350,350,,,,,,,,,,,,,,,,,,,,,,,,,,,,,,,,,,,,,,
350,350,350,350,350,350,350,350,350,350,350,350,350,350,350,350,,,,,,,,,,,,,,,,,,,,,,,,,,,,,,,,,,,,,,
350,350,350,350,350,350,350,350,350,350,350,350,350,350,350,350,,,,,,,,,,,,,,,,,,,,,,,,,,,,,,,,,,,,,,
350,350,350,350,350,350,350,350,350,350,350,350,350,350,350,350,,,,,,,,,,,,,,,,,,,,,,,,,,,,,,,,,,,,,,
350,350,350,350,350,350,350,350,350,350,350,350,350,350,350,350,,,,,,,,,,,,,,,,,,,,,,,,,,,,,,,,,,,,,,
350,350,350,350,350,350,350,350,350,350,350,350,350,350,350,350,,,,,,,,,,,,,,,,,,,,,,,,,,,,,,,,,,,,,,
350,350,350,350,350,350,350,350,350,350,350,350,350,350,350,350,,,,,,,,,,,,,,,,,,,,,,,,,,,,,,,,,,,,,,
350,350,350,350,350,350,350,350,350,350,350,350,350,350,350,350,,,,,,,,,,,,,,,,,,,,,,,,,,,,,,,,,,,,,,
350,350,350,350,350,350,350,350,350,350,350,350,350,350,350,350,,,,,,,,,,,,,,,,,,,,,,,,,,,,,,,,,,,,,,
350,350,350,350,350,350,350,350,350,350,350,350,350,350,350,350,,,,,,,,,,,,,,,,,,,,,,,,,,,,,,,,,,,,,,
350,350,350,350,350,350,350,350,350,350,350,350,350,350,350,350,,,,,,,,,,,,,,,,,,,,,,,,,,,,,,,,,,,,,,
350,350,350,350,350,350,350,350,350,350,350,350,350,350,350,350,,,,,,,,,,,,,,,,,,,,,,,,,,,,,,,,,,,,,,
350,350,350,350,350,350,350,350,350,350,350,350,350,350,350,350,,,,,,,,,,,,,,,,,,,,,,,,,,,,,,,,,,,,,,
350,350,350,350,350,350,350,350,350,350,350,350,350,350,350,350,,,,,,,,,,,,,,,,,,,,,,,,,,,,,,,,,,,,,,
350,350,350,350,350,350,350,350,350,350,350,350,350,350,350,350,,,,,,,,,,,,,,,,,,,,,,,,,,,,,,,,,,,,,,
350,350,350,350,350,350,350,350,350,350,350,350,350,350,350,350,,,,,,,,,,,,,,,,,,,,,,,,,,,,,,,,,,,,,,
350,350,350,350,350,350,350,350,350,350,350,350,350,350,350,350,,,,,,,,,,,,,,,,,,,,,,,,,,,,,,,,,,,,,,
350,350,350,350,350,350,350,350,350,350,350,350,350,350,350,350,,,,,,,,,,,,,,,,,,,,,,,,,,,,,,,,,,,,,,
350,350,350,350,350,350,350,350,350,350,350,350,350,350,350,350,,,,,,,,,,,,,,,,,,,,,,,,,,,,,,,,,,,,,,
350,350,350,350,350,350,350,350,350,350,350,350,350,350,350,350,,,,,,,,,,,,,,,,,,,,,,,,,,,,,,,,,,,,,,
350,350,350,350,350,350,350,350,350,350,350,350,350,350,350,350,,,,,,,,,,,,,,,,,,,,,,,,,,,,,,,,,,,,,,
350,350,350,350,350,350,350,350,350,350,350,350,350,350,350,350,,,,,,,,,,,,,,,,,,,,,,,,,,,,,,,,,,,,,,
1500,400,400,400,400,400,400,400,400,400,400,400,400,400,400,1500,,,,,,,,,,,,,,,,,,,,,,,,,,,,,,,,,,,,,,
#,raw_col_delta_min,,,,,,,,,,,,,,,,,,,,,,,,,,,,,,,,,,,,,,,,,,,,,,,,,,,,
-1500,-400,-400,-400,-400,-400,-400,-400,-400,-400,-400,-400,-400,-400,-400,-1500,,,,,,,,,,,,,,,,,,,,,,,,,,,,,,,,,,,,,,
-350,-350,-350,-350,-350,-350,-400,-400,-400,-400,-350,-350,-350,-350,-350,-350,,,,,,,,,,,,,,,,,,,,,,,,,,,,,,,,,,,,,,
-350,-350,-350,-350,-350,-350,-350,-350,-350,-350,-350,-350,-350,-350,-350,-350,,,,,,,,,,,,,,,,,,,,,,,,,,,,,,,,,,,,,,
-350,-350,-350,-350,-350,-350,-350,-350,-350,-350,-350,-350,-350,-350,-350,-350,,,,,,,,,,,,,,,,,,,,,,,,,,,,,,,,,,,,,,
-350,-350,-350,-350,-350,-350,-350,-350,-350,-350,-350,-350,-350,-350,-350,-350,,,,,,,,,,,,,,,,,,,,,,,,,,,,,,,,,,,,,,
-350,-350,-350,-350,-350,-350,-350,-350,-350,-350,-350,-350,-350,-350,-350,-350,,,,,,,,,,,,,,,,,,,,,,,,,,,,,,,,,,,,,,
-350,-350,-350,-350,-350,-350,-350,-350,-350,-350,-350,-350,-350,-350,-350,-350,,,,,,,,,,,,,,,,,,,,,,,,,,,,,,,,,,,,,,
-350,-350,-350,-350,-350,-350,-350,-350,-350,-350,-350,-350,-350,-350,-350,-350,,,,,,,,,,,,,,,,,,,,,,,,,,,,,,,,,,,,,,
-350,-350,-350,-350,-350,-350,-350,-350,-350,-350,-350,-350,-350,-350,-350,-350,,,,,,,,,,,,,,,,,,,,,,,,,,,,,,,,,,,,,,
-350,-350,-350,-350,-350,-350,-350,-350,-350,-350,-350,-350,-350,-350,-350,-350,,,,,,,,,,,,,,,,,,,,,,,,,,,,,,,,,,,,,,
-350,-350,-350,-350,-350,-350,-350,-350,-350,-350,-350,-350,-350,-350,-350,-350,,,,,,,,,,,,,,,,,,,,,,,,,,,,,,,,,,,,,,
-350,-350,-350,-350,-350,-350,-350,-350,-350,-350,-350,-350,-350,-350,-350,-350,,,,,,,,,,,,,,,,,,,,,,,,,,,,,,,,,,,,,,
-350,-350,-350,-350,-350,-350,-350,-350,-350,-350,-350,-350,-350,-350,-350,-350,,,,,,,,,,,,,,,,,,,,,,,,,,,,,,,,,,,,,,
-350,-350,-350,-350,-350,-350,-350,-350,-350,-350,-350,-350,-350,-350,-350,-350,,,,,,,,,,,,,,,,,,,,,,,,,,,,,,,,,,,,,,
-350,-350,-350,-350,-350,-350,-350,-350,-350,-350,-350,-350,-350,-350,-350,-350,,,,,,,,,,,,,,,,,,,,,,,,,,,,,,,,,,,,,,
-350,-350,-350,-350,-350,-350,-350,-350,-350,-350,-350,-350,-350,-350,-350,-350,,,,,,,,,,,,,,,,,,,,,,,,,,,,,,,,,,,,,,
-350,-350,-350,-350,-350,-350,-350,-350,-350,-350,-350,-350,-350,-350,-350,-350,,,,,,,,,,,,,,,,,,,,,,,,,,,,,,,,,,,,,,
-350,-350,-350,-350,-350,-350,-350,-350,-350,-350,-350,-350,-350,-350,-350,-350,,,,,,,,,,,,,,,,,,,,,,,,,,,,,,,,,,,,,,
-350,-350,-350,-350,-350,-350,-350,-350,-350,-350,-350,-350,-350,-350,-350,-350,,,,,,,,,,,,,,,,,,,,,,,,,,,,,,,,,,,,,,
-350,-350,-350,-350,-350,-350,-350,-350,-350,-350,-350,-350,-350,-350,-350,-350,,,,,,,,,,,,,,,,,,,,,,,,,,,,,,,,,,,,,,
-350,-350,-350,-350,-350,-350,-350,-350,-350,-350,-350,-350,-350,-350,-350,-350,,,,,,,,,,,,,,,,,,,,,,,,,,,,,,,,,,,,,,
-350,-350,-350,-350,-350,-350,-350,-350,-350,-350,-350,-350,-350,-350,-350,-350,,,,,,,,,,,,,,,,,,,,,,,,,,,,,,,,,,,,,,
-350,-350,-350,-350,-350,-350,-350,-350,-350,-350,-350,-350,-350,-350,-350,-350,,,,,,,,,,,,,,,,,,,,,,,,,,,,,,,,,,,,,,
-350,-350,-350,-350,-350,-350,-350,-350,-350,-350,-350,-350,-350,-350,-350,-350,,,,,,,,,,,,,,,,,,,,,,,,,,,,,,,,,,,,,,
-350,-350,-350,-350,-350,-350,-350,-350,-350,-350,-350,-350,-350,-350,-350,-350,,,,,,,,,,,,,,,,,,,,,,,,,,,,,,,,,,,,,,
-350,-350,-350,-350,-350,-350,-350,-350,-350,-350,-350,-350,-350,-350,-350,-350,,,,,,,,,,,,,,,,,,,,,,,,,,,,,,,,,,,,,,
-350,-350,-350,-350,-350,-350,-350,-350,-350,-350,-350,-350,-350,-350,-350,-350,,,,,,,,,,,,,,,,,,,,,,,,,,,,,,,,,,,,,,
-350,-350,-350,-350,-350,-350,-350,-350,-350,-350,-350,-350,-350,-350,-350,-350,,,,,,,,,,,,,,,,,,,,,,,,,,,,,,,,,,,,,,
-350,-350,-350,-350,-350,-350,-350,-350,-350,-350,-350,-350,-350,-350,-350,-350,,,,,,,,,,,,,,,,,,,,,,,,,,,,,,,,,,,,,,
-350,-350,-350,-350,-350,-350,-350,-350,-350,-350,-350,-350,-350,-350,-350,-350,,,,,,,,,,,,,,,,,,,,,,,,,,,,,,,,,,,,,,
-350,-350,-350,-350,-350,-350,-350,-350,-350,-350,-350,-350,-350,-350,-350,-350,,,,,,,,,,,,,,,,,,,,,,,,,,,,,,,,,,,,,,
-350,-350,-350,-350,-350,-350,-350,-350,-350,-350,-350,-350,-350,-350,-350,-350,,,,,,,,,,,,,,,,,,,,,,,,,,,,,,,,,,,,,,
-350,-350,-350,-350,-350,-350,-350,-350,-350,-350,-350,-350,-350,-350,-350,-350,,,,,,,,,,,,,,,,,,,,,,,,,,,,,,,,,,,,,,
-350,-350,-350,-350,-350,-350,-350,-350,-350,-350,-350,-350,-350,-350,-350,-350,,,,,,,,,,,,,,,,,,,,,,,,,,,,,,,,,,,,,,
-350,-350,-350,-350,-350,-350,-350,-350,-350,-350,-350,-350,-350,-350,-350,-350,,,,,,,,,,,,,,,,,,,,,,,,,,,,,,,,,,,,,,
-350,-350,-350,-350,-350,-350,-350,-350,-350,-350,-350,-350,-350,-350,-350,-350,,,,,,,,,,,,,,,,,,,,,,,,,,,,,,,,,,,,,,
-1500,-400,-400,-400,-400,-400,-400,-400,-400,-400,-400,-400,-400,-400,-400,-1500,,,,,,,,,,,,,,,,,,,,,,,,,,,,,,,,,,,,,,
,,,,,,,,,,,,,,,,,,,,,,,,,,,,,,,,,,,,,,,,,,,,,,,,,,,,,
#,line_max,,,,,,,,,,,,,,,,,,,,,,,,,,,,,,,,,,,,,,,,,,,,,,,,,,,,
47520,47409,47398,47626,47552,47428,47565,47453,47443,47734,47505,47569,47561,47406,47731,47619,47649,47391,47625,47749,47662,47475,47506,47497,47427,47402,47652,47697,47573,47286,47506,47589,47455,47383,47463,47404,47456,47711,47398,47535,47471,47567,47389,47482,47460,47506,47642,47615,47512,47629,47471,47442,47427,47640
,,,,,,,,,,,,,,,,,,,,,,,,,,,,,,,,,,,,,,,,,,,,,,,,,,,,,
#,line_min,,,,,,,,,,,,,,,,,,,,,,,,,,,,,,,,,,,,,,,,,,,,,,,,,,,,
18025,17982,17978,18065,18037,17990,18042,17999,17995,18106,18019,18043,18040,17981,18105,18062,18073,17976,18064,18112,18078,18007,18019,18016,17989,17980,18075,18092,18044,17936,18019,18051,18000,17973,18003,17981,18000,18097,17978,18030,18006,18042,17975,18010,18002,18019,18071,18061,18021,18066,18006,17995,17989,18070
