{
  "appinfo": {
    "version": "001.001",
    "picture_applist": [
      {
        "packageName": "com.ss.android.article.news",
        "activityList": [
          "com.bytedance.ugc.ugc.thumb.view.ThumbPreviewActivity",
          "com.bytedance.ugc.UgcDetailInfoActivity",
          "com.ss.android.newmedia.activity.browser.BrowserActivity"

        ]
      },
      {
        "packageName": "com.tencent.mobileqq",
        "activityList": [
          "com.tencent.mobileqq.richmediabrowser.AIOGalleryActivity",
          "com.tencent.richframework.gallery.QQGalleryActivity",
          "com.tencent.mobileqq.activity.FriendProfilePicBrowserActivity",
          "com.tencent.mobileqq.mini.appbrand.ui.AppBrandUI",
          "com.tencent.mobileqq.activity.QQBrowserActivity",
          "com.tencent.mobileqq.filebrowser.FileBrowserActivity",
          "com.qzone.reborn.layer.part.QZoneFeedXGalleryActivity"

        ]
      },
      {
        "packageName": "com.tencent.mm",
        "activityList": [
          "com.tencent.mm.pluginsdk.ui.tools.MiniQBReaderUI"
        ]
      },
      {
        "packageName": "cn.wps.moffice_eng",
        "activityList": [
          "cn.wps.moffice.writer.multiactivity.Writer1",
          "cn.wps.moffice.writer.multiactivity.Writer2",
          "cn.wps.moffice.writer.multiactivity.Writer3",
          "cn.wps.moffice.writer.multiactivity.Writer4",
          "cn.wps.moffice.writer.multiactivity.Writer5",
          "cn.wps.moffice.writer.multiactivity.Writer6",
          "cn.wps.moffice.writer.multiactivity.Writer7",
          "cn.wps.moffice.writer.multiactivity.Writer8",
          "cn.wps.moffice.writer.multiactivity.Writer9",
          "cn.wps.moffice.writer.multiactivity.Writer10",
          "cn.wps.moffice.pdf.multiactivity.PDFReader1",
          "cn.wps.moffice.pdf.multiactivity.PDFReader2",
          "cn.wps.moffice.pdf.multiactivity.PDFReader3",
          "cn.wps.moffice.pdf.multiactivity.PDFReader4",
          "cn.wps.moffice.pdf.multiactivity.PDFReader5",
          "cn.wps.moffice.pdf.multiactivity.PDFReader6",
          "cn.wps.moffice.pdf.multiactivity.PDFReader7",
          "cn.wps.moffice.pdf.multiactivity.PDFReader8",
          "cn.wps.moffice.pdf.multiactivity.PDFReader9",
          "cn.wps.moffice.pdf.multiactivity.PDFReader10",
          "cn.wps.moffice.spreadsheet.multiactivity.Spreadsheet1",
          "cn.wps.moffice.spreadsheet.multiactivity.Spreadsheet2",
          "cn.wps.moffice.spreadsheet.multiactivity.Spreadsheet3",
          "cn.wps.moffice.spreadsheet.multiactivity.Spreadsheet4",
          "cn.wps.moffice.spreadsheet.multiactivity.Spreadsheet5",
          "cn.wps.moffice.spreadsheet.multiactivity.Spreadsheet6",
          "cn.wps.moffice.spreadsheet.multiactivity.Spreadsheet7",
          "cn.wps.moffice.spreadsheet.multiactivity.Spreadsheet8",
          "cn.wps.moffice.spreadsheet.multiactivity.Spreadsheet9",
          "cn.wps.moffice.spreadsheet.multiactivity.Spreadsheet10",
          "cn.wps.moffice.presentation.multiactivity.Presentation1",
          "cn.wps.moffice.presentation.multiactivity.Presentation2",
          "cn.wps.moffice.presentation.multiactivity.Presentation3",
          "cn.wps.moffice.presentation.multiactivity.Presentation4",
          "cn.wps.moffice.presentation.multiactivity.Presentation5",
          "cn.wps.moffice.presentation.multiactivity.Presentation6",
          "cn.wps.moffice.presentation.multiactivity.Presentation7",
          "cn.wps.moffice.presentation.multiactivity.Presentation8",
          "cn.wps.moffice.presentation.multiactivity.Presentation9",
          "cn.wps.moffice.presentation.multiactivity.Presentation10"
        ]
      },
      {
        "packageName": "com.xunmeng.pinduoduo",
        "activityList": [
          "com.xunmeng.pinduoduo.activity.NewPageMaskActivity",
          "com.xunmeng.pinduoduo.goods.gallery.GoodsDetailGalleryActivity"
        ]
      },
      {
        "packageName": "com.eg.android.AlipayGphone",
        "activityList": ["com.alipay.mobile.beehive.photo.ui.PhotoPreviewActivity"]
      },
      {
        "packageName": "com.sina.weibo",
        "activityList": ["com.sina.weibo.photoalbum.imageviewer.ImageViewer"]
      },
      {
        "packageName": "com.hihonor.hnoffice",
        "activityList": [
          "com.yozo.pdf.multiprocess.PDFPhoneActivity0",
          "com.yozo.pdf.multiprocess.PDFPhoneActivity1",
          "com.yozo.pdf.multiprocess.PDFPhoneActivity2",
          "com.yozo.pdf.multiprocess.PDFPhoneActivity3",
          "com.yozo.pdf.multiprocess.PDFPhoneActivity4",
          "com.yozo.pdf.multiprocess.PDFPhoneActivity5",
          "com.yozo.pdf.multiprocess.PDFPhoneActivity6",
          "com.yozo.pdf.multiprocess.PDFPhoneActivity7",
          "com.yozo.pdf.multiprocess.PDFPhoneActivity8",
          "com.yozo.pdf.multiprocess.PDFPhoneActivity9",
          "com.yozo.multiprocess.AppFrameActivity_WP0",
          "com.yozo.multiprocess.AppFrameActivity_WP1",
          "com.yozo.multiprocess.AppFrameActivity_WP2",
          "com.yozo.multiprocess.AppFrameActivity_WP3",
          "com.yozo.multiprocess.AppFrameActivity_WP4",
          "com.yozo.multiprocess.AppFrameActivity_WP5",
          "com.yozo.multiprocess.AppFrameActivity_WP6",
          "com.yozo.multiprocess.AppFrameActivity_WP7",
          "com.yozo.multiprocess.AppFrameActivity_WP8",
          "com.yozo.multiprocess.AppFrameActivity_WP9",
          "com.yozo.multiprocess.AppFrameActivity_PG0",
          "com.yozo.multiprocess.AppFrameActivity_PG1",
          "com.yozo.multiprocess.AppFrameActivity_PG2",
          "com.yozo.multiprocess.AppFrameActivity_PG3",
          "com.yozo.multiprocess.AppFrameActivity_PG4",
          "com.yozo.multiprocess.AppFrameActivity_PG5",
          "com.yozo.multiprocess.AppFrameActivity_PG6",
          "com.yozo.multiprocess.AppFrameActivity_PG7",
          "com.yozo.multiprocess.AppFrameActivity_PG8",
          "com.yozo.multiprocess.AppFrameActivity_PG9",
          "com.yozo.multiprocess.AppFrameActivity_SS0",
          "com.yozo.multiprocess.AppFrameActivity_SS1",
          "com.yozo.multiprocess.AppFrameActivity_SS2",
          "com.yozo.multiprocess.AppFrameActivity_SS3",
          "com.yozo.multiprocess.AppFrameActivity_SS4",
          "com.yozo.multiprocess.AppFrameActivity_SS5",
          "com.yozo.multiprocess.AppFrameActivity_SS6",
          "com.yozo.multiprocess.AppFrameActivity_SS7",
          "com.yozo.multiprocess.AppFrameActivity_SS8",
          "com.yozo.multiprocess.AppFrameActivity_SS9",
          "com.yozo.multiprocess.TxtPhoneActivity0",
          "com.yozo.multiprocess.TxtPhoneActivity1",
          "com.yozo.multiprocess.TxtPhoneActivity2",
          "com.yozo.multiprocess.TxtPhoneActivity3",
          "com.yozo.multiprocess.TxtPhoneActivity4",
          "com.yozo.multiprocess.TxtPhoneActivity5",
          "com.yozo.multiprocess.TxtPhoneActivity6",
          "com.yozo.multiprocess.TxtPhoneActivity7",
          "com.yozo.multiprocess.TxtPhoneActivity8",
          "com.yozo.multiprocess.TxtPhoneActivity9"
        ]
      },
      {
        "packageName": "com.alibaba.android.rimet",
        "activityList": ["com.alibaba.lightapp.runtime.activity.CommonWebViewActivitySwipe"]
      },
      {
        "packageName": "com.tencent.news",
        "activityList": ["com.tencent.news.ui.imagedetail.GalleryDetailPreViewActivity"]
      },
      {
        "packageName": "com.ss.android.article.lite",
        "activityList": ["com.ss.android.article.common.ThumbPreviewActivity"]
      },
      {
        "packageName": "com.xingin.xhs",
        "activityList": ["com.xingin.alioth.pages.preview.activity.PicAndVideoPreviewPageActivity"]
      },
      {
        "packageName": "com.baidu.homework",
        "activityList": [
          "com.baidu.homework.activity.live.lesson.teachermsg.ImagePreviewActivity",
          "com.baidu.homework.common.photo.PhotoShowActivity"
        ]
      },
      {
        "packageName": "com.tencent.androidqqmail",
        "activityList": [
          "com.tencent.qqmail.xmbook.business.article.ArticleImageGalleryActivity"
        ]
      },
      {
        "packageName": "com.immomo.momo",
        "activityList": ["com.immomo.momo.imagefactory.imageborwser.impls.ImageBrowserActivity"]
      },
      {
        "packageName": "com.zhihu.android",
        "activityList": ["com.zhihu.android.picture.activity.ImagesViewerActivity"]
      },
      {
        "packageName": "com.netease.newsreader.activity",
        "activityList": [
          "com.netease.newsreader.picset.preview.router.PicActivity",
          "com.netease.newsreader.common.base.activity.TransparentActivity"
        ]
      },
      {
        "packageName": "com.sina.news",
        "activityList": [
          "com.sina.news.modules.misc.imageviewer.activity.NewsPictureActivity",
          "com.sina.news.modules.article.picture.activity.PictureContentActivity"
        ]
      },
      {
        "packageName": "com.sohu.newsclient",
        "activityList": ["com.sohu.newsclient.photos.activity.PicBrowseActivity"]
      },
      {
        "packageName": "com.intsig.camscanner",
        "activityList": [
          "com.intsig.camscanner.ImagePageViewActivity",
        ]
      },
      {
        "packageName": "com.ifeng.news2",
        "activityList": ["com.ifeng.news2.activity.DetailPopupLightbox"]
      },
      {
        "packageName": "com.baidu.tieba",
        "activityList": ["com.baidu.tieba.image.ImageViewerActivity"]
      },
      {
        "packageName": "com.youdao.dict",
        "activityList": [
          "cc.shinichi.library.MultiPicPreviewActivity",
          "com.youdao.webtrans.ui.tab.WebTransActivity",
          "com.youdao.dict.activity.youzan.StoreActivity",
          "com.youdao.dict.activity.YDWebActivity"
        ]
      },
      {
        "packageName": "cn.xuexi.android",
        "activityList": ["com.alibaba.android.uc.base.navi.window2.Window2Activity"]
      },
      {
        "packageName": "com.jifen.qukan",
        "activityList": ["com.jifen.qukan.content.imagenews.ImagePagersActivity"]
      },
      {
        "packageName": "com.fenbi.android.solar",
        "activityList": [
          "com.fenbi.android.solar.common.activity.ImagePreviewActivity",
          "com.fenbi.tutorinternal.activity.GroupNotePreviewShareActivity"
        ]
      },
      {
        "packageName": "com.jzzs.ParentsHelper",
        "activityList": ["com.jzzs.ParentsHelper.ui.webView.BaseWebViewActivity"]
      },
      {
        "packageName": "com.kuaikan.comic",
        "activityList": [
          "com.kuaikan.comic.ui.photo.preview.ImagePreviewActivity",
          "com.kuaikan.client.library.kkpage.ui.activity.KKHybridActivity"
        ]
      },
      {
        "packageName": "com.qq.reader",
        "activityList": ["com.qq.reader.common.imagepicker.activity.ImagePreviewSaveActivity"]
      },
      {
        "packageName": "com.dragon.read",
        "activityList": ["com.dragon.read.pages.preview.normal.NormalPreviewImageActivity"]
      },
      {
        "packageName": "bubei.tingshu",
        "activityList": ["bubei.tingshu.listen.book.detail.activity.DetailPicActivity"]
      },
      {
        "packageName": "com.netease.mail",
        "activityList": ["com.netease.mobimail.module.viewattachment.ViewAttachmentActivity"]
      },
      {
        "packageName": "com.tianyancha.skyeye",
        "activityList": [
          "com.tianyancha.preview.activity.ShowPreviewPhoto",
          "com.tianyancha.skyeye.activity.PenetrateMapChildActivity"
        ]
      },
      {
        "packageName": "com.lanjingren.ivwen",
        "activityList": [
          "com.lanjingren.ivwen.editor.BrowseOtherActivity",
          "com.lanjingren.ivwen.home.discussion.DiscussionActivity",
          "com.lanjingren.ivwen.ui.MainTabActivity"
        ]
      },
      {
        "packageName": "com.jiongji.andriod.card",
        "activityList": ["com.baicizhan.client.business.webview.ui.BczWebActivity"]
      },
      {
        "packageName": "com.p1.mobile.putong",
        "activityList": ["com.p1.mobile.putong.feed.newui.preview.act.PhotoAlbumFeedPreviewAct"]
      },
      {
        "packageName": "com.tencent.qt.qtl",
        "activityList": [
          "com.tencent.ugc.imagepreview.ImagePreviewActivity",
          "com.tencent.qt.qtl.activity.ugc.base.UgcImageWatchActivity"
        ]
      },
      {
        "packageName": "com.qzone",
        "activityList": ["com.qzonex.module.photo.ui.QZonePictureViewer"]
      },
      {
        "packageName": "com.qidian.QDReader",
        "activityList": ["com.qidian.QDReader.ui.activity.QDRoleImageGalleryActivity"]
      },
      {
        "packageName": "com.gstarmc.android",
        "activityList": [
          "com.stone.app.ui.activity.PDFShowActivity",
          "com.stone.app.ui.activity.CADFilesActivity",
          "com.stone.app.ui.activity.CADFiles3DActivity"
        ]
      },
      {
        "packageName": "com.hpbr.bosszhipin",
        "activityList": [
          "com.hpbr.bosszhipin.company.module.media.activity.BossComMediaPreviewActivity",
          "com.hpbr.bosszhipin.module.imageviewer.ImagePreviewActivity",
          "com.hpbr.bosszhipin.module.webview.WebViewActivity"
        ]
      },
      {
        "packageName": "com.zhaopin.social",
        "activityList": [
          "com.zhaopin.social.flutter.activity.TransparencyPageActivity",
          "com.zhaopin.social.company.detail.view.videopicture.VideoPictureMixedActivity"
        ]
      },
      {
        "packageName": "cn.xiaochuankeji.tieba",
        "activityList": ["cn.xiaochuankeji.tieba.media.browse.MediaActivity"]
      }
      ,
      {
        "packageName": "com.baidu.baidutranslate",
        "activityList": ["com.baidu.baidutranslate.common.base.ioc.IOCFragmentActivity"]
      },
      {
        "packageName": "com.android.icredit",
        "activityList": [
          "com.android.icredit.ui.moments.ImageGalleryActivity",
          "com.android.icredit.ui.CommonWebActivity"
        ]
      },
      {
        "packageName": "com.baidu.wenku",
        "activityList": [
          "com.baidu.wenku.ppt.view.activity.ImageReaderActivity",
          "com.baidu.bdlayout.ui.BDBookActivity"
        ]
      },
      {
        "packageName": "com.job.android",
        "activityList": [
          "com.job.android.pages.company.CompanyDetailActivity",
          "com.jobs.picture.ui.preview.PreviewPhotoActivity"
        ]
      },
      {
        "packageName": "com.chaoxing.mobile",
        "activityList": [
          "com.chaoxing.mobile.group.ui.TopicImageViewerActivity",
          "com.chaoxing.mobile.clouddisk.ui.CloudPreviewActivity",
          "com.chaoxing.mobile.webapp.ui.WebAppCommonViewer",
          "com.chaoxing.mobile.group.ui.UserAvatarViewerActivity"
        ]
      },
      {
        "packageName": "com.tencent.qqsports",
        "activityList": [
          "com.tencent.qqsports.photo.viewer.PhotoViewerActivity",
          "com.tencent.qqsports.bbs.account.AccountPhotoActivity"
        ]
      },
      {
        "packageName": "com.douban.frodo",
        "activityList": [
          "com.douban.frodo.baseproject.image.ImageActivity",
          "com.douban.frodo.baseproject.image.SociableImageActivity"
        ]
      },
      {
        "packageName": "com.glodon.drawingexplorer",
        "activityList": ["com.glodon.drawingexplorer.MainActivity"]
      },
      {
        "packageName": "me.yidui",
        "activityList": [
          "com.yidui.ui.picture_viewer.BigPictureActivity",
          "com.yidui.business.moment.ui.activity.MomentPreviewActivity",
          "com.yidui.ui.message.MessageUI"
        ]
      },
      {
        "packageName": "com.zenmen.palmchat",
        "activityList": [
          "com.zenmen.palmchat.activity.photoview.PhotoViewActivity",
          "com.zenmen.square.MediaViewActivity",
          "com.zenmen.palmchat.chat.ChatterActivity",
          "com.zenmen.square.MediaViewActivity"
        ]
      },
      {
        "packageName": "fm.qingting.qtradio",
        "activityList": ["fm.qingting.qtradio.QTRadioActivity"]
      },
      {
        "packageName": "com.qq.ac.android",
        "activityList": [
          "com.qq.ac.android.community.gallery.GalleryActivity",
          "com.qq.ac.android.view.activity.YouzanActivity",
          "com.qq.ac.android.view.activity.ComicFastReadActivity"
        ]
      },
      {
        "packageName": "com.chaozh.iReaderFree",
        "activityList": ["com.zhangyue.iReader.ui.activity.ActivityContainer"]
      },
      {
        "packageName": "com.hupu.games",
        "activityList": [
          "com.hupu.android.bbs.picture.BBSPictureViewActivity",
          "com.hupu.user.ui.PersonalAvatarActivity"
        ]
      },
      {
        "packageName": "com.ishowedu.peiyin",
        "activityList": [
          "refactor.common.pictureView.FZPictureViewActivity",
          "refactor.business.me.activity.AlbumPictureViewActivity"
        ]
      },
      {
        "packageName": "com.xtuone.android.syllabus",
        "activityList": [
          "com.xtuone.android.friday.ImagesDisplayActivity",
          "com.xtuone.android.friday.PaperChatActivity"
        ]
      },
      {
        "packageName": "com.netease.mobimail",
        "activityList": ["com.netease.mobimail.module.viewattachment.ViewAttachmentActivity"]
      },
      {
        "packageName": "cn.soulapp.android",
        "activityList": [
          "cn.soulapp.android.component.square.immerse.BrowseActivity",
          "cn.soulapp.android.component.square.imgpreview.CommonImgPreActivity",
          "cn.soulapp.android.component.chat.ConversationActivity"
        ]
      },
      {
        "packageName": "com.tencent.weread",
        "activityList": [
          "com.tencent.weread.photo.ReaderPhotoViewerActivity",
          "com.tencent.weread.photo.WRPhotoViewerActivity"
        ]
      },
      {
        "packageName": "com.ganji.android",
        "activityList": [
          "com.wuba.tradeline.detail.activity.BigImageActivity",
          "com.wuba.job.im.activity.JobIMActivity"
        ]
      },
      {
        "packageName": "com.zhenai.android",
        "activityList": [
          "com.zhenai.business.media.view.activity.MediaPreviewActivity",
          "com.zhenai.moments.media.view.activity.MomentsMediaPreviewActivity"
        ]
      },
      {
        "packageName": "com.kingsoft",
        "activityList": ["com.kingsoft.MessageDetailActivity"]
      },
      {
        "packageName": "com.seebaby",
        "activityList": [
          "com.seebaby.parent.web.ui.activity.DSBridgeWebApiActivity",
          "com.seebaby.school.ui.activity.PreviewAlbumImageActivity"
        ]
      },
      {
        "packageName": "cn.cj.pe",
        "activityList": [
          "me.iwf.photopicker.PhotoPagerActivity",
          "cn.cj.pe.activity.PhotoBrowserActivity",
          "cn.cj.pe.attachment.DisplayAttachmentActivity",
          "com.chinamobile.mcloud.community.activity.CloudSdkZoomActivity"
        ]
      },
      {
        "packageName": "com.taou.maimai",
        "activityList": [
          "com.taou.maimai.feed.explore.extra.preview.view.ImagePreviewActivity",
          "com.taou.maimai.im.ui.MessageBoxActivity",
          "com.taou.maimai.im.ui.MessageBoxActivity"
        ]
      },
      {
        "packageName": "com.lofter.android",
        "activityList": [
          "com.lofter.android.business.PhotoBrowser.PhotoViewNewActivity",
          "com.lofter.android.business.PersonDetail.page.BigAvatorActivity",
          "com.lofter.android.global.advertise.H5Activity"
        ]
      },
      {
        "packageName": "com.peopledailychina.activity",
        "activityList": [
          "com.peopledailychina.activity.activity.ImageActivity",
          "com.peopledailychina.activity.activity.paper.PaperActivity"
        ]
      },
      {
        "packageName": "com.lietou.mishu",
        "activityList": [
          "com.photopicker.PhotoPagerActivity",
          "com.liepin.apply.activity.ShowImagActivity"
        ]
      },
      {
        "packageName": "com.pplive.androidphone.sport",
        "activityList": [
          "com.suning.infoa.info_detail.activity.InfoWithPictureActivity",
          "com.suning.sports.modulepublic.flutter.SPTFlutterBoostActivity"
        ]
      },
      {
        "packageName": "com.yangcong345.android.phone",
        "activityList": ["com.yangcong345.webpage.BaseBridgeWebViewV2Activity"]
      },
      {
        "packageName": "com.ophone.reader.ui",
        "activityList": ["com.cmread.discover.activity.DiscoverFullScreenImageViewerActivity"]
      },
      {
        "packageName": "com.jjwxc.reader",
        "activityList": ["com.example.jinjiangshucheng.ui.Novel_Detail_Act"]
      },
      {
        "packageName": "com.luojilab.player",
        "activityList": [
          "com.luojilab.component.web.ddfe.webpackagecontainer.WebPackageContainerActivity",
          "com.luojilab.business.HomeTabActivity"
        ]
      },
      {
        "packageName": "com.tencent.tim",
        "activityList": [
          "com.tencent.mobileqq.richmediabrowser.AIOGalleryActivity",
          "com.tencent.mobileqq.mini.appbrand.ui.AppBrandUI"
        ]
      },
      {
        "packageName": "com.meta.box",
        "activityList": ["flc.ast.activity.WallpaperDetailsActivity"]
      },
      {
        "packageName": "com.chinamobile.mcloud",
        "activityList": [
          "com.chinamobile.mcloud.client.ui.store.ImageBrowserActivity",
          "com.chinamobile.mcloud.client.ui.wps.WpsPreviewActivity"
        ]
      },
      {
        "packageName": "com.netease.gl",
        "activityList": [
          "com.netease.gl.compfeed.feed.imagerviewer.page.FeedImageViewerActivity",
          "com.netease.gl.compfeed.home.activity.HeadImageActivity",
          "com.netease.gl.servicemedia.media.imagepicker.ui.SimpleRemoteImagePreviewActivity",
          "com.netease.gl.ui.activity.welcome.WelcomeActivity"
        ]
      },
      {
        "packageName": "cn.com.sina.finance",
        "activityList": [
          "cn.com.sina.finance.pic.ui.ImageBrowseActivity",
          "cn.com.sina.finance.article.ui.ShareWebBrowser"
        ]
      },
      {
        "packageName": "com.nice.main",
        "activityList": [
          "com.nice.main.views.preview.SkuImagePreviewActivity",
          "com.nice.main.shop.detail.ShopSkuDetailActivity",
          "com.nice.main.shop.secondhandbuy.SHDetailActivity_",
          "com.nice.main.activities.ProfileActivityV2_"
        ]
      },
      {
        "packageName": "com.yunxiao.haofenshu",
        "activityList": [
          "com.yunxiao.hfs.h5.WebViewActivity",
          "com.yunxiao.hfs.h6.WebViewActivity"
        ]
      },
      {
        "packageName": "com.sankuai.meituan",
        "activityList": ["com.meituan.android.mrn.container.MRNBaseActivity"]
      },
      {
        "packageName": "com.dianping.v1",
        "activityList": [
          "com.dianping.food.dealdetailv2.FoodShopLargePhotoActivity",
          "com.dianping.recommenddish.preview.RecommendPreviewActivity"
        ]
      },
      {
        "packageName": "ctrip.android.view",
        "activityList": ["ctrip.android.hotel.detail.image.HotelPhotoViewActivity"]
      }
    ]
  }
}