{
    "CameraConfig":[
         {
            "cameraId": 1,
            "enable":true,
            "shake_threshold":0.26,
             "shaking_highlight_threshold":0.04,
             "human_exp_threshold":0.005
         },
         {
            "cameraId": 8,
            "enable":true,
            "shake_threshold":0.26,
             "shaking_highlight_threshold":0.04,
             "human_exp_threshold":0.005
         },
         {
            "cameraId": 16,
            "enable":true,
            "shake_threshold":0.28,
             "shaking_highlight_threshold":0.04,
             "human_exp_threshold":0.005
         },
         {
            "cameraId": 32,
            "enable":true,
            "shake_threshold":0.26,
             "shaking_highlight_threshold":0.04,
             "human_exp_threshold":0.005
         },
         {
            "cameraId": 64,
            "enable":true,
            "shake_threshold":0.26,
             "shaking_highlight_threshold":0.04,
             "human_exp_threshold":0.005
         }
       ]
}