{
  "beat": [
    0,160,448,640,864,1216,1408,1568,1856,2016,2304,2592,2848,3040,3200,3456,3616,3776,4000,4288,4448,4608,4768,5024,5280,5440,5632,5792,6016,6240,6624,6784,6944,7104,7296,7488,7648,7808,7968,8160,8416,8832,9024,9312,9472,9664,9824,10112,10272,10464,10688,10912,11136,11328,11552,11712,12000,12192,12384,12608,12864,13024,13248,13472,13632,13952,14112,14272,14528,14816,14976,15168,15328,15488,15680,15872,16063,16224,16416,16640,16832,16992,17216,17376,17600,17824,18016,18272,18432,18592,18752,18944,19104,19328,19552,19840,20128,20320,20512,20672,20864,21024,21184,21376,21696,21856,22016,22208,22400,22688,22880,23104,23296,23488,23712,23872,24032,24224,24448,24608,24768,25056,25248,25568,25792,25984,26176,26400,26560,26720,26912,27104,27296,27456,27616,27808,28160,28416,28576,29120,30038
    ],
  "beat_count": 141,
  "downbeat": [
    0,
    864,
    3040,
    5632,
    7488,
    9472,
    12864,
    15168,
    16640,
    19104,
    20512,
    23104,
    24032,
    26560,
    29952,
    30038
    ],
  "downbeat_count": 16
}