{
    "beta": 0.1,
    "mouth": 0.2,
    "eye": 0.2,
    "eyebrow":0.6,
    "blend_weight_border": 0.65,
    "smoothness": 1.0,
    "blend_weight_mouth": 1.0,
    "blend_weight_eye": 1.0,
    "blend_weight_eyebrow": 1.0,
    "blend_weight_face": 1.0,
    "quality_level":0,
    "iso_thres": 3600,
    "extend":"L2clJyM/PTEtcHhzL2clJyM/PTEtDTY7JiAncHhzD3R6YG5zZWttfmJgenxhfmJienZhfmJienx4cnF9ZnB4cnN9YWl0Y2xqeGVnfHMOKTg="
}
