{
	"beta": 0.1,
	"mouth": 0.4,
	"eye": 1.0,
	"eyebrow": 1.0,
	"blend_weight_border": 0.1,
	"smoothness": 1.0,
	"blend_weight_eyebrow": 0.7,
	"blend_weight_eye": 1.0,
	"blend_weight_mouth": 0.7,
	"blend_weight_face": 0.9,
	"quality_level": 0,
	"iso_thres": 3600,
	"extend":"L2c8NiEhOzV2aGIodi0wMTA8JBoxPCMxOCB2aGJjKTg="
}
