{
    "imports" : [
        "/system_ext/lib64/libhwfilter_mtk.so"
    ],

    "filters" :
    [
        {
            "id" : "ppsource",
            "type" : "ppsource",
            "captureTotal" : 8
        },

        {
            "id" : "encoder",
            "type" : "mtk_filter_jpeg"
        },

        {
            "id" : "writer",
            "type" : "filewriter"
        },

        {
            "id" : "STHDR",
            "type" : "STHDR"
        },

        {
            "id" : "ColorEffectCap",
            "type" : "ColorEffectCap",
            "platform" : "mtk"
        },

        {
            "id" : "WatermarkV2",
            "type" : "WatermarkV2"
        },

        {
            "id" : "thumbnail",
            "type" : "quickthumbnail"
        },

        {
            "id" : "notifier",
            "type" : "thumbnail-notifier"
        },

        {
            "id" : "peek",
            "type" : "peek"
        },

        {
            "id" : "PpAlgo",
            "type" : "PpAlgoFilter"
        },

        {
            "id" : "UndisPp",
            "type" : "UndistortPp"
        },

        {
            "id" : "peekMeta",
            "type" : "peek"
        },

        {
            "id" : "HwExifPp",
            "type" : "HwExifPp"
        },
        {
            "id" : "HwGatherPp",
            "type" : "HwGatherPp",
            "jsonname" : "pipeline4yuvsrcap"
        }
    ],

    "connections" :
    [
        {
            "from" :
            {
                "filter" : "ppsource",
                "port" : "out0"
            },

            "to" :
            {
                "filter" : "HwGatherPp",
                "port" : "inMain"
            }
        },

        {
            "from" :
            {
                "filter" : "HwGatherPp",
                "port" : "OutDestyuv"
            },

            "to" :
            {
                "filter" : "STHDR",
                "port" : "inMain"
            }
        },

        {
            "from" :
            {
                "filter" : "STHDR",
                "port" : "OutDestyuv"
            },

            "to" :
            {
                "filter" : "ColorEffectCap",
                "port" : "inMain"
            }
        },
        {
            "from" :
            {
                "filter" : "ColorEffectCap",
                "port" : "OutDestyuv"
            },
            "to" :
            {
                "filter" : "UndisPp",
                "port" : "inMain"
            }
        },

        {
           "from" :
            {
                "filter" : "UndisPp",
                "port" : "OutDestyuv"
            },


            "to" :
            {
                "filter" : "WatermarkV2",
                "port" : "inMain"
            }
        },

        {
            "from" :
            {
                "filter" : "WatermarkV2",
                "port" : "OutDestyuv"
            },
            "to" :
            {
                "filter" : "HwExifPp",
                "port" : "inMain"
            }
        },

       {
            "from" :
            {
                "filter" : "HwExifPp",
                "port" : "OutDestyuv"
            },
            "to" :
            {
                "filter" : "encoder",
                "port" : "inMain"
            }
        },

        {
            "from" :
            {
                "filter" : "encoder",
                "port" : "jpeg"
            },

            "to" :
            {
                "filter" : "writer",
                "port" : "in"
            }
        },

        {
            "from" :
            {
                "filter" : "STHDR",
                "port" : "OutQuickThumbnailyuv"
            },

            "to" :
            {
                "filter" : "thumbnail",
                "port" : "inMain"
            }
        },

        {
            "from" :
            {
                "filter" : "thumbnail",
                "port" : "outThumbnail"
            },

            "to" :
            {
                "filter" : "notifier",
                "port" : "in"
            }
        },

        {
            "from" :
            {
                "filter" : "ppsource",
                "port" : "out_meta"
            },

            "to" :
            {
                "filter" : "peekMeta",
                "port" : "in"
            }
    },
    {
        "from" :
            {
                "filter" : "peekMeta",
                "port" : "out"
            },

            "to" :
            {
                "filter" : "HwGatherPp",
                "port" : "inMeta"
            }
        },
        {
            "from" :
            {
                "filter" : "HwGatherPp",
                "port" : "OutMeta"
            },

            "to" :
            {
                "filter" : "STHDR",
                "port" : "inMeta"
            }
        },

        {
            "from" :
            {
                "filter" : "STHDR",
                "port" : "OutMeta"
            },

            "to" :
            {
                "filter" : "ColorEffectCap",
                "port" : "inMeta"
            }
        },

        {
            "from" :
            {
                "filter" : "ColorEffectCap",
                "port" : "OutMeta"
            },

            "to" :
            {
                "filter" : "UndisPp",
                "port" : "inMeta"
            }
        },

        {
            "from" :
            {
                "filter" : "UndisPp",
                "port" : "OutMeta"
            },

            "to" :
            {
                "filter" : "WatermarkV2",
                "port" : "inMeta"
            }
        },

        {
            "from" :
            {
                "filter" : "WatermarkV2",
                "port" : "OutMeta"
            },
            "to" :
            {
                "filter" : "HwExifPp",
                "port" : "inMeta"
            }
        },

        {
            "from" :
            {
                "filter" : "HwExifPp",
                "port" : "OutMeta"
            },
           "to" :
           {
                "filter" : "encoder",
                "port" : "inMeta"
           }
        },
    {
            "from" :
            {
                "filter" : "peekMeta",
                "port" : "peek0"
            },

            "to" :
            {
                "filter" : "thumbnail",
                "port" : "inMeta"
            }
        }
    ]
}

