﻿{
  "type": "soothing",
  "duration": 20000,
  "name": "Sunny-20",
  "id": "Soothing_20_1",
  "separationStep": 1120,
  "separationMinDuration": 5000,
  "separationMaxDuration": 10000,
  "transitions": [
    {
      "name": "叠化",
      "priority": 50,
      "pickCondition": -1,
      "horizon": true,
      "vertical": true
    },
    {
      "name": "模糊",
      "priority": 0,
      "pickCondition": -1,
      "horizon": true,
      "vertical": true
    },
    {
      "name": "融化",
      "priority": 0,
      "pickCondition": -1,
      "horizon": true,
      "vertical": true
    },
    {
      "name": "上移",
      "priority": 90,
      "pickCondition": -1,
      "horizon": true,
      "vertical": true
    },
    {
      "name": "下移",
      "priority": 90,
      "pickCondition": 2,
      "horizon": true,
      "vertical": true
    },
    {
      "name": "左移",
      "priority": 90,
      "pickCondition": -1,
      "horizon": true,
      "vertical": true
    },
    {
      "name": "右移",
      "priority": 90,
      "pickCondition": -1,
      "horizon": true,
      "vertical": true
    },
    {
      "name": "黑场",
      "priority": 90,
      "pickCondition": 1,
      "horizon": true,
      "vertical": true
    },
    {
      "name": "白场",
      "priority": 90,
      "pickCondition": -1,
      "horizon": true,
      "vertical": true
    },
    {
      "name": "放大",
      "priority": 50,
      "pickCondition": -1,
      "horizon": true,
      "vertical": true
    },
    {
      "name": "缩小",
      "priority": 50,
      "pickCondition": -1,
      "horizon": true,
      "vertical": true
    },
    {
      "name": "旋转",
      "priority": 30,
      "pickCondition": -1,
      "horizon": true,
      "vertical": true
    }
  ],
  "transitionMaxCount": 3,
  "filterId": "filter_res_01",
  "filterStrength": 0.4,
  "sticker": {
    "id": "run2",
    "scaleHorizon": 0.15,
    "scaleVertical": 0.35,
    "locationHorizonX": 10,
    "locationHorizonY": -2,
    "locationVerticalX": 0.8,
    "locationVerticalY": -1.1,
    "beginTime": 0
  },
  "borderId": "null",
  "specialEffect": [
    {
      "effectId": "golden",
      "effectStart": 0
    },
    {
      "effectId": "romantic_heart",
      "effectStart": -1
    },
    {
      "effectId": "blingbling",
      "effectStart": -1
    }
  ],
  "tail": "honor_vlog"
}