{
    "imports" : [
        "/system_ext/lib64/libhwfilter_mtk.so"
    ],

    "filters" :
    [
        {
            "id" : "ppsource",
            "type" : "ppsource",
            "captureTotal" : 1,
            "captureTotalSlave" : 1
        },


        {
            "id" : "jpeg",
            "type" : "mtk_filter_jpeg"
        },

        {
            "id" : "writer",
            "type" : "filewriter"
        },

        {
            "id" : "thumbnail",
            "type" : "quickthumbnail"
        },

        {
            "id" : "notifier",
            "type" : "thumbnail-notifier"
        },

        {
            "id" : "peekMeta",
            "type" : "peek"
        },

        {
            "id" : "ArcBokehPp",
            "type" : "ArcBokehPp",
            "captureTotal" : 1,
            "captureTotalSlave" : 1
        },

        {
            "id" : "HwBeautyPp",
            "type" : "HwBeautyPp"
        },

        {
            "id" : "SuperResolution",
            "type" : "SuperResolution"
        },

        {
            "id" : "Davinci",
            "type" : "Davinci"
        },

        {
            "id" : "HwFaceSR",
            "type" : "HwFaceSR"
        },

        {
            "id" : "WatermarkV2",
            "type" : "WatermarkV2"
        },
        {
            "id" : "HwExifPp",
            "type" : "HwExifPp"
        },
        {
            "id" : "HwGatherPp",
            "type" : "HwGatherPp",
            "jsonname" : "pipeline4portraitbokehNormal"
        }
    ],

    "connections" :
    [
        {
            "from" :
            {
                "filter" : "ppsource",
                "port" : "out0"
            },

            "to" :
            {
                "filter" : "HwGatherPp",
                "port" : "inMain"
            }
        },

        {
            "from" :
            {
                "filter" : "HwGatherPp",
                "port" : "OutDestyuv"
            },

            "to" :
            {
                "filter" : "ArcBokehPp",
                "port" : "inMain"
            }
        },

        {
            "from" :
            {
                "filter" : "ppsource",
                "port" : "out1"
            },

            "to" :
            {
                "filter" : "ArcBokehPp",
                "port" : "inSecond"
            }
        },

        {
            "from" :
            {
                "filter" : "ppsource",
                "port" : "out_meta"
            },

            "to" :
            {
                "filter" : "peekMeta",
                "port" : "in"
            }
        },

        {
            "from" :
            {
                "filter" : "ArcBokehPp",
                "port" : "OutDestyuv"
            },

            "to" :
            {
                "filter" : "SuperResolution",
                "port" : "inMain"
            }
        },

        {
            "from" :
            {
                "filter" : "SuperResolution",
                "port" : "OutDestyuv"
            },

            "to" :
            {
                "filter" : "HwFaceSR",
                "port" : "inMain"
            }
        },

        {
            "from" :
            {
                "filter" : "HwFaceSR",
                "port" : "OutDestyuv"
            },

            "to" :
            {
                "filter" : "HwBeautyPp",
                "port" : "inMain"
            }
        },

        {
            "from" :
            {
                "filter" : "HwBeautyPp",
                "port" : "OutDestyuv"
            },

            "to" :
            {
                "filter" : "Davinci",
                "port" : "inMain"
            }
        },

        {
            "from" :
            {
                "filter" : "Davinci",
                "port" : "OutDestyuv"
            },

            "to" :
            {
                "filter" : "WatermarkV2",
                "port" : "inMain"
            }
        },

        {
            "from" :
            {
                "filter" : "ArcBokehPp",
                "port" : "OutQuickThumbnailYuv"
            },

            "to" :
            {
                "filter" : "thumbnail",
                "port" : "inMain"
            }
        },

        {
            "from" :
            {
                "filter" : "WatermarkV2",
                "port" : "OutDestyuv"
            },

            "to" :
            {
                "filter" : "HwExifPp",
                "port" : "inMain"
            }
        },
       {
            "from" :
            {
                "filter" : "HwExifPp",
                "port" : "OutDestyuv"
            },

            "to" :
            {
                "filter" : "jpeg",
                "port" : "inMain"
            }
        },

        {
            "from" :
            {
                "filter" : "peekMeta",
                "port" : "out"
            },

            "to" :
            {
                "filter" : "HwGatherPp",
                "port" : "inMeta"
            }
        },
        {
            "from" :
            {
                "filter" : "HwGatherPp",
                "port" : "OutMeta"
            },

            "to" :
            {
                "filter" : "ArcBokehPp",
                "port" : "inMeta"
            }
        },

        {
            "from" :
            {
                "filter" : "ArcBokehPp",
                "port" : "OutMeta"
            },

            "to" :
            {
                "filter" : "SuperResolution",
                "port" : "inMeta"
            }
        },

        {
            "from" :
            {
                "filter" : "SuperResolution",
                "port" : "OutMeta"
            },

            "to" :
            {
                "filter" : "HwFaceSR",
                "port" : "inMeta"
            }
        },

        {
            "from" :
            {
                "filter" : "HwFaceSR",
                "port" : "OutMeta"
            },

            "to" :
            {
                "filter" : "HwBeautyPp",
                "port" : "inMeta"
            }
        },

        {
            "from" :
            {
                "filter" : "HwBeautyPp",
                "port" : "OutMeta"
            },

            "to" :
            {
                "filter" : "Davinci",
                "port" : "inMeta"
            }
        },

        {
            "from" :
            {
                "filter" : "Davinci",
                "port" : "OutMeta"
            },

           "to" :
            {
                "filter" : "WatermarkV2",
                "port" : "inMeta"
            }
        },

       {
            "from" :
            {
                "filter" : "WatermarkV2",
                "port" : "OutMeta"
            },

            "to" :
            {
                "filter" : "HwExifPp",
                "port" : "inMeta"
            }
        },

        {
            "from" :
            {
                "filter" : "HwExifPp",
                "port" : "OutMeta"
            },

            "to" :
            {
                "filter" : "jpeg",
                "port" : "inMeta"
            }
        },

        {
            "from" :
            {
                "filter" : "jpeg",
                "port" : "jpeg"
            },

            "to" :
            {
                "filter" : "writer",
                "port" : "in"
            }
        },

        {
            "from" :
            {
                "filter" : "peekMeta",
                "port" : "peek0"
            },

            "to" :
            {
                "filter" : "thumbnail",
                "port" : "inMeta"
            }
        },

        {
            "from" :
            {
                "filter" : "thumbnail",
                "port" : "outThumbnail"
            },

            "to" :
            {
                "filter" : "notifier",
                "port" : "in"
            }
        }
    ]
}

