﻿{
  "type": "soothing",
  "duration": 30000,
  "name": "Warmhappy-30",
  "id": "Soothing_30_1",
  "separationStep": 2230,
  "separationMinDuration": 5000,
  "separationMaxDuration": 10000,
  "transitions": [
    {
      "name": "叠化",
      "priority": 90,
      "pickCondition": 1,
      "horizon": true,
      "vertical": true
    },
    {
      "name": "模糊",
      "priority": 0,
      "pickCondition": -1,
      "horizon": true,
      "vertical": true
    },
    {
      "name": "融化",
      "priority": 0,
      "pickCondition": -1,
      "horizon": true,
      "vertical": true
    },
    {
      "name": "上移",
      "priority": 30,
      "pickCondition": -1,
      "horizon": true,
      "vertical": true
    },
    {
      "name": "下移",
      "priority": 30,
      "pickCondition": -1,
      "horizon": true,
      "vertical": true
    },
    {
      "name": "左移",
      "priority": 30,
      "pickCondition": -1,
      "horizon": true,
      "vertical": true
    },
    {
      "name": "右移",
      "priority": 30,
      "pickCondition": -1,
      "horizon": true,
      "vertical": true
    },
    {
      "name": "黑场",
      "priority": 90,
      "pickCondition": -1,
      "horizon": true,
      "vertical": true
    },
    {
      "name": "白场",
      "priority": 90,
      "pickCondition": 2,
      "horizon": true,
      "vertical": true
    },
    {
      "name": "放大",
      "priority": 70,
      "pickCondition": -1,
      "horizon": true,
      "vertical": true
    },
    {
      "name": "缩小",
      "priority": 70,
      "pickCondition": -1,
      "horizon": true,
      "vertical": true
    },
    {
      "name": "旋转",
      "priority": 0,
      "pickCondition": -1,
      "horizon": true,
      "vertical": true
    }
  ],
  "transitionMaxCount": 4,
  "filterId": "filter_res_36",
  "filterStrength": 0.4,
  "sticker": {
    "id": "beautiful",
    "scaleHorizon": 0.4,
    "scaleVertical": 0.6,
    "locationHorizonX": 0,
    "locationHorizonY": -0.7,
    "locationVerticalX": 0,
    "locationVerticalY": -0.35,
    "beginTime": 1
  },
  "borderId": "retro3",
  "specialEffect": [
    {
      "effectId": "sun_halo",
      "effectStart": 0
    },
    {
      "effectId": "grass1",
      "effectStart": -1
    },
    {
      "effectId": "stars",
      "effectStart": -1
    }
  ],
  "tail": "honor_vlog"
}