﻿{
  "type": "happy",
  "duration": 20000,
  "name": "Cheerful-20",
  "id": "Happy_20_1",
  "separationStep": 1920,
  "separationMinDuration": 4000,
  "separationMaxDuration": 8000,
  "transitions": [
    {
      "name": "叠化",
      "priority": 30,
      "pickCondition": -1,
      "horizon": true,
      "vertical": true
    },
    {
      "name": "模糊",
      "priority": 0,
      "pickCondition": -1,
      "horizon": true,
      "vertical": true
    },
    {
      "name": "融化",
      "priority": 0,
      "pickCondition": -1,
      "horizon": true,
      "vertical": true
    },
    {
      "name": "上移",
      "priority": 70,
      "pickCondition": -1,
      "horizon": true,
      "vertical": true
    },
    {
      "name": "下移",
      "priority": 70,
      "pickCondition": -1,
      "horizon": true,
      "vertical": true
    },
    {
      "name": "左移",
      "priority": 70,
      "pickCondition": -1,
      "horizon": true,
      "vertical": true
    },
    {
      "name": "右移",
      "priority": 70,
      "pickCondition": -1,
      "horizon": true,
      "vertical": true
    },
    {
      "name": "黑场",
      "priority": 50,
      "pickCondition": -1,
      "horizon": true,
      "vertical": true
    },
    {
      "name": "白场",
      "priority": 30,
      "pickCondition": -1,
      "horizon": true,
      "vertical": true
    },
    {
      "name": "放大",
      "priority": 90,
      "pickCondition": -1,
      "horizon": true,
      "vertical": true
    },
    {
      "name": "缩小",
      "priority": 90,
      "pickCondition": 2,
      "horizon": true,
      "vertical": true
    },
    {
      "name": "旋转",
      "priority": 90,
      "pickCondition": 1,
      "horizon": true,
      "vertical": true
    }
  ],
  "transitionMaxCount": 3,
  "filterId": "filter_res_03",
  "filterStrength": 0.4,
  "sticker": {
    "id": "happy_everyday",
    "scaleHorizon": 0.4,
    "scaleVertical": 0.6,
    "locationHorizonX": 0,
    "locationHorizonY": -0.8,
    "locationVerticalX": 0,
    "locationVerticalY": -0.35,
    "beginTime": 1
  },
  "borderId": "hand_account5",
  "specialEffect": [
    {
      "effectId": "heart_rise",
      "effectStart": 0
    },
    {
      "effectId": "burst",
      "effectStart": -1
    },
    {
      "effectId": "light_spot",
      "effectStart": -1
    }
  ],
  "tail": "honor_vlog"
}