#,version,,,,,,,,,,,,,,,,,,,,,,,,,,,,,,,,,,,,,
2022,4,3,1,,,,,,,,,,,,,,,,,,,,,,,,,,,,,,,,,,,
#,row_col_num,,,,,,,,,,,,,,,,,,,,,,,,,,,,,,,,,,,,,
39,18,,,,,,,,,,,,,,,,,,,,,,,,,,,,,,,,,,,,,
#,freq_noise,,,,,,,,,,,,,,,,,,,,,,,,,,,,,,,,,,,,,
-500,500,,,,,,,,,,,,,,,,,,,,,,,,,,,,,,,,,,,,,
#,raw_max,,,,,,,,,,,,,,,,,,,,,,,,,,,,,,,,,,,,,
21170,21563,21422,21426,21605,21512,21347,21573,21398,21460,21446,21311,21513,21438,21327,21321,21351,21145,,,,,,,,,,,,,,,,,,,,,
21353,21185,21228,21008,21298,21336,21333,21267,21227,21422,21470,21128,21242,21275,21255,21305,21181,21231,,,,,,,,,,,,,,,,,,,,,
21262,21225,21398,21418,21331,21256,21171,21170,21170,21166,21160,21166,21158,21163,21182,21193,21171,21140,,,,,,,,,,,,,,,,,,,,,
21325,21255,21240,21233,21235,21231,21250,21248,21250,21243,21240,21245,21242,21245,21268,21257,21242,21221,,,,,,,,,,,,,,,,,,,,,
21375,21305,21293,21291,21290,21288,21302,21302,21300,21293,21287,21297,21292,21297,21310,21306,21288,21273,,,,,,,,,,,,,,,,,,,,,
21312,21257,21252,21247,21250,21247,21263,21257,21260,21251,21245,21252,21258,21250,21263,21257,21241,21227,,,,,,,,,,,,,,,,,,,,,
21308,21265,21260,21260,21258,21260,21273,21265,21266,21262,21252,21262,21256,21256,21267,21262,21251,21235,,,,,,,,,,,,,,,,,,,,,
21362,21330,21326,21322,21322,21321,21340,21330,21333,21325,21318,21332,21318,21317,21331,21323,21308,21300,,,,,,,,,,,,,,,,,,,,,
21426,21401,21393,21392,21390,21390,21407,21401,21401,21395,21390,21396,21386,21387,21397,21393,21377,21375,,,,,,,,,,,,,,,,,,,,,
21391,21370,21363,21361,21360,21358,21377,21372,21372,21365,21361,21365,21357,21356,21370,21362,21351,21355,,,,,,,,,,,,,,,,,,,,,
21378,21360,21352,21352,21348,21348,21365,21362,21362,21357,21351,21357,21348,21350,21361,21356,21345,21351,,,,,,,,,,,,,,,,,,,,,
21241,21218,21215,21213,21210,21206,21226,21221,21223,21218,21213,21218,21213,21212,21223,21217,21270,21221,,,,,,,,,,,,,,,,,,,,,
21240,21223,21221,21222,21217,21217,21232,21230,21230,21226,21217,21223,21217,21221,21233,21231,21226,21221,,,,,,,,,,,,,,,,,,,,,
21182,21172,21170,21170,21168,21167,21183,21177,21181,21173,21167,21170,21167,21171,21188,21182,21175,21168,,,,,,,,,,,,,,,,,,,,,
21217,21215,21210,21212,21210,21211,21225,21222,21222,21217,21210,21216,21213,21220,21232,21227,21221,21218,,,,,,,,,,,,,,,,,,,,,
21215,21217,21217,21216,21216,21215,21232,21225,21230,21223,21220,21226,21225,21228,21242,21232,21223,21226,,,,,,,,,,,,,,,,,,,,,
21322,21290,21280,21282,21278,21280,21296,21291,21292,21291,21288,21300,21293,21297,21307,21298,21382,21340,,,,,,,,,,,,,,,,,,,,,
21258,21265,21262,21260,21257,21258,21277,21271,21275,21272,21272,21281,21276,21282,21290,21280,21273,21290,,,,,,,,,,,,,,,,,,,,,
21278,21271,21263,21262,21258,21258,21273,21275,21278,21280,21281,21285,21277,21277,21290,21285,21280,21298,,,,,,,,,,,,,,,,,,,,,
21183,21191,21185,21182,21178,21177,21195,21190,21195,21190,21185,21190,21188,21188,21206,21198,21192,21206,,,,,,,,,,,,,,,,,,,,,
21172,21181,21177,21176,21168,21171,21186,21182,21183,21181,21172,21180,21176,21178,21193,21188,21181,21200,,,,,,,,,,,,,,,,,,,,,
21178,21188,21185,21182,21178,21180,21198,21190,21193,21190,21183,21188,21185,21186,21202,21197,21192,21213,,,,,,,,,,,,,,,,,,,,,
21172,21185,21180,21177,21173,21176,21192,21186,21188,21187,21178,21186,21180,21182,21196,21192,21188,21213,,,,,,,,,,,,,,,,,,,,,
21248,21257,21258,21296,21247,21252,21265,21257,21263,21257,21252,21258,21252,21253,21273,21266,21263,21288,,,,,,,,,,,,,,,,,,,,,
21280,21288,21283,21281,21273,21278,21292,21286,21290,21286,21278,21288,21280,21282,21301,21297,21291,21317,,,,,,,,,,,,,,,,,,,,,
21158,21172,21267,21285,21161,21193,21178,21170,21172,21173,21163,21172,21166,21167,21187,21182,21180,21210,,,,,,,,,,,,,,,,,,,,,
21152,21171,21165,21165,21156,21158,21172,21166,21166,21163,21157,21166,21158,21165,21181,21180,21175,21208,,,,,,,,,,,,,,,,,,,,,
21097,21117,21115,21110,21105,21103,21121,21111,21112,21107,21105,21112,21110,21113,21130,21125,21126,21162,,,,,,,,,,,,,,,,,,,,,
21138,21160,21153,21151,21142,21145,21158,21150,21150,21148,21143,21152,21148,21155,21170,21166,21165,21203,,,,,,,,,,,,,,,,,,,,,
21096,21111,21141,21188,21096,21097,21111,21100,21103,21100,21097,21105,21103,21107,21127,21120,21120,21158,,,,,,,,,,,,,,,,,,,,,
21117,21136,21127,21126,21115,21118,21138,21122,21123,21122,21118,21128,21126,21132,21150,21146,21143,21183,,,,,,,,,,,,,,,,,,,,,
21125,21143,21140,21135,21127,21127,21143,21132,21136,21133,21130,21136,21137,21143,21162,21158,21160,21200,,,,,,,,,,,,,,,,,,,,,
21191,21210,21201,21202,21190,21200,21205,21196,21198,21198,21191,21201,21198,21208,21228,21225,21223,21267,,,,,,,,,,,,,,,,,,,,,
21277,21295,21288,21286,21280,21275,21291,21280,21291,21282,21276,21286,21287,21295,21316,21311,21311,21353,,,,,,,,,,,,,,,,,,,,,
21205,21220,21213,21211,21203,21200,21212,21212,21202,21203,21197,21210,21208,21217,21235,21235,21233,21277,,,,,,,,,,,,,,,,,,,,,
21107,21120,21117,21115,21108,21105,21115,21103,21102,21106,21100,21108,21107,21113,21131,21127,21131,21171,,,,,,,,,,,,,,,,,,,,,
21092,21090,21090,21082,21075,21080,21086,21078,21076,21075,21070,21077,21072,21080,21092,21090,21092,21131,,,,,,,,,,,,,,,,,,,,,
21065,21013,20960,21016,21067,21118,21036,21113,21230,21000,21032,21136,21175,21181,20945,21066,20997,20903,,,,,,,,,,,,,,,,,,,,,
21047,21091,21106,21135,21146,21153,21021,21041,21046,21133,21272,21382,21197,21112,20962,21002,21178,20986,,,,,,,,,,,,,,,,,,,,,
#,raw_min,,,,,,,,,,,,,,,,,,,,,,,,,,,,,,,,,,,,,
12702,12938,12853,12855,12963,12907,12808,12944,12839,12876,12867,12786,12908,12863,12796,12792,12810,12687,,,,,,,,,,,,,,,,,,,,,
12812,12711,12737,12605,12779,12801,12800,12760,12736,12853,12882,12677,12745,12765,12753,12783,12708,12738,,,,,,,,,,,,,,,,,,,,,
12757,12735,12839,12851,12798,12753,12702,12702,12702,12699,12696,12699,12695,12698,12709,12716,12702,12684,,,,,,,,,,,,,,,,,,,,,
12795,12753,12744,12740,12741,12738,12750,12749,12750,12746,12744,12747,12745,12747,12761,12754,12745,12732,,,,,,,,,,,,,,,,,,,,,
12825,12783,12776,12774,12774,12773,12781,12781,12780,12776,12772,12778,12775,12778,12786,12783,12773,12764,,,,,,,,,,,,,,,,,,,,,
12787,12754,12751,12748,12750,12748,12758,12754,12756,12750,12747,12751,12755,12750,12758,12754,12744,12736,,,,,,,,,,,,,,,,,,,,,
12785,12759,12756,12756,12755,12756,12764,12759,12759,12757,12751,12757,12753,12753,12760,12757,12750,12741,,,,,,,,,,,,,,,,,,,,,
12817,12798,12795,12793,12793,12792,12804,12798,12800,12795,12791,12799,12791,12790,12798,12794,12785,12780,,,,,,,,,,,,,,,,,,,,,
12855,12840,12836,12835,12834,12834,12844,12840,12840,12837,12834,12837,12831,12832,12838,12836,12826,12825,,,,,,,,,,,,,,,,,,,,,
12834,12822,12818,12816,12816,12815,12826,12823,12823,12819,12816,12819,12814,12813,12822,12817,12810,12813,,,,,,,,,,,,,,,,,,,,,
12827,12816,12811,12811,12809,12809,12819,12817,12817,12814,12810,12814,12809,12810,12816,12813,12807,12810,,,,,,,,,,,,,,,,,,,,,
12744,12731,12729,12728,12726,12723,12735,12732,12734,12731,12728,12731,12728,12727,12734,12730,12762,12732,,,,,,,,,,,,,,,,,,,,,
12744,12734,12732,12733,12730,12730,12739,12738,12738,12735,12730,12734,12730,12732,12740,12738,12735,12732,,,,,,,,,,,,,,,,,,,,,
12709,12703,12702,12702,12701,12700,12710,12706,12708,12704,12700,12702,12700,12702,12713,12709,12705,12701,,,,,,,,,,,,,,,,,,,,,
12730,12729,12726,12727,12726,12726,12735,12733,12733,12730,12726,12729,12728,12732,12739,12736,12732,12731,,,,,,,,,,,,,,,,,,,,,
12729,12730,12730,12729,12729,12729,12739,12735,12738,12734,12732,12735,12735,12737,12745,12739,12734,12735,,,,,,,,,,,,,,,,,,,,,
12793,12774,12768,12769,12767,12768,12777,12774,12775,12774,12773,12780,12776,12778,12784,12779,12829,12804,,,,,,,,,,,,,,,,,,,,,
12755,12759,12757,12756,12754,12755,12766,12762,12765,12763,12763,12768,12765,12769,12774,12768,12764,12774,,,,,,,,,,,,,,,,,,,,,
12767,12762,12758,12757,12755,12755,12764,12765,12767,12768,12768,12771,12766,12766,12774,12771,12768,12779,,,,,,,,,,,,,,,,,,,,,
12710,12714,12711,12709,12707,12706,12717,12714,12717,12714,12711,12714,12713,12713,12723,12719,12715,12723,,,,,,,,,,,,,,,,,,,,,
12703,12708,12706,12705,12701,12702,12711,12709,12710,12708,12703,12708,12705,12707,12716,12713,12708,12720,,,,,,,,,,,,,,,,,,,,,
12707,12713,12711,12709,12707,12708,12719,12714,12716,12714,12710,12713,12711,12711,12721,12718,12715,12728,,,,,,,,,,,,,,,,,,,,,
12703,12711,12708,12706,12704,12705,12715,12711,12713,12712,12707,12711,12708,12709,12717,12715,12713,12728,,,,,,,,,,,,,,,,,,,,,
12749,12754,12755,12777,12748,12751,12759,12754,12758,12754,12751,12755,12751,12752,12764,12759,12758,12773,,,,,,,,,,,,,,,,,,,,,
12768,12773,12770,12768,12764,12767,12775,12771,12774,12771,12767,12773,12768,12769,12780,12778,12774,12790,,,,,,,,,,,,,,,,,,,,,
12695,12703,12760,12771,12696,12716,12707,12702,12703,12704,12698,12703,12699,12700,12712,12709,12708,12726,,,,,,,,,,,,,,,,,,,,,
12691,12702,12699,12699,12693,12695,12703,12699,12699,12698,12694,12699,12695,12699,12708,12708,12705,12725,,,,,,,,,,,,,,,,,,,,,
12658,12670,12669,12666,12663,12662,12672,12666,12667,12664,12663,12667,12666,12668,12678,12675,12675,12697,,,,,,,,,,,,,,,,,,,,,
12683,12696,12692,12690,12685,12687,12695,12690,12690,12689,12686,12691,12689,12693,12702,12699,12699,12722,,,,,,,,,,,,,,,,,,,,,
12657,12666,12684,12713,12657,12658,12666,12660,12662,12660,12658,12663,12662,12664,12676,12672,12672,12695,,,,,,,,,,,,,,,,,,,,,
12670,12681,12676,12675,12669,12671,12683,12673,12674,12673,12671,12677,12675,12679,12690,12687,12686,12710,,,,,,,,,,,,,,,,,,,,,
12675,12686,12684,12681,12676,12676,12686,12679,12681,12680,12678,12681,12682,12686,12697,12695,12696,12720,,,,,,,,,,,,,,,,,,,,,
12714,12726,12720,12721,12714,12720,12723,12717,12719,12719,12714,12720,12719,12725,12737,12735,12734,12760,,,,,,,,,,,,,,,,,,,,,
12766,12777,12773,12771,12768,12765,12774,12768,12774,12769,12765,12771,12772,12777,12789,12786,12786,12812,,,,,,,,,,,,,,,,,,,,,
12723,12732,12728,12726,12722,12720,12727,12727,12721,12722,12718,12726,12725,12730,12741,12741,12740,12766,,,,,,,,,,,,,,,,,,,,,
12664,12672,12670,12669,12665,12663,12669,12662,12661,12663,12660,12665,12664,12668,12678,12676,12678,12702,,,,,,,,,,,,,,,,,,,,,
12655,12654,12654,12649,12645,12648,12651,12647,12645,12645,12642,12646,12643,12648,12655,12654,12655,12678,,,,,,,,,,,,,,,,,,,,,
12639,12608,12576,12609,12640,12671,12621,12668,12738,12600,12619,12681,12705,12708,12567,12639,12598,12542,,,,,,,,,,,,,,,,,,,,,
12628,12654,12663,12681,12687,12692,12612,12624,12627,12680,12763,12829,12718,12667,12577,12601,12707,12591,,,,,,,,,,,,,,,,,,,,,
#,raw_row_delta_max,,,,,,,,,,,,,,,,,,,,,,,,,,,,,,,,,,,,,
2400,1600,1600,1600,1600,1600,1600,1600,1600,1600,1600,1600,1600,1600,1600,1600,1600,2400,,,,,,,,,,,,,,,,,,,,,
800,1800,1800,1800,1800,1800,750,750,750,750,750,750,750,750,750,750,750,800,,,,,,,,,,,,,,,,,,,,,
650,650,650,650,650,650,650,650,650,650,650,650,650,650,650,650,650,650,,,,,,,,,,,,,,,,,,,,,
650,650,650,650,650,650,650,650,650,650,650,650,650,650,650,650,650,650,,,,,,,,,,,,,,,,,,,,,
650,650,650,650,650,650,650,650,650,650,650,650,650,650,650,650,650,650,,,,,,,,,,,,,,,,,,,,,
650,650,650,650,650,650,650,650,650,650,650,650,650,650,650,650,650,650,,,,,,,,,,,,,,,,,,,,,
650,650,650,650,650,650,650,650,650,650,650,650,650,650,650,650,650,650,,,,,,,,,,,,,,,,,,,,,
650,650,650,650,650,650,650,650,650,650,650,650,650,650,650,650,650,650,,,,,,,,,,,,,,,,,,,,,
650,650,650,650,650,650,650,650,650,650,650,650,650,650,650,650,650,650,,,,,,,,,,,,,,,,,,,,,
650,650,650,650,650,650,650,650,650,650,650,650,650,650,650,650,650,650,,,,,,,,,,,,,,,,,,,,,
650,650,650,650,650,650,650,650,650,650,650,650,650,650,650,650,650,650,,,,,,,,,,,,,,,,,,,,,
650,650,650,650,650,650,650,650,650,650,650,650,650,650,650,650,650,650,,,,,,,,,,,,,,,,,,,,,
650,650,650,650,650,650,650,650,650,650,650,650,650,650,650,650,650,650,,,,,,,,,,,,,,,,,,,,,
650,650,650,650,650,650,650,650,650,650,650,650,650,650,650,650,650,650,,,,,,,,,,,,,,,,,,,,,
650,650,650,650,650,650,650,650,650,650,650,650,650,650,650,650,650,650,,,,,,,,,,,,,,,,,,,,,
650,650,650,650,650,650,650,650,650,650,650,650,650,650,650,650,650,650,,,,,,,,,,,,,,,,,,,,,
650,650,650,650,650,650,650,650,650,650,650,650,650,650,650,650,650,650,,,,,,,,,,,,,,,,,,,,,
650,650,650,650,650,650,650,650,650,650,650,650,650,650,650,650,650,650,,,,,,,,,,,,,,,,,,,,,
650,650,650,650,650,650,650,650,650,650,650,650,650,650,650,650,650,650,,,,,,,,,,,,,,,,,,,,,
650,650,650,650,650,650,650,650,650,650,650,650,650,650,650,650,650,650,,,,,,,,,,,,,,,,,,,,,
650,650,650,650,650,650,650,650,650,650,650,650,650,650,650,650,650,650,,,,,,,,,,,,,,,,,,,,,
650,650,650,650,650,650,650,650,650,650,650,650,650,650,650,650,650,650,,,,,,,,,,,,,,,,,,,,,
650,650,650,650,650,650,650,650,650,650,650,650,650,650,650,650,650,650,,,,,,,,,,,,,,,,,,,,,
650,650,650,650,650,650,650,650,650,650,650,650,650,650,650,650,650,650,,,,,,,,,,,,,,,,,,,,,
650,650,650,650,650,650,650,650,650,650,650,650,650,650,650,650,650,650,,,,,,,,,,,,,,,,,,,,,
650,650,650,650,650,650,650,650,650,650,650,650,650,650,650,650,650,650,,,,,,,,,,,,,,,,,,,,,
650,650,650,650,650,650,650,650,650,650,650,650,650,650,650,650,650,650,,,,,,,,,,,,,,,,,,,,,
650,650,650,650,650,650,650,650,650,650,650,650,650,650,650,650,650,650,,,,,,,,,,,,,,,,,,,,,
650,650,650,650,650,650,650,650,650,650,650,650,650,650,650,650,650,650,,,,,,,,,,,,,,,,,,,,,
650,650,650,650,650,650,650,650,650,650,650,650,650,650,650,650,650,650,,,,,,,,,,,,,,,,,,,,,
650,650,650,650,650,650,650,650,650,650,650,650,650,650,650,650,650,650,,,,,,,,,,,,,,,,,,,,,
650,650,650,650,650,650,650,650,650,650,650,650,650,650,650,650,650,650,,,,,,,,,,,,,,,,,,,,,
650,650,650,650,650,650,650,650,650,650,650,650,650,650,650,650,650,650,,,,,,,,,,,,,,,,,,,,,
650,650,650,650,650,650,650,650,650,650,650,650,650,650,650,650,650,650,,,,,,,,,,,,,,,,,,,,,
650,650,650,650,650,650,650,650,650,650,650,650,650,650,650,650,650,650,,,,,,,,,,,,,,,,,,,,,
650,650,650,650,650,650,650,650,650,650,650,650,650,650,650,650,650,650,,,,,,,,,,,,,,,,,,,,,
800,650,650,650,650,650,650,650,650,650,650,650,650,650,650,650,650,800,,,,,,,,,,,,,,,,,,,,,
2400,2000,2000,2000,2000,2000,2000,2000,2000,2000,2000,2000,2000,2000,2000,2000,2000,2400,,,,,,,,,,,,,,,,,,,,,
#,raw_row_delta_min,,,,,,,,,,,,,,,,,,,,,,,,,,,,,,,,,,,,,
-2400,-1600,-1600,-1600,-1600,-1600,-1600,-1600,-1600,-1600,-1600,-1600,-1600,-1600,-1600,-1600,-1600,-2400,,,,,,,,,,,,,,,,,,,,,
-800,-1800,-1800,-1800,-1800,-1800,-750,-750,-750,-750,-750,-750,-750,-750,-750,-750,-750,-800,,,,,,,,,,,,,,,,,,,,,
-650,-650,-650,-650,-650,-650,-650,-650,-650,-650,-650,-650,-650,-650,-650,-650,-650,-650,,,,,,,,,,,,,,,,,,,,,
-650,-650,-650,-650,-650,-650,-650,-650,-650,-650,-650,-650,-650,-650,-650,-650,-650,-650,,,,,,,,,,,,,,,,,,,,,
-650,-650,-650,-650,-650,-650,-650,-650,-650,-650,-650,-650,-650,-650,-650,-650,-650,-650,,,,,,,,,,,,,,,,,,,,,
-650,-650,-650,-650,-650,-650,-650,-650,-650,-650,-650,-650,-650,-650,-650,-650,-650,-650,,,,,,,,,,,,,,,,,,,,,
-650,-650,-650,-650,-650,-650,-650,-650,-650,-650,-650,-650,-650,-650,-650,-650,-650,-650,,,,,,,,,,,,,,,,,,,,,
-650,-650,-650,-650,-650,-650,-650,-650,-650,-650,-650,-650,-650,-650,-650,-650,-650,-650,,,,,,,,,,,,,,,,,,,,,
-650,-650,-650,-650,-650,-650,-650,-650,-650,-650,-650,-650,-650,-650,-650,-650,-650,-650,,,,,,,,,,,,,,,,,,,,,
-650,-650,-650,-650,-650,-650,-650,-650,-650,-650,-650,-650,-650,-650,-650,-650,-650,-650,,,,,,,,,,,,,,,,,,,,,
-650,-650,-650,-650,-650,-650,-650,-650,-650,-650,-650,-650,-650,-650,-650,-650,-650,-650,,,,,,,,,,,,,,,,,,,,,
-650,-650,-650,-650,-650,-650,-650,-650,-650,-650,-650,-650,-650,-650,-650,-650,-650,-650,,,,,,,,,,,,,,,,,,,,,
-650,-650,-650,-650,-650,-650,-650,-650,-650,-650,-650,-650,-650,-650,-650,-650,-650,-650,,,,,,,,,,,,,,,,,,,,,
-650,-650,-650,-650,-650,-650,-650,-650,-650,-650,-650,-650,-650,-650,-650,-650,-650,-650,,,,,,,,,,,,,,,,,,,,,
-650,-650,-650,-650,-650,-650,-650,-650,-650,-650,-650,-650,-650,-650,-650,-650,-650,-650,,,,,,,,,,,,,,,,,,,,,
-650,-650,-650,-650,-650,-650,-650,-650,-650,-650,-650,-650,-650,-650,-650,-650,-650,-650,,,,,,,,,,,,,,,,,,,,,
-650,-650,-650,-650,-650,-650,-650,-650,-650,-650,-650,-650,-650,-650,-650,-650,-650,-650,,,,,,,,,,,,,,,,,,,,,
-650,-650,-650,-650,-650,-650,-650,-650,-650,-650,-650,-650,-650,-650,-650,-650,-650,-650,,,,,,,,,,,,,,,,,,,,,
-650,-650,-650,-650,-650,-650,-650,-650,-650,-650,-650,-650,-650,-650,-650,-650,-650,-650,,,,,,,,,,,,,,,,,,,,,
-650,-650,-650,-650,-650,-650,-650,-650,-650,-650,-650,-650,-650,-650,-650,-650,-650,-650,,,,,,,,,,,,,,,,,,,,,
-650,-650,-650,-650,-650,-650,-650,-650,-650,-650,-650,-650,-650,-650,-650,-650,-650,-650,,,,,,,,,,,,,,,,,,,,,
-650,-650,-650,-650,-650,-650,-650,-650,-650,-650,-650,-650,-650,-650,-650,-650,-650,-650,,,,,,,,,,,,,,,,,,,,,
-650,-650,-650,-650,-650,-650,-650,-650,-650,-650,-650,-650,-650,-650,-650,-650,-650,-650,,,,,,,,,,,,,,,,,,,,,
-650,-650,-650,-650,-650,-650,-650,-650,-650,-650,-650,-650,-650,-650,-650,-650,-650,-650,,,,,,,,,,,,,,,,,,,,,
-650,-650,-650,-650,-650,-650,-650,-650,-650,-650,-650,-650,-650,-650,-650,-650,-650,-650,,,,,,,,,,,,,,,,,,,,,
-650,-650,-650,-650,-650,-650,-650,-650,-650,-650,-650,-650,-650,-650,-650,-650,-650,-650,,,,,,,,,,,,,,,,,,,,,
-650,-650,-650,-650,-650,-650,-650,-650,-650,-650,-650,-650,-650,-650,-650,-650,-650,-650,,,,,,,,,,,,,,,,,,,,,
-650,-650,-650,-650,-650,-650,-650,-650,-650,-650,-650,-650,-650,-650,-650,-650,-650,-650,,,,,,,,,,,,,,,,,,,,,
-650,-650,-650,-650,-650,-650,-650,-650,-650,-650,-650,-650,-650,-650,-650,-650,-650,-650,,,,,,,,,,,,,,,,,,,,,
-650,-650,-650,-650,-650,-650,-650,-650,-650,-650,-650,-650,-650,-650,-650,-650,-650,-650,,,,,,,,,,,,,,,,,,,,,
-650,-650,-650,-650,-650,-650,-650,-650,-650,-650,-650,-650,-650,-650,-650,-650,-650,-650,,,,,,,,,,,,,,,,,,,,,
-650,-650,-650,-650,-650,-650,-650,-650,-650,-650,-650,-650,-650,-650,-650,-650,-650,-650,,,,,,,,,,,,,,,,,,,,,
-650,-650,-650,-650,-650,-650,-650,-650,-650,-650,-650,-650,-650,-650,-650,-650,-650,-650,,,,,,,,,,,,,,,,,,,,,
-650,-650,-650,-650,-650,-650,-650,-650,-650,-650,-650,-650,-650,-650,-650,-650,-650,-650,,,,,,,,,,,,,,,,,,,,,
-650,-650,-650,-650,-650,-650,-650,-650,-650,-650,-650,-650,-650,-650,-650,-650,-650,-650,,,,,,,,,,,,,,,,,,,,,
-650,-650,-650,-650,-650,-650,-650,-650,-650,-650,-650,-650,-650,-650,-650,-650,-650,-650,,,,,,,,,,,,,,,,,,,,,
-800,-650,-650,-650,-650,-650,-650,-650,-650,-650,-650,-650,-650,-650,-650,-650,-650,-800,,,,,,,,,,,,,,,,,,,,,
-2400,-2000,-2000,-2000,-2000,-2000,-2000,-2000,-2000,-2000,-2000,-2000,-2000,-2000,-2000,-2000,-2000,-2400,,,,,,,,,,,,,,,,,,,,,
#,raw_col_delta_max,,,,,,,,,,,,,,,,,,,,,,,,,,,,,,,,,,,,,
2500,1000,1000,1000,1000,1000,1000,1000,1000,1000,1000,1000,1000,1000,1000,1000,2500,,,,,,,,,,,,,,,,,,,,,,
800,1500,1500,1500,1500,800,800,800,800,800,800,800,800,800,800,800,800,,,,,,,,,,,,,,,,,,,,,,
800,650,650,650,650,650,650,650,650,650,650,650,650,650,650,650,800,,,,,,,,,,,,,,,,,,,,,,
800,650,650,650,650,650,650,650,650,650,650,650,650,650,650,650,800,,,,,,,,,,,,,,,,,,,,,,
800,650,650,650,650,650,650,650,650,650,650,650,650,650,650,650,800,,,,,,,,,,,,,,,,,,,,,,
800,650,650,650,650,650,650,650,650,650,650,650,650,650,650,650,800,,,,,,,,,,,,,,,,,,,,,,
800,650,650,650,650,650,650,650,650,650,650,650,650,650,650,650,800,,,,,,,,,,,,,,,,,,,,,,
800,650,650,650,650,650,650,650,650,650,650,650,650,650,650,650,800,,,,,,,,,,,,,,,,,,,,,,
800,650,650,650,650,650,650,650,650,650,650,650,650,650,650,650,800,,,,,,,,,,,,,,,,,,,,,,
800,650,650,650,650,650,650,650,650,650,650,650,650,650,650,650,800,,,,,,,,,,,,,,,,,,,,,,
800,650,650,650,650,650,650,650,650,650,650,650,650,650,650,650,800,,,,,,,,,,,,,,,,,,,,,,
800,650,650,650,650,650,650,650,650,650,650,650,650,650,650,650,800,,,,,,,,,,,,,,,,,,,,,,
800,650,650,650,650,650,650,650,650,650,650,650,650,650,650,650,800,,,,,,,,,,,,,,,,,,,,,,
800,650,650,650,650,650,650,650,650,650,650,650,650,650,650,650,800,,,,,,,,,,,,,,,,,,,,,,
800,650,650,650,650,650,650,650,650,650,650,650,650,650,650,650,800,,,,,,,,,,,,,,,,,,,,,,
800,650,650,650,650,650,650,650,650,650,650,650,650,650,650,650,800,,,,,,,,,,,,,,,,,,,,,,
800,650,650,650,650,650,650,650,650,650,650,650,650,650,650,650,800,,,,,,,,,,,,,,,,,,,,,,
800,650,650,650,650,650,650,650,650,650,650,650,650,650,650,650,800,,,,,,,,,,,,,,,,,,,,,,
800,650,650,650,650,650,650,650,650,650,650,650,650,650,650,650,800,,,,,,,,,,,,,,,,,,,,,,
800,650,650,650,650,650,650,650,650,650,650,650,650,650,650,650,800,,,,,,,,,,,,,,,,,,,,,,
800,650,650,650,650,650,650,650,650,650,650,650,650,650,650,650,800,,,,,,,,,,,,,,,,,,,,,,
800,650,650,650,650,650,650,650,650,650,650,650,650,650,650,650,800,,,,,,,,,,,,,,,,,,,,,,
800,650,650,650,650,650,650,650,650,650,650,650,650,650,650,650,800,,,,,,,,,,,,,,,,,,,,,,
800,650,650,650,650,650,650,650,650,650,650,650,650,650,650,650,800,,,,,,,,,,,,,,,,,,,,,,
800,650,650,650,650,650,650,650,650,650,650,650,650,650,650,650,800,,,,,,,,,,,,,,,,,,,,,,
800,650,650,650,650,650,650,650,650,650,650,650,650,650,650,650,800,,,,,,,,,,,,,,,,,,,,,,
800,650,650,650,650,650,650,650,650,650,650,650,650,650,650,650,800,,,,,,,,,,,,,,,,,,,,,,
800,650,650,650,650,650,650,650,650,650,650,650,650,650,650,650,800,,,,,,,,,,,,,,,,,,,,,,
800,650,650,650,650,650,650,650,650,650,650,650,650,650,650,650,800,,,,,,,,,,,,,,,,,,,,,,
800,650,650,650,650,650,650,650,650,650,650,650,650,650,650,650,800,,,,,,,,,,,,,,,,,,,,,,
800,650,650,650,650,650,650,650,650,650,650,650,650,650,650,650,800,,,,,,,,,,,,,,,,,,,,,,
800,650,650,650,650,650,650,650,650,650,650,650,650,650,650,650,800,,,,,,,,,,,,,,,,,,,,,,
800,650,650,650,650,650,650,650,650,650,650,650,650,650,650,650,800,,,,,,,,,,,,,,,,,,,,,,
800,650,650,650,650,650,650,650,650,650,650,650,650,650,650,650,800,,,,,,,,,,,,,,,,,,,,,,
800,650,650,650,650,650,650,650,650,650,650,650,650,650,650,650,800,,,,,,,,,,,,,,,,,,,,,,
800,650,650,650,650,650,650,650,650,650,650,650,650,650,650,650,800,,,,,,,,,,,,,,,,,,,,,,
800,650,650,650,650,650,650,650,650,650,650,650,650,650,650,650,800,,,,,,,,,,,,,,,,,,,,,,
800,650,650,650,650,650,650,650,650,650,650,650,650,650,650,650,800,,,,,,,,,,,,,,,,,,,,,,
2500,800,800,800,800,800,800,800,800,800,800,800,800,800,800,800,2500,,,,,,,,,,,,,,,,,,,,,,
#,raw_col_delta_min,,,,,,,,,,,,,,,,,,,,,,,,,,,,,,,,,,,,,
-2500,-1000,-1000,-1000,-1000,-1000,-1000,-1000,-1000,-1000,-1000,-1000,-1000,-1000,-1000,-1000,-2500,,,,,,,,,,,,,,,,,,,,,,
-800,-1500,-1500,-1500,-1500,-800,-800,-800,-800,-800,-800,-800,-800,-800,-800,-800,-800,,,,,,,,,,,,,,,,,,,,,,
-800,-650,-650,-650,-650,-650,-650,-650,-650,-650,-650,-650,-650,-650,-650,-650,-800,,,,,,,,,,,,,,,,,,,,,,
-800,-650,-650,-650,-650,-650,-650,-650,-650,-650,-650,-650,-650,-650,-650,-650,-800,,,,,,,,,,,,,,,,,,,,,,
-800,-650,-650,-650,-650,-650,-650,-650,-650,-650,-650,-650,-650,-650,-650,-650,-800,,,,,,,,,,,,,,,,,,,,,,
-800,-650,-650,-650,-650,-650,-650,-650,-650,-650,-650,-650,-650,-650,-650,-650,-800,,,,,,,,,,,,,,,,,,,,,,
-800,-650,-650,-650,-650,-650,-650,-650,-650,-650,-650,-650,-650,-650,-650,-650,-800,,,,,,,,,,,,,,,,,,,,,,
-800,-650,-650,-650,-650,-650,-650,-650,-650,-650,-650,-650,-650,-650,-650,-650,-800,,,,,,,,,,,,,,,,,,,,,,
-800,-650,-650,-650,-650,-650,-650,-650,-650,-650,-650,-650,-650,-650,-650,-650,-800,,,,,,,,,,,,,,,,,,,,,,
-800,-650,-650,-650,-650,-650,-650,-650,-650,-650,-650,-650,-650,-650,-650,-650,-800,,,,,,,,,,,,,,,,,,,,,,
-800,-650,-650,-650,-650,-650,-650,-650,-650,-650,-650,-650,-650,-650,-650,-650,-800,,,,,,,,,,,,,,,,,,,,,,
-800,-650,-650,-650,-650,-650,-650,-650,-650,-650,-650,-650,-650,-650,-650,-650,-800,,,,,,,,,,,,,,,,,,,,,,
-800,-650,-650,-650,-650,-650,-650,-650,-650,-650,-650,-650,-650,-650,-650,-650,-800,,,,,,,,,,,,,,,,,,,,,,
-800,-650,-650,-650,-650,-650,-650,-650,-650,-650,-650,-650,-650,-650,-650,-650,-800,,,,,,,,,,,,,,,,,,,,,,
-800,-650,-650,-650,-650,-650,-650,-650,-650,-650,-650,-650,-650,-650,-650,-650,-800,,,,,,,,,,,,,,,,,,,,,,
-800,-650,-650,-650,-650,-650,-650,-650,-650,-650,-650,-650,-650,-650,-650,-650,-800,,,,,,,,,,,,,,,,,,,,,,
-800,-650,-650,-650,-650,-650,-650,-650,-650,-650,-650,-650,-650,-650,-650,-650,-800,,,,,,,,,,,,,,,,,,,,,,
-800,-650,-650,-650,-650,-650,-650,-650,-650,-650,-650,-650,-650,-650,-650,-650,-800,,,,,,,,,,,,,,,,,,,,,,
-800,-650,-650,-650,-650,-650,-650,-650,-650,-650,-650,-650,-650,-650,-650,-650,-800,,,,,,,,,,,,,,,,,,,,,,
-800,-650,-650,-650,-650,-650,-650,-650,-650,-650,-650,-650,-650,-650,-650,-650,-800,,,,,,,,,,,,,,,,,,,,,,
-800,-650,-650,-650,-650,-650,-650,-650,-650,-650,-650,-650,-650,-650,-650,-650,-800,,,,,,,,,,,,,,,,,,,,,,
-800,-650,-650,-650,-650,-650,-650,-650,-650,-650,-650,-650,-650,-650,-650,-650,-800,,,,,,,,,,,,,,,,,,,,,,
-800,-650,-650,-650,-650,-650,-650,-650,-650,-650,-650,-650,-650,-650,-650,-650,-800,,,,,,,,,,,,,,,,,,,,,,
-800,-650,-650,-650,-650,-650,-650,-650,-650,-650,-650,-650,-650,-650,-650,-650,-800,,,,,,,,,,,,,,,,,,,,,,
-800,-650,-650,-650,-650,-650,-650,-650,-650,-650,-650,-650,-650,-650,-650,-650,-800,,,,,,,,,,,,,,,,,,,,,,
-800,-650,-650,-650,-650,-650,-650,-650,-650,-650,-650,-650,-650,-650,-650,-650,-800,,,,,,,,,,,,,,,,,,,,,,
-800,-650,-650,-650,-650,-650,-650,-650,-650,-650,-650,-650,-650,-650,-650,-650,-800,,,,,,,,,,,,,,,,,,,,,,
-800,-650,-650,-650,-650,-650,-650,-650,-650,-650,-650,-650,-650,-650,-650,-650,-800,,,,,,,,,,,,,,,,,,,,,,
-800,-650,-650,-650,-650,-650,-650,-650,-650,-650,-650,-650,-650,-650,-650,-650,-800,,,,,,,,,,,,,,,,,,,,,,
-800,-650,-650,-650,-650,-650,-650,-650,-650,-650,-650,-650,-650,-650,-650,-650,-800,,,,,,,,,,,,,,,,,,,,,,
-800,-650,-650,-650,-650,-650,-650,-650,-650,-650,-650,-650,-650,-650,-650,-650,-800,,,,,,,,,,,,,,,,,,,,,,
-800,-650,-650,-650,-650,-650,-650,-650,-650,-650,-650,-650,-650,-650,-650,-650,-800,,,,,,,,,,,,,,,,,,,,,,
-800,-650,-650,-650,-650,-650,-650,-650,-650,-650,-650,-650,-650,-650,-650,-650,-800,,,,,,,,,,,,,,,,,,,,,,
-800,-650,-650,-650,-650,-650,-650,-650,-650,-650,-650,-650,-650,-650,-650,-650,-800,,,,,,,,,,,,,,,,,,,,,,
-800,-650,-650,-650,-650,-650,-650,-650,-650,-650,-650,-650,-650,-650,-650,-650,-800,,,,,,,,,,,,,,,,,,,,,,
-800,-650,-650,-650,-650,-650,-650,-650,-650,-650,-650,-650,-650,-650,-650,-650,-800,,,,,,,,,,,,,,,,,,,,,,
-800,-650,-650,-650,-650,-650,-650,-650,-650,-650,-650,-650,-650,-650,-650,-650,-800,,,,,,,,,,,,,,,,,,,,,,
-800,-650,-650,-650,-650,-650,-650,-650,-650,-650,-650,-650,-650,-650,-650,-650,-800,,,,,,,,,,,,,,,,,,,,,,
-2500,-800,-800,-800,-800,-800,-800,-800,-800,-800,-800,-800,-800,-800,-800,-800,-2500,,,,,,,,,,,,,,,,,,,,,,
#,line_max,,,,,,,,,,,,,,,,,,,,,,,,,,,,,,,,,,,,,
50637,53260,51894,51941,51585,53177,53817,52754,51843,51531,51584,49397,48513,47111,47915,47574,48392,47329,,,,,,,,,,,,,,,,,,,,,
46761,51014,51389,51606,51427,52167,51943,51721,52247,51868,51674,51128,51893,51123,51536,51747,51055,52095,51417,50831,50788,50032,50059,49358,49651,50565,51095,49995,50766,50137,50996,49298,50125,51898,51810,50159,50125,48865,46634
#,line_min,,,,,,,,,,,,,,,,,,,,,,,,,,,,,,,,,,,,,
19207,20202,19683,19701,19567,20170,20413,20010,19664,19546,19566,18736,18401,17869,18174,18045,18355,17952,,,,,,,,,,,,,,,,,,,,,
17737,19350,19492,19574,19506,19787,19702,19618,19817,19674,19600,19393,19683,19391,19548,19628,19365,19760,19503,19280,19264,18977,18987,18722,18833,19179,19380,18963,19256,19017,19343,18699,19013,19685,19652,19025,19013,18535,17688
