#,version,,,,,,,,,,,,,,,,,,,,,,,,,,,,,,,,,,,,,
2021,11,17,1,,,,,,,,,,,,,,,,,,,,,,,,,,,,,,,,,,,
#,row_col_num,,,,,,,,,,,,,,,,,,,,,,,,,,,,,,,,,,,,,
39,18,,,,,,,,,,,,,,,,,,,,,,,,,,,,,,,,,,,,,
#,freq_noise,,,,,,,,,,,,,,,,,,,,,,,,,,,,,,,,,,,,,
-500,500,,,,,,,,,,,,,,,,,,,,,,,,,,,,,,,,,,,,,
#,raw_max,,,,,,,,,,,,,,,,,,,,,,,,,,,,,,,,,,,,,
20540,20155,20915,20185,20347,20243,20110,20599,19777,20258,20802,20252,20615,19960,19950,20078,20078,20471,,,,,,,,,,,,,,,,,,,,,
20114,20576,20552,20554,20560,20557,20549,20526,19860,19914,20495,20573,20488,20507,20522,20530,20519,19823,,,,,,,,,,,,,,,,,,,,,
20656,20570,20546,20550,20558,20558,20549,20525,20542,20720,20496,20566,20532,20610,20530,20610,20620,20515,,,,,,,,,,,,,,,,,,,,,
20686,20600,20579,20585,20593,20594,20586,20564,20585,20551,20527,20533,20526,20542,20556,20561,20551,20556,,,,,,,,,,,,,,,,,,,,,
20684,20605,20585,20594,20603,20604,20598,20578,20597,20563,20538,20545,20539,20552,20566,20568,20557,20564,,,,,,,,,,,,,,,,,,,,,
20695,20626,20608,20618,20626,20629,20624,20604,20623,20586,20563,20572,20563,20578,20590,20590,20579,20586,,,,,,,,,,,,,,,,,,,,,
20726,20664,20647,20660,20668,20671,20669,20647,20666,20630,20603,20610,20603,20617,20629,20628,20616,20627,,,,,,,,,,,,,,,,,,,,,
20716,20662,20646,20662,20670,20675,20670,20647,20668,20678,20605,20624,20604,20617,20628,20626,20615,20626,,,,,,,,,,,,,,,,,,,,,
20712,20668,20654,20672,20680,20686,20681,20657,20677,20642,20616,20622,20612,20627,20645,20633,20623,20635,,,,,,,,,,,,,,,,,,,,,
20694,20656,20644,20663,20670,20674,20669,20647,20668,20635,20609,20614,20612,20617,20627,20622,20612,20627,,,,,,,,,,,,,,,,,,,,,
20665,20633,20623,20641,20647,20651,20647,20626,20647,20612,20588,20592,20585,20597,20605,20602,20592,20614,,,,,,,,,,,,,,,,,,,,,
20666,20638,20628,20644,20648,20656,20652,20632,20653,20618,20600,20599,20591,20603,20612,20608,20598,20611,,,,,,,,,,,,,,,,,,,,,
20647,20621,20608,20624,20629,20635,20634,20616,20638,20602,20578,20584,20578,20588,20596,20591,20582,20599,,,,,,,,,,,,,,,,,,,,,
20636,20615,20602,20621,20623,20629,20628,20610,20634,20599,20574,20581,20574,20585,20593,20596,20579,20597,,,,,,,,,,,,,,,,,,,,,
20592,20576,20563,20582,20585,20592,20590,20573,20598,20562,20537,20544,20537,20549,20558,20552,20551,20563,,,,,,,,,,,,,,,,,,,,,
20564,20551,20538,20556,20558,20564,20563,20548,20574,20546,20513,20520,20513,20527,20534,20530,20521,20544,,,,,,,,,,,,,,,,,,,,,
20539,20528,20516,20534,20537,20542,20542,20526,20557,20516,20492,20507,20495,20509,20516,20510,20502,20526,,,,,,,,,,,,,,,,,,,,,
20509,20503,20491,20509,20512,20516,20515,20500,20592,20497,20468,20519,20472,20486,20495,20488,20480,20506,,,,,,,,,,,,,,,,,,,,,
20471,20467,20455,20473,20474,20479,20490,20468,20896,20458,20434,20442,20437,20453,20461,20454,20447,20477,,,,,,,,,,,,,,,,,,,,,
20410,20407,20392,20411,20411,20417,20417,20402,20426,20450,20428,20436,20431,20447,20454,20449,20443,20472,,,,,,,,,,,,,,,,,,,,,
20482,20381,20357,20376,20375,20381,20381,20366,20390,20416,20393,20401,20396,20411,20420,20414,20411,20442,,,,,,,,,,,,,,,,,,,,,
20326,20330,20315,20334,20333,20339,20338,20324,20350,20372,20350,20360,20357,20371,20380,20374,20372,20408,,,,,,,,,,,,,,,,,,,,,
20320,20286,20270,20290,20288,20296,20294,20281,20305,20329,20306,20317,20314,20329,20336,20332,20332,20370,,,,,,,,,,,,,,,,,,,,,
20366,20339,20324,20249,20249,20256,20269,20240,20278,20290,20267,20279,20274,20291,20300,20294,20296,20338,,,,,,,,,,,,,,,,,,,,,
20236,20243,20225,20243,20240,20249,20248,20234,20260,20284,20263,20274,20270,20287,20297,20292,20293,20339,,,,,,,,,,,,,,,,,,,,,
20263,20227,20214,20225,20221,20228,20230,20215,20240,20264,20244,20256,20254,20269,20280,20275,20278,20323,,,,,,,,,,,,,,,,,,,,,
20186,20196,20178,20195,20190,20196,20198,20184,20210,20234,20214,20226,20224,20240,20251,20248,20251,20297,,,,,,,,,,,,,,,,,,,,,
20173,20183,20164,20179,20174,20182,20183,20171,20195,20219,20197,20210,20209,20228,20238,20234,20239,20291,,,,,,,,,,,,,,,,,,,,,
20220,20182,20130,20144,20140,20147,20147,20134,20194,20183,20162,20176,20176,20194,20204,20202,20208,20260,,,,,,,,,,,,,,,,,,,,,
20080,20093,20074,20089,20081,20089,20089,20082,20100,20124,20104,20120,20119,20137,20149,20144,20153,20208,,,,,,,,,,,,,,,,,,,,,
20060,20074,20052,20069,20060,20066,20066,20053,20077,20102,20082,20098,20098,20117,20129,20125,20135,20192,,,,,,,,,,,,,,,,,,,,,
20039,20052,20038,20047,20039,20044,20045,20030,20053,20081,20059,20074,20075,20095,20107,20105,20113,20174,,,,,,,,,,,,,,,,,,,,,
19972,19991,19962,19980,19967,19973,19973,19960,19985,20009,19988,20004,20005,20023,20036,20034,20045,20106,,,,,,,,,,,,,,,,,,,,,
19970,19979,19956,19973,19963,19966,19966,19951,19985,20002,19980,19997,19998,20018,20029,20027,20039,20102,,,,,,,,,,,,,,,,,,,,,
19962,19966,19942,19958,19958,19950,19949,19936,19958,19985,19966,19982,19984,20002,20012,20010,20024,20089,,,,,,,,,,,,,,,,,,,,,
19934,19933,19910,19926,19918,19920,19925,19904,19924,19950,19934,19950,19949,19967,19978,19976,19991,20052,,,,,,,,,,,,,,,,,,,,,
19949,19936,19909,19934,19919,19924,19922,19909,19931,19960,19939,19951,19950,19967,19976,19975,19990,20048,,,,,,,,,,,,,,,,,,,,,
19582,20012,19980,20000,19994,20015,20009,19997,20024,20050,20024,20033,20029,20041,20047,20044,20057,19277,,,,,,,,,,,,,,,,,,,,,
20112,20449,20375,20542,20458,20358,20551,20723,20810,20614,20575,20575,20548,20572,20326,20287,20285,20273,,,,,,,,,,,,,,,,,,,,,
#,raw_min,,,,,,,,,,,,,,,,,,,,,,,,,,,,,,,,,,,,,
13694,13437,13943,13457,13565,13495,13406,13733,13185,13506,13868,13502,13743,13306,13300,13386,13386,13647,,,,,,,,,,,,,,,,,,,,,
13410,13718,13702,13702,13706,13705,13699,13684,13240,13276,13663,13715,13658,13671,13682,13686,13679,13215,,,,,,,,,,,,,,,,,,,,,
13770,13714,13698,13700,13706,13706,13699,13683,13694,13814,13664,13710,13688,13740,13686,13740,13746,13677,,,,,,,,,,,,,,,,,,,,,
13790,13734,13719,13723,13729,13730,13724,13710,13723,13701,13685,13689,13684,13694,13704,13707,13701,13704,,,,,,,,,,,,,,,,,,,,,
13790,13737,13723,13730,13735,13736,13732,13718,13731,13709,13692,13697,13693,13702,13710,13712,13705,13710,,,,,,,,,,,,,,,,,,,,,
13797,13750,13738,13746,13750,13753,13750,13736,13749,13724,13709,13714,13709,13718,13726,13726,13719,13724,,,,,,,,,,,,,,,,,,,,,
13818,13776,13765,13774,13778,13781,13779,13765,13778,13754,13735,13740,13735,13745,13753,13752,13744,13751,,,,,,,,,,,,,,,,,,,,,
13810,13774,13764,13774,13780,13783,13780,13765,13778,13786,13737,13750,13736,13745,13752,13750,13743,13750,,,,,,,,,,,,,,,,,,,,,
13808,13778,13770,13782,13786,13790,13787,13771,13785,13762,13744,13748,13742,13751,13763,13755,13749,13757,,,,,,,,,,,,,,,,,,,,,
13796,13770,13762,13775,13780,13782,13779,13765,13778,13757,13739,13742,13742,13745,13751,13748,13742,13751,,,,,,,,,,,,,,,,,,,,,
13777,13755,13749,13761,13765,13767,13765,13750,13765,13742,13726,13728,13723,13731,13737,13734,13728,13742,,,,,,,,,,,,,,,,,,,,,
13778,13758,13752,13762,13766,13770,13768,13754,13769,13746,13734,13733,13727,13735,13742,13738,13732,13741,,,,,,,,,,,,,,,,,,,,,
13765,13747,13738,13750,13753,13757,13756,13744,13758,13734,13718,13722,13718,13726,13730,13727,13722,13733,,,,,,,,,,,,,,,,,,,,,
13758,13743,13734,13747,13749,13753,13752,13740,13756,13733,13716,13721,13716,13723,13729,13730,13719,13731,,,,,,,,,,,,,,,,,,,,,
13728,13718,13709,13722,13723,13728,13726,13715,13732,13708,13691,13696,13691,13699,13706,13702,13701,13709,,,,,,,,,,,,,,,,,,,,,
13710,13701,13692,13704,13706,13710,13709,13698,13716,13698,13675,13680,13675,13685,13690,13686,13681,13696,,,,,,,,,,,,,,,,,,,,,
13693,13686,13678,13690,13691,13694,13694,13684,13705,13678,13662,13671,13663,13673,13678,13674,13668,13684,,,,,,,,,,,,,,,,,,,,,
13673,13669,13661,13673,13674,13678,13677,13666,13728,13665,13646,13679,13648,13658,13663,13658,13654,13670,,,,,,,,,,,,,,,,,,,,,
13647,13645,13637,13649,13650,13653,13660,13646,13930,13638,13622,13628,13625,13635,13641,13636,13631,13651,,,,,,,,,,,,,,,,,,,,,
13606,13605,13594,13607,13607,13611,13611,13602,13618,13634,13618,13624,13621,13631,13636,13633,13629,13648,,,,,,,,,,,,,,,,,,,,,
13654,13587,13571,13584,13583,13587,13587,13578,13594,13610,13595,13601,13598,13607,13614,13610,13607,13628,,,,,,,,,,,,,,,,,,,,,
13550,13554,13543,13556,13555,13559,13558,13550,13566,13582,13566,13574,13571,13581,13586,13582,13582,13606,,,,,,,,,,,,,,,,,,,,,
13546,13524,13514,13526,13526,13530,13530,13521,13537,13553,13538,13545,13542,13553,13558,13554,13554,13580,,,,,,,,,,,,,,,,,,,,,
13578,13559,13550,13499,13499,13504,13513,13494,13518,13526,13511,13519,13516,13527,13534,13530,13530,13558,,,,,,,,,,,,,,,,,,,,,
13490,13495,13483,13495,13494,13499,13498,13490,13506,13522,13509,13516,13514,13525,13531,13528,13529,13559,,,,,,,,,,,,,,,,,,,,,
13509,13485,13476,13483,13481,13486,13486,13477,13494,13510,13496,13504,13502,13513,13520,13517,13518,13549,,,,,,,,,,,,,,,,,,,,,
13458,13464,13452,13463,13460,13464,13466,13456,13474,13490,13476,13484,13482,13494,13501,13498,13501,13531,,,,,,,,,,,,,,,,,,,,,
13449,13455,13442,13453,13450,13454,13455,13447,13463,13479,13465,13474,13473,13486,13492,13490,13493,13527,,,,,,,,,,,,,,,,,,,,,
13480,13454,13420,13430,13426,13431,13431,13422,13462,13455,13442,13450,13450,13462,13470,13468,13472,13506,,,,,,,,,,,,,,,,,,,,,
13386,13395,13382,13393,13387,13393,13393,13388,13400,13416,13402,13414,13413,13425,13433,13430,13435,13472,,,,,,,,,,,,,,,,,,,,,
13374,13382,13368,13379,13374,13378,13378,13369,13385,13402,13388,13398,13398,13411,13419,13417,13423,13462,,,,,,,,,,,,,,,,,,,,,
13359,13368,13358,13365,13359,13362,13363,13354,13369,13387,13373,13382,13383,13397,13405,13403,13409,13450,,,,,,,,,,,,,,,,,,,,,
13314,13327,13308,13320,13311,13315,13315,13306,13323,13339,13326,13336,13337,13349,13358,13356,13363,13404,,,,,,,,,,,,,,,,,,,,,
13314,13319,13304,13315,13309,13310,13310,13301,13323,13334,13320,13331,13332,13346,13353,13351,13359,13402,,,,,,,,,,,,,,,,,,,,,
13308,13310,13294,13306,13306,13300,13299,13290,13306,13323,13310,13322,13322,13334,13342,13340,13350,13393,,,,,,,,,,,,,,,,,,,,,
13290,13289,13274,13284,13278,13280,13283,13270,13282,13300,13290,13300,13299,13311,13318,13318,13327,13368,,,,,,,,,,,,,,,,,,,,,
13299,13290,13273,13290,13279,13282,13282,13273,13287,13306,13293,13301,13300,13311,13318,13317,13326,13366,,,,,,,,,,,,,,,,,,,,,
13054,13342,13320,13334,13330,13343,13339,13331,13350,13366,13350,13355,13353,13361,13365,13362,13371,12851,,,,,,,,,,,,,,,,,,,,,
13408,13633,13583,13694,13638,13572,13701,13815,13874,13742,13717,13717,13698,13714,13550,13525,13523,13515,,,,,,,,,,,,,,,,,,,,,
#,raw_row_delta_max,,,,,,,,,,,,,,,,,,,,,,,,,,,,,,,,,,,,,
3000,1500,1500,1500,1500,1500,1500,1500,1200,1200,1500,1500,1500,1500,1500,1500,1500,3000,,,,,,,,,,,,,,,,,,,,,
1000,600,600,600,600,600,600,600,2400,2400,600,600,600,600,600,600,600,1400,,,,,,,,,,,,,,,,,,,,,
600,600,600,600,600,600,600,600,600,600,600,600,600,600,600,600,600,600,,,,,,,,,,,,,,,,,,,,,
600,600,600,600,600,600,600,600,600,600,600,600,600,600,600,600,600,600,,,,,,,,,,,,,,,,,,,,,
600,600,600,600,600,600,600,600,600,600,600,600,600,600,600,600,600,600,,,,,,,,,,,,,,,,,,,,,
600,600,600,600,600,600,600,600,600,600,600,600,600,600,600,600,600,600,,,,,,,,,,,,,,,,,,,,,
600,600,600,600,600,600,600,600,600,600,600,600,600,600,600,600,600,600,,,,,,,,,,,,,,,,,,,,,
600,600,600,600,600,600,600,600,600,600,600,600,600,600,600,600,600,600,,,,,,,,,,,,,,,,,,,,,
600,600,600,600,600,600,600,600,600,600,600,600,600,600,600,600,600,600,,,,,,,,,,,,,,,,,,,,,
600,600,600,600,600,600,600,600,600,600,600,600,600,600,600,600,600,600,,,,,,,,,,,,,,,,,,,,,
600,600,600,600,600,600,600,600,600,600,600,600,600,600,600,600,600,600,,,,,,,,,,,,,,,,,,,,,
600,600,600,600,600,600,600,600,600,600,600,600,600,600,600,600,600,600,,,,,,,,,,,,,,,,,,,,,
600,600,600,600,600,600,600,600,600,600,600,600,600,600,600,600,600,600,,,,,,,,,,,,,,,,,,,,,
600,600,600,600,600,600,600,600,600,600,600,600,600,600,600,600,600,600,,,,,,,,,,,,,,,,,,,,,
600,600,600,600,600,600,600,600,600,600,600,600,600,600,600,600,600,600,,,,,,,,,,,,,,,,,,,,,
600,600,600,600,600,600,600,600,600,600,600,600,600,600,600,600,600,600,,,,,,,,,,,,,,,,,,,,,
600,600,600,600,600,600,600,600,600,600,600,600,600,600,600,600,600,600,,,,,,,,,,,,,,,,,,,,,
600,600,600,600,600,600,600,600,700,600,600,600,600,600,600,600,600,600,,,,,,,,,,,,,,,,,,,,,
600,600,600,600,600,600,600,600,1000,600,600,600,600,600,600,600,600,600,,,,,,,,,,,,,,,,,,,,,
600,600,600,600,600,600,600,600,600,600,600,600,600,600,600,600,600,600,,,,,,,,,,,,,,,,,,,,,
600,600,600,600,600,600,600,600,600,600,600,600,600,600,600,600,600,600,,,,,,,,,,,,,,,,,,,,,
600,600,600,600,600,600,600,600,600,600,600,600,600,600,600,600,600,600,,,,,,,,,,,,,,,,,,,,,
600,600,600,600,600,600,600,600,600,600,600,600,600,600,600,600,600,600,,,,,,,,,,,,,,,,,,,,,
600,600,600,600,600,600,600,600,600,600,600,600,600,600,600,600,600,600,,,,,,,,,,,,,,,,,,,,,
600,600,600,600,600,600,600,600,600,600,600,600,600,600,600,600,600,600,,,,,,,,,,,,,,,,,,,,,
600,600,600,600,600,600,600,600,600,600,600,600,600,600,600,600,600,600,,,,,,,,,,,,,,,,,,,,,
600,600,600,600,600,600,600,600,600,600,600,600,600,600,600,600,600,600,,,,,,,,,,,,,,,,,,,,,
600,600,600,600,600,600,600,600,600,600,600,600,600,600,600,600,600,600,,,,,,,,,,,,,,,,,,,,,
600,600,600,600,600,600,600,600,600,600,600,600,600,600,600,600,600,600,,,,,,,,,,,,,,,,,,,,,
600,600,600,600,600,600,600,600,600,600,600,600,600,600,600,600,600,600,,,,,,,,,,,,,,,,,,,,,
600,600,600,600,600,600,600,600,600,600,600,600,600,600,600,600,600,600,,,,,,,,,,,,,,,,,,,,,
600,600,600,600,600,600,600,600,600,600,600,600,600,600,600,600,600,600,,,,,,,,,,,,,,,,,,,,,
600,600,600,600,600,600,600,600,600,600,600,600,600,600,600,600,600,600,,,,,,,,,,,,,,,,,,,,,
600,600,600,600,600,600,600,600,600,600,600,600,600,600,600,600,600,600,,,,,,,,,,,,,,,,,,,,,
600,600,600,600,600,600,600,600,600,600,600,600,600,600,600,600,600,600,,,,,,,,,,,,,,,,,,,,,
600,600,600,600,600,600,600,600,600,600,600,600,600,600,600,600,600,600,,,,,,,,,,,,,,,,,,,,,
1000,600,600,600,600,600,600,600,600,600,600,600,600,600,600,600,600,1600,,,,,,,,,,,,,,,,,,,,,
3000,2000,2000,2000,2000,2000,2000,2000,2000,2000,2000,2000,2000,2000,2000,2000,2000,3000,,,,,,,,,,,,,,,,,,,,,
#,raw_row_delta_min,,,,,,,,,,,,,,,,,,,,,,,,,,,,,,,,,,,,,
-3000,-1500,-1500,-1500,-1500,-1500,-1500,-1500,-1200,-1200,-1500,-1500,-1500,-1500,-1500,-1500,-1500,-3000,,,,,,,,,,,,,,,,,,,,,
-1000,-600,-600,-600,-600,-600,-600,-600,-2400,-2400,-600,-600,-600,-600,-600,-600,-600,-1400,,,,,,,,,,,,,,,,,,,,,
-600,-600,-600,-600,-600,-600,-600,-600,-600,-600,-600,-600,-600,-600,-600,-600,-600,-600,,,,,,,,,,,,,,,,,,,,,
-600,-600,-600,-600,-600,-600,-600,-600,-600,-600,-600,-600,-600,-600,-600,-600,-600,-600,,,,,,,,,,,,,,,,,,,,,
-600,-600,-600,-600,-600,-600,-600,-600,-600,-600,-600,-600,-600,-600,-600,-600,-600,-600,,,,,,,,,,,,,,,,,,,,,
-600,-600,-600,-600,-600,-600,-600,-600,-600,-600,-600,-600,-600,-600,-600,-600,-600,-600,,,,,,,,,,,,,,,,,,,,,
-600,-600,-600,-600,-600,-600,-600,-600,-600,-600,-600,-600,-600,-600,-600,-600,-600,-600,,,,,,,,,,,,,,,,,,,,,
-600,-600,-600,-600,-600,-600,-600,-600,-600,-600,-600,-600,-600,-600,-600,-600,-600,-600,,,,,,,,,,,,,,,,,,,,,
-600,-600,-600,-600,-600,-600,-600,-600,-600,-600,-600,-600,-600,-600,-600,-600,-600,-600,,,,,,,,,,,,,,,,,,,,,
-600,-600,-600,-600,-600,-600,-600,-600,-600,-600,-600,-600,-600,-600,-600,-600,-600,-600,,,,,,,,,,,,,,,,,,,,,
-600,-600,-600,-600,-600,-600,-600,-600,-600,-600,-600,-600,-600,-600,-600,-600,-600,-600,,,,,,,,,,,,,,,,,,,,,
-600,-600,-600,-600,-600,-600,-600,-600,-600,-600,-600,-600,-600,-600,-600,-600,-600,-600,,,,,,,,,,,,,,,,,,,,,
-600,-600,-600,-600,-600,-600,-600,-600,-600,-600,-600,-600,-600,-600,-600,-600,-600,-600,,,,,,,,,,,,,,,,,,,,,
-600,-600,-600,-600,-600,-600,-600,-600,-600,-600,-600,-600,-600,-600,-600,-600,-600,-600,,,,,,,,,,,,,,,,,,,,,
-600,-600,-600,-600,-600,-600,-600,-600,-600,-600,-600,-600,-600,-600,-600,-600,-600,-600,,,,,,,,,,,,,,,,,,,,,
-600,-600,-600,-600,-600,-600,-600,-600,-600,-600,-600,-600,-600,-600,-600,-600,-600,-600,,,,,,,,,,,,,,,,,,,,,
-600,-600,-600,-600,-600,-600,-600,-600,-600,-600,-600,-600,-600,-600,-600,-600,-600,-600,,,,,,,,,,,,,,,,,,,,,
-600,-600,-600,-600,-600,-600,-600,-600,-700,-600,-600,-600,-600,-600,-600,-600,-600,-600,,,,,,,,,,,,,,,,,,,,,
-600,-600,-600,-600,-600,-600,-600,-600,-1000,-600,-600,-600,-600,-600,-600,-600,-600,-600,,,,,,,,,,,,,,,,,,,,,
-600,-600,-600,-600,-600,-600,-600,-600,-600,-600,-600,-600,-600,-600,-600,-600,-600,-600,,,,,,,,,,,,,,,,,,,,,
-600,-600,-600,-600,-600,-600,-600,-600,-600,-600,-600,-600,-600,-600,-600,-600,-600,-600,,,,,,,,,,,,,,,,,,,,,
-600,-600,-600,-600,-600,-600,-600,-600,-600,-600,-600,-600,-600,-600,-600,-600,-600,-600,,,,,,,,,,,,,,,,,,,,,
-600,-600,-600,-600,-600,-600,-600,-600,-600,-600,-600,-600,-600,-600,-600,-600,-600,-600,,,,,,,,,,,,,,,,,,,,,
-600,-600,-600,-600,-600,-600,-600,-600,-600,-600,-600,-600,-600,-600,-600,-600,-600,-600,,,,,,,,,,,,,,,,,,,,,
-600,-600,-600,-600,-600,-600,-600,-600,-600,-600,-600,-600,-600,-600,-600,-600,-600,-600,,,,,,,,,,,,,,,,,,,,,
-600,-600,-600,-600,-600,-600,-600,-600,-600,-600,-600,-600,-600,-600,-600,-600,-600,-600,,,,,,,,,,,,,,,,,,,,,
-600,-600,-600,-600,-600,-600,-600,-600,-600,-600,-600,-600,-600,-600,-600,-600,-600,-600,,,,,,,,,,,,,,,,,,,,,
-600,-600,-600,-600,-600,-600,-600,-600,-600,-600,-600,-600,-600,-600,-600,-600,-600,-600,,,,,,,,,,,,,,,,,,,,,
-600,-600,-600,-600,-600,-600,-600,-600,-600,-600,-600,-600,-600,-600,-600,-600,-600,-600,,,,,,,,,,,,,,,,,,,,,
-600,-600,-600,-600,-600,-600,-600,-600,-600,-600,-600,-600,-600,-600,-600,-600,-600,-600,,,,,,,,,,,,,,,,,,,,,
-600,-600,-600,-600,-600,-600,-600,-600,-600,-600,-600,-600,-600,-600,-600,-600,-600,-600,,,,,,,,,,,,,,,,,,,,,
-600,-600,-600,-600,-600,-600,-600,-600,-600,-600,-600,-600,-600,-600,-600,-600,-600,-600,,,,,,,,,,,,,,,,,,,,,
-600,-600,-600,-600,-600,-600,-600,-600,-600,-600,-600,-600,-600,-600,-600,-600,-600,-600,,,,,,,,,,,,,,,,,,,,,
-600,-600,-600,-600,-600,-600,-600,-600,-600,-600,-600,-600,-600,-600,-600,-600,-600,-600,,,,,,,,,,,,,,,,,,,,,
-600,-600,-600,-600,-600,-600,-600,-600,-600,-600,-600,-600,-600,-600,-600,-600,-600,-600,,,,,,,,,,,,,,,,,,,,,
-600,-600,-600,-600,-600,-600,-600,-600,-600,-600,-600,-600,-600,-600,-600,-600,-600,-600,,,,,,,,,,,,,,,,,,,,,
-1000,-600,-600,-600,-600,-600,-600,-600,-600,-600,-600,-600,-600,-600,-600,-600,-600,-1600,,,,,,,,,,,,,,,,,,,,,
-3000,-2000,-2000,-2000,-2000,-2000,-2000,-2000,-2000,-2000,-2000,-2000,-2000,-2000,-2000,-2000,-2000,-3000,,,,,,,,,,,,,,,,,,,,,
#,raw_col_delta_max,,,,,,,,,,,,,,,,,,,,,,,,,,,,,,,,,,,,,
2400,1700,1700,1700,1700,1700,1700,2400,1700,2400,1700,1700,1700,1700,1700,1700,2400,,,,,,,,,,,,,,,,,,,,,,
1000,500,500,500,500,500,500,1800,500,1800,500,500,500,500,500,500,1200,,,,,,,,,,,,,,,,,,,,,,
500,500,500,500,500,500,500,500,500,500,500,500,500,500,500,500,500,,,,,,,,,,,,,,,,,,,,,,
500,500,500,500,500,500,500,500,500,500,500,500,500,500,500,500,500,,,,,,,,,,,,,,,,,,,,,,
500,500,500,500,500,500,500,500,500,500,500,500,500,500,500,500,500,,,,,,,,,,,,,,,,,,,,,,
500,500,500,500,500,500,500,500,500,500,500,500,500,500,500,500,500,,,,,,,,,,,,,,,,,,,,,,
500,500,500,500,500,500,500,500,500,500,500,500,500,500,500,500,500,,,,,,,,,,,,,,,,,,,,,,
500,500,500,500,500,500,500,500,500,500,500,500,500,500,500,500,500,,,,,,,,,,,,,,,,,,,,,,
500,500,500,500,500,500,500,500,500,500,500,500,500,500,500,500,500,,,,,,,,,,,,,,,,,,,,,,
500,500,500,500,500,500,500,500,500,500,500,500,500,500,500,500,500,,,,,,,,,,,,,,,,,,,,,,
500,500,500,500,500,500,500,500,500,500,500,500,500,500,500,500,500,,,,,,,,,,,,,,,,,,,,,,
500,500,500,500,500,500,500,500,500,500,500,500,500,500,500,500,500,,,,,,,,,,,,,,,,,,,,,,
500,500,500,500,500,500,500,500,500,500,500,500,500,500,500,500,500,,,,,,,,,,,,,,,,,,,,,,
500,500,500,500,500,500,500,500,500,500,500,500,500,500,500,500,500,,,,,,,,,,,,,,,,,,,,,,
500,500,500,500,500,500,500,500,500,500,500,500,500,500,500,500,500,,,,,,,,,,,,,,,,,,,,,,
500,500,500,500,500,500,500,500,500,500,500,500,500,500,500,500,500,,,,,,,,,,,,,,,,,,,,,,
500,500,500,500,500,500,500,500,500,500,500,500,500,500,500,500,500,,,,,,,,,,,,,,,,,,,,,,
500,500,500,500,500,500,500,500,500,500,500,500,500,500,500,500,500,,,,,,,,,,,,,,,,,,,,,,
500,500,500,500,500,500,500,800,800,500,500,500,500,500,500,500,500,,,,,,,,,,,,,,,,,,,,,,
500,500,500,500,500,500,500,500,500,500,500,500,500,500,500,500,500,,,,,,,,,,,,,,,,,,,,,,
500,500,500,500,500,500,500,500,500,500,500,500,500,500,500,500,500,,,,,,,,,,,,,,,,,,,,,,
500,500,500,500,500,500,500,500,500,500,500,500,500,500,500,500,500,,,,,,,,,,,,,,,,,,,,,,
500,500,500,500,500,500,500,500,500,500,500,500,500,500,500,500,500,,,,,,,,,,,,,,,,,,,,,,
500,500,500,500,500,500,500,500,500,500,500,500,500,500,500,500,500,,,,,,,,,,,,,,,,,,,,,,
500,500,500,500,500,500,500,500,500,500,500,500,500,500,500,500,500,,,,,,,,,,,,,,,,,,,,,,
500,500,500,500,500,500,500,500,500,500,500,500,500,500,500,500,500,,,,,,,,,,,,,,,,,,,,,,
500,500,500,500,500,500,500,500,500,500,500,500,500,500,500,500,500,,,,,,,,,,,,,,,,,,,,,,
500,500,500,500,500,500,500,500,500,500,500,500,500,500,500,500,500,,,,,,,,,,,,,,,,,,,,,,
500,500,500,500,500,500,500,500,500,500,500,500,500,500,500,500,500,,,,,,,,,,,,,,,,,,,,,,
500,500,500,500,500,500,500,500,500,500,500,500,500,500,500,500,500,,,,,,,,,,,,,,,,,,,,,,
500,500,500,500,500,500,500,500,500,500,500,500,500,500,500,500,500,,,,,,,,,,,,,,,,,,,,,,
500,500,500,500,500,500,500,500,500,500,500,500,500,500,500,500,500,,,,,,,,,,,,,,,,,,,,,,
500,500,500,500,500,500,500,500,500,500,500,500,500,500,500,500,500,,,,,,,,,,,,,,,,,,,,,,
500,500,500,500,500,500,500,500,500,500,500,500,500,500,500,500,500,,,,,,,,,,,,,,,,,,,,,,
500,500,500,500,500,500,500,500,500,500,500,500,500,500,500,500,500,,,,,,,,,,,,,,,,,,,,,,
500,500,500,500,500,500,500,500,500,500,500,500,500,500,500,500,500,,,,,,,,,,,,,,,,,,,,,,
500,500,500,500,500,500,500,500,500,500,500,500,500,500,500,500,500,,,,,,,,,,,,,,,,,,,,,,
800,500,500,500,500,500,500,500,500,500,500,500,500,500,500,500,1500,,,,,,,,,,,,,,,,,,,,,,
2400,900,900,900,900,900,900,900,900,900,900,900,900,900,900,900,2400,,,,,,,,,,,,,,,,,,,,,,
#,raw_col_delta_min,,,,,,,,,,,,,,,,,,,,,,,,,,,,,,,,,,,,,
-2400,-1700,-1700,-1700,-1700,-1700,-1700,-2400,-1700,-2400,-1700,-1700,-1700,-1700,-1700,-1700,-2400,,,,,,,,,,,,,,,,,,,,,,
-1000,-500,-500,-500,-500,-500,-500,-1800,-500,-1800,-500,-500,-500,-500,-500,-500,-1200,,,,,,,,,,,,,,,,,,,,,,
-500,-500,-500,-500,-500,-500,-500,-500,-500,-500,-500,-500,-500,-500,-500,-500,-500,,,,,,,,,,,,,,,,,,,,,,
-500,-500,-500,-500,-500,-500,-500,-500,-500,-500,-500,-500,-500,-500,-500,-500,-500,,,,,,,,,,,,,,,,,,,,,,
-500,-500,-500,-500,-500,-500,-500,-500,-500,-500,-500,-500,-500,-500,-500,-500,-500,,,,,,,,,,,,,,,,,,,,,,
-500,-500,-500,-500,-500,-500,-500,-500,-500,-500,-500,-500,-500,-500,-500,-500,-500,,,,,,,,,,,,,,,,,,,,,,
-500,-500,-500,-500,-500,-500,-500,-500,-500,-500,-500,-500,-500,-500,-500,-500,-500,,,,,,,,,,,,,,,,,,,,,,
-500,-500,-500,-500,-500,-500,-500,-500,-500,-500,-500,-500,-500,-500,-500,-500,-500,,,,,,,,,,,,,,,,,,,,,,
-500,-500,-500,-500,-500,-500,-500,-500,-500,-500,-500,-500,-500,-500,-500,-500,-500,,,,,,,,,,,,,,,,,,,,,,
-500,-500,-500,-500,-500,-500,-500,-500,-500,-500,-500,-500,-500,-500,-500,-500,-500,,,,,,,,,,,,,,,,,,,,,,
-500,-500,-500,-500,-500,-500,-500,-500,-500,-500,-500,-500,-500,-500,-500,-500,-500,,,,,,,,,,,,,,,,,,,,,,
-500,-500,-500,-500,-500,-500,-500,-500,-500,-500,-500,-500,-500,-500,-500,-500,-500,,,,,,,,,,,,,,,,,,,,,,
-500,-500,-500,-500,-500,-500,-500,-500,-500,-500,-500,-500,-500,-500,-500,-500,-500,,,,,,,,,,,,,,,,,,,,,,
-500,-500,-500,-500,-500,-500,-500,-500,-500,-500,-500,-500,-500,-500,-500,-500,-500,,,,,,,,,,,,,,,,,,,,,,
-500,-500,-500,-500,-500,-500,-500,-500,-500,-500,-500,-500,-500,-500,-500,-500,-500,,,,,,,,,,,,,,,,,,,,,,
-500,-500,-500,-500,-500,-500,-500,-500,-500,-500,-500,-500,-500,-500,-500,-500,-500,,,,,,,,,,,,,,,,,,,,,,
-500,-500,-500,-500,-500,-500,-500,-500,-500,-500,-500,-500,-500,-500,-500,-500,-500,,,,,,,,,,,,,,,,,,,,,,
-500,-500,-500,-500,-500,-500,-500,-500,-500,-500,-500,-500,-500,-500,-500,-500,-500,,,,,,,,,,,,,,,,,,,,,,
-500,-500,-500,-500,-500,-500,-500,-800,-800,-500,-500,-500,-500,-500,-500,-500,-500,,,,,,,,,,,,,,,,,,,,,,
-500,-500,-500,-500,-500,-500,-500,-500,-500,-500,-500,-500,-500,-500,-500,-500,-500,,,,,,,,,,,,,,,,,,,,,,
-500,-500,-500,-500,-500,-500,-500,-500,-500,-500,-500,-500,-500,-500,-500,-500,-500,,,,,,,,,,,,,,,,,,,,,,
-500,-500,-500,-500,-500,-500,-500,-500,-500,-500,-500,-500,-500,-500,-500,-500,-500,,,,,,,,,,,,,,,,,,,,,,
-500,-500,-500,-500,-500,-500,-500,-500,-500,-500,-500,-500,-500,-500,-500,-500,-500,,,,,,,,,,,,,,,,,,,,,,
-500,-500,-500,-500,-500,-500,-500,-500,-500,-500,-500,-500,-500,-500,-500,-500,-500,,,,,,,,,,,,,,,,,,,,,,
-500,-500,-500,-500,-500,-500,-500,-500,-500,-500,-500,-500,-500,-500,-500,-500,-500,,,,,,,,,,,,,,,,,,,,,,
-500,-500,-500,-500,-500,-500,-500,-500,-500,-500,-500,-500,-500,-500,-500,-500,-500,,,,,,,,,,,,,,,,,,,,,,
-500,-500,-500,-500,-500,-500,-500,-500,-500,-500,-500,-500,-500,-500,-500,-500,-500,,,,,,,,,,,,,,,,,,,,,,
-500,-500,-500,-500,-500,-500,-500,-500,-500,-500,-500,-500,-500,-500,-500,-500,-500,,,,,,,,,,,,,,,,,,,,,,
-500,-500,-500,-500,-500,-500,-500,-500,-500,-500,-500,-500,-500,-500,-500,-500,-500,,,,,,,,,,,,,,,,,,,,,,
-500,-500,-500,-500,-500,-500,-500,-500,-500,-500,-500,-500,-500,-500,-500,-500,-500,,,,,,,,,,,,,,,,,,,,,,
-500,-500,-500,-500,-500,-500,-500,-500,-500,-500,-500,-500,-500,-500,-500,-500,-500,,,,,,,,,,,,,,,,,,,,,,
-500,-500,-500,-500,-500,-500,-500,-500,-500,-500,-500,-500,-500,-500,-500,-500,-500,,,,,,,,,,,,,,,,,,,,,,
-500,-500,-500,-500,-500,-500,-500,-500,-500,-500,-500,-500,-500,-500,-500,-500,-500,,,,,,,,,,,,,,,,,,,,,,
-500,-500,-500,-500,-500,-500,-500,-500,-500,-500,-500,-500,-500,-500,-500,-500,-500,,,,,,,,,,,,,,,,,,,,,,
-500,-500,-500,-500,-500,-500,-500,-500,-500,-500,-500,-500,-500,-500,-500,-500,-500,,,,,,,,,,,,,,,,,,,,,,
-500,-500,-500,-500,-500,-500,-500,-500,-500,-500,-500,-500,-500,-500,-500,-500,-500,,,,,,,,,,,,,,,,,,,,,,
-500,-500,-500,-500,-500,-500,-500,-500,-500,-500,-500,-500,-500,-500,-500,-500,-500,,,,,,,,,,,,,,,,,,,,,,
-800,-500,-500,-500,-500,-500,-500,-500,-500,-500,-500,-500,-500,-500,-500,-500,-1500,,,,,,,,,,,,,,,,,,,,,,
-2400,-900,-900,-900,-900,-900,-900,-900,-900,-900,-900,-900,-900,-900,-900,-900,-2400,,,,,,,,,,,,,,,,,,,,,,
#,line_max,,,,,,,,,,,,,,,,,,,,,,,,,,,,,,,,,,,,,
47369,61274,59300,56875,52353,49494,47544,46266,46101,46143,46039,46074,46179,46228,46084,46008,46050,46158,,,,,,,,,,,,,,,,,,,,,
48167,52462,53210,51780,50893,50131,49743,49533,49414,49169,49274,48835,48660,48371,48593,48297,48275,48289,48276,47991,47995,47921,48114,48254,47940,47998,47891,47932,47978,48189,48178,48303,48453,48485,48488,48482,48677,48341,47804
#,line_min,,,,,,,,,,,,,,,,,,,,,,,,,,,,,,,,,,,,,
20301,26260,25414,24375,22437,21212,20376,19828,19757,19775,19731,19746,19791,19812,19750,19718,19736,19782,,,,,,,,,,,,,,,,,,,,,
20643,22484,22804,22192,21811,21485,21319,21229,21178,21073,21118,20929,20854,20731,20825,20699,20689,20695,20690,20567,20569,20537,20620,20680,20546,20570,20525,20542,20562,20653,20648,20701,20765,20779,20780,20778,20861,20717,20488
