#,version,,,,,,,,,,,,,,,,,,,,,,,,,,,,,,,,,,,,,
2022,1,10,1,,,,,,,,,,,,,,,,,,,,,,,,,,,,,,,,,,,
#,row_col_num,,,,,,,,,,,,,,,,,,,,,,,,,,,,,,,,,,,,,
39,18,,,,,,,,,,,,,,,,,,,,,,,,,,,,,,,,,,,,,
#,freq_noise,,,,,,,,,,,,,,,,,,,,,,,,,,,,,,,,,,,,,
-500,500,,,,,,,,,,,,,,,,,,,,,,,,,,,,,,,,,,,,,
#,raw_max,,,,,,,,,,,,,,,,,,,,,,,,,,,,,,,,,,,,,
20879,20148,20058,20186,20881,20251,19964,20228,20682,20428,19988,20044,20069,20650,20382,20209,20334,21090,,,,,,,,,,,,,,,,,,,,,
20304,20479,20482,20460,20444,20449,20454,20448,20395,20533,20444,20491,20453,20406,20498,20545,20416,20065,,,,,,,,,,,,,,,,,,,,,
20514,20462,20471,20454,20435,20441,20436,20440,20417,20410,20425,20424,20414,20404,20417,20435,20419,20370,,,,,,,,,,,,,,,,,,,,,
20353,20311,20322,20306,20287,20294,20291,20294,20417,20269,20279,20347,20267,20254,20268,20282,20266,20224,,,,,,,,,,,,,,,,,,,,,
20383,20348,20358,20346,20329,20333,20333,20336,20287,20299,20322,20316,20310,20294,20305,20321,20303,20266,,,,,,,,,,,,,,,,,,,,,
20458,20429,20441,20429,20412,20419,20416,20420,20372,20382,20405,20400,20392,20377,20389,20400,20383,20351,,,,,,,,,,,,,,,,,,,,,
20495,20472,20486,20474,20459,20467,20464,20467,20419,20429,20450,20447,20437,20423,20435,20446,20428,20396,,,,,,,,,,,,,,,,,,,,,
20450,20434,20447,20440,20424,20431,20429,20432,20382,20398,20416,20408,20401,20387,20396,20408,20390,20359,,,,,,,,,,,,,,,,,,,,,
20471,20459,20476,20466,20452,20461,20456,20461,20413,20423,20442,20437,20429,20413,20423,20431,20414,20387,,,,,,,,,,,,,,,,,,,,,
20430,20426,20444,20436,20422,20431,20429,20432,20386,20392,20413,20410,20400,20390,20393,20402,20384,20357,,,,,,,,,,,,,,,,,,,,,
20525,20527,20543,20538,20524,20532,20532,20536,20485,20497,20522,20509,20502,20486,20492,20503,20486,20452,,,,,,,,,,,,,,,,,,,,,
20503,20503,20521,20514,20501,20512,20509,20514,20467,20476,20495,20490,20480,20464,20472,20480,20470,20434,,,,,,,,,,,,,,,,,,,,,
20510,20512,20530,20522,20509,20521,20518,20522,20473,20483,20503,20498,20495,20472,20479,20488,20472,20443,,,,,,,,,,,,,,,,,,,,,
20460,20466,20482,20477,20464,20473,20473,20489,20426,20438,20459,20453,20446,20428,20434,20452,20429,20398,,,,,,,,,,,,,,,,,,,,,
20447,20459,20474,20467,20455,20466,20464,20478,20423,20432,20453,20449,20440,20423,20437,20440,20425,20398,,,,,,,,,,,,,,,,,,,,,
20189,20213,20228,20220,20209,20221,20220,20234,20180,20196,20210,20206,20196,20180,20189,20197,20182,20153,,,,,,,,,,,,,,,,,,,,,
20129,20161,20173,20167,20156,20166,20168,20183,20126,20138,20159,20158,20146,20130,20136,20148,20132,20101,,,,,,,,,,,,,,,,,,,,,
20218,20246,20261,20254,20240,20254,20255,20268,20214,20224,20243,20240,20232,20216,20225,20233,20219,20202,,,,,,,,,,,,,,,,,,,,,
20352,20380,20394,20386,20371,20384,20389,20401,20364,20353,20372,20370,20363,20347,20356,20365,20351,20338,,,,,,,,,,,,,,,,,,,,,
20192,20227,20238,20233,20218,20231,20243,20260,20353,20204,20220,20255,20208,20194,20201,20213,20200,20184,,,,,,,,,,,,,,,,,,,,,
20102,20137,20150,20144,20130,20142,20142,20143,20149,20162,20182,20178,20170,20154,20165,20176,20162,20146,,,,,,,,,,,,,,,,,,,,,
20173,20174,20184,20177,20162,20174,20173,20177,20183,20195,20214,20209,20202,20188,20197,20209,20197,20182,,,,,,,,,,,,,,,,,,,,,
20158,20197,20209,20206,20190,20200,20202,20204,20207,20222,20242,20234,20231,20218,20224,20238,20226,20210,,,,,,,,,,,,,,,,,,,,,
20287,20309,20269,20231,20215,20227,20233,20228,20234,20246,20267,20262,20255,20242,20250,20262,20252,20242,,,,,,,,,,,,,,,,,,,,,
20280,20323,20339,20332,20316,20328,20326,20327,20333,20346,20366,20364,20357,20342,20351,20364,20356,20347,,,,,,,,,,,,,,,,,,,,,
20255,20264,20278,20269,20261,20263,20262,20263,20268,20285,20306,20300,20296,20282,20290,20305,20296,20286,,,,,,,,,,,,,,,,,,,,,
20342,20398,20411,20402,20396,20399,20396,20399,20405,20419,20441,20438,20431,20418,20428,20442,20431,20428,,,,,,,,,,,,,,,,,,,,,
20352,20405,20416,20407,20400,20407,20400,20402,20410,20423,20446,20442,20436,20424,20435,20449,20441,20442,,,,,,,,,,,,,,,,,,,,,
20388,20438,20444,20438,20431,20440,20431,20432,20440,20455,20477,20471,20467,20456,20465,20482,20476,20474,,,,,,,,,,,,,,,,,,,,,
20386,20438,20448,20437,20429,20442,20430,20431,20438,20454,20476,20473,20468,20458,20468,20484,20478,20479,,,,,,,,,,,,,,,,,,,,,
20442,20494,20508,20491,20482,20495,20485,20484,20492,20507,20528,20525,20521,20510,20521,20537,20532,20537,,,,,,,,,,,,,,,,,,,,,
20318,20329,20305,20294,20285,20296,20292,20287,20292,20310,20330,20324,20323,20314,20322,20340,20335,20341,,,,,,,,,,,,,,,,,,,,,
20076,20138,20144,20132,20129,20136,20134,20124,20131,20146,20168,20166,20161,20148,20160,20176,20171,20174,,,,,,,,,,,,,,,,,,,,,
20222,20272,20275,20263,20254,20264,20262,20260,20258,20274,20296,20293,20287,20275,20287,20303,20299,20306,,,,,,,,,,,,,,,,,,,,,
20312,20352,20344,20333,20322,20329,20328,20323,20320,20338,20359,20353,20351,20339,20347,20366,20365,20370,,,,,,,,,,,,,,,,,,,,,
20245,20260,20252,20239,20226,20236,20233,20234,20225,20239,20263,20258,20254,20240,20251,20269,20267,20272,,,,,,,,,,,,,,,,,,,,,
20227,20225,20212,20194,20179,20191,20196,20192,20186,20198,20220,20214,20206,20191,20202,20220,20215,20216,,,,,,,,,,,,,,,,,,,,,
20236,20390,20358,20335,20320,20335,20330,20334,20338,20344,20360,20348,20341,20323,20328,20345,20328,19756,,,,,,,,,,,,,,,,,,,,,
20338,20141,19958,20191,19979,20242,20628,20230,20296,20309,20124,20090,20483,20452,20341,20006,20410,21193,,,,,,,,,,,,,,,,,,,,,
#,raw_min,,,,,,,,,,,,,,,,,,,,,,,,,,,,,,,,,,,,,
13919,13432,13372,13458,13921,13501,13310,13486,13788,13618,13326,13362,13379,13766,13588,13473,13556,14060,,,,,,,,,,,,,,,,,,,,,
13536,13653,13654,13640,13630,13633,13636,13632,13597,13689,13630,13661,13635,13604,13666,13697,13610,13377,,,,,,,,,,,,,,,,,,,,,
13676,13642,13647,13636,13623,13627,13624,13626,13611,13606,13617,13616,13610,13602,13611,13623,13613,13580,,,,,,,,,,,,,,,,,,,,,
13569,13541,13548,13538,13525,13530,13527,13530,13611,13513,13519,13565,13511,13502,13512,13522,13510,13482,,,,,,,,,,,,,,,,,,,,,
13589,13566,13572,13564,13553,13555,13555,13558,13525,13533,13548,13544,13540,13530,13537,13547,13535,13510,,,,,,,,,,,,,,,,,,,,,
13638,13619,13627,13619,13608,13613,13610,13614,13582,13588,13603,13600,13594,13585,13593,13600,13589,13567,,,,,,,,,,,,,,,,,,,,,
13663,13648,13658,13650,13639,13645,13642,13645,13613,13619,13634,13631,13625,13615,13623,13630,13618,13598,,,,,,,,,,,,,,,,,,,,,
13634,13622,13631,13626,13616,13621,13619,13622,13588,13598,13610,13606,13601,13591,13598,13606,13594,13573,,,,,,,,,,,,,,,,,,,,,
13647,13639,13650,13644,13634,13641,13638,13641,13609,13615,13628,13625,13619,13609,13615,13621,13610,13591,,,,,,,,,,,,,,,,,,,,,
13620,13618,13630,13624,13614,13621,13619,13622,13590,13594,13609,13606,13600,13594,13595,13602,13590,13571,,,,,,,,,,,,,,,,,,,,,
13683,13685,13695,13692,13682,13688,13688,13690,13657,13665,13682,13673,13668,13658,13662,13669,13658,13634,,,,,,,,,,,,,,,,,,,,,
13669,13669,13681,13676,13667,13674,13673,13676,13645,13650,13663,13660,13654,13642,13648,13654,13646,13622,,,,,,,,,,,,,,,,,,,,,
13674,13674,13686,13682,13673,13681,13678,13682,13649,13655,13669,13666,13663,13648,13653,13658,13648,13629,,,,,,,,,,,,,,,,,,,,,
13640,13644,13654,13651,13642,13649,13649,13659,13618,13626,13639,13635,13630,13618,13622,13634,13619,13598,,,,,,,,,,,,,,,,,,,,,
13631,13639,13650,13645,13637,13644,13642,13652,13615,13622,13635,13633,13626,13615,13625,13626,13617,13598,,,,,,,,,,,,,,,,,,,,,
13459,13475,13486,13480,13473,13481,13480,13490,13454,13464,13474,13470,13464,13454,13459,13465,13454,13435,,,,,,,,,,,,,,,,,,,,,
13419,13441,13449,13445,13438,13444,13446,13455,13418,13426,13439,13438,13430,13420,13424,13432,13422,13401,,,,,,,,,,,,,,,,,,,,,
13478,13498,13507,13502,13494,13502,13503,13512,13476,13482,13495,13494,13488,13478,13483,13489,13479,13468,,,,,,,,,,,,,,,,,,,,,
13568,13586,13596,13590,13581,13590,13593,13601,13576,13569,13582,13580,13575,13565,13570,13577,13567,13558,,,,,,,,,,,,,,,,,,,,,
13462,13485,13492,13489,13478,13487,13495,13506,13569,13470,13480,13503,13472,13462,13467,13475,13466,13456,,,,,,,,,,,,,,,,,,,,,
13402,13425,13434,13430,13420,13428,13428,13429,13433,13442,13454,13452,13446,13436,13443,13450,13442,13430,,,,,,,,,,,,,,,,,,,,,
13449,13450,13456,13451,13442,13450,13449,13451,13455,13463,13476,13473,13468,13458,13465,13473,13465,13454,,,,,,,,,,,,,,,,,,,,,
13438,13465,13473,13470,13460,13466,13468,13470,13471,13482,13494,13490,13487,13478,13482,13492,13484,13474,,,,,,,,,,,,,,,,,,,,,
13525,13539,13513,13487,13477,13485,13489,13486,13490,13498,13511,13508,13503,13494,13500,13508,13502,13494,,,,,,,,,,,,,,,,,,,,,
13520,13549,13559,13554,13544,13552,13550,13551,13555,13564,13578,13576,13571,13562,13567,13576,13570,13565,,,,,,,,,,,,,,,,,,,,,
13503,13510,13518,13513,13507,13509,13508,13509,13512,13523,13538,13534,13530,13522,13526,13537,13530,13524,,,,,,,,,,,,,,,,,,,,,
13562,13598,13607,13602,13598,13599,13598,13599,13603,13613,13627,13626,13621,13612,13618,13628,13621,13618,,,,,,,,,,,,,,,,,,,,,
13568,13603,13610,13605,13600,13605,13600,13602,13606,13615,13630,13628,13624,13616,13623,13633,13627,13628,,,,,,,,,,,,,,,,,,,,,
13592,13626,13630,13626,13621,13626,13621,13622,13626,13637,13651,13647,13645,13638,13643,13654,13650,13650,,,,,,,,,,,,,,,,,,,,,
13590,13626,13632,13625,13619,13628,13620,13621,13626,13636,13650,13649,13646,13638,13646,13656,13652,13653,,,,,,,,,,,,,,,,,,,,,
13628,13662,13672,13661,13654,13663,13657,13656,13662,13671,13686,13683,13681,13674,13681,13691,13688,13691,,,,,,,,,,,,,,,,,,,,,
13546,13553,13537,13530,13523,13530,13528,13525,13528,13540,13554,13550,13549,13542,13548,13560,13557,13561,,,,,,,,,,,,,,,,,,,,,
13384,13426,13430,13422,13419,13424,13422,13416,13421,13430,13446,13444,13441,13432,13440,13450,13447,13450,,,,,,,,,,,,,,,,,,,,,
13482,13514,13517,13509,13502,13510,13508,13506,13506,13516,13530,13529,13525,13517,13525,13535,13533,13538,,,,,,,,,,,,,,,,,,,,,
13542,13568,13562,13555,13548,13553,13552,13549,13546,13558,13573,13569,13567,13559,13565,13578,13577,13580,,,,,,,,,,,,,,,,,,,,,
13497,13506,13502,13493,13484,13490,13489,13490,13483,13493,13509,13506,13502,13494,13501,13513,13511,13514,,,,,,,,,,,,,,,,,,,,,
13485,13483,13474,13462,13453,13461,13464,13462,13458,13466,13480,13476,13470,13461,13468,13480,13477,13478,,,,,,,,,,,,,,,,,,,,,
13490,13594,13572,13557,13546,13557,13554,13556,13558,13562,13574,13566,13561,13549,13552,13563,13552,13170,,,,,,,,,,,,,,,,,,,,,
13558,13427,13306,13461,13319,13494,13752,13486,13530,13539,13416,13394,13655,13634,13561,13338,13606,14129,,,,,,,,,,,,,,,,,,,,,
#,raw_row_delta_max,,,,,,,,,,,,,,,,,,,,,,,,,,,,,,,,,,,,,
3000,1500,1500,1500,1500,1500,1500,1500,1500,1500,1500,1500,1500,1500,1500,1500,1500,3000,,,,,,,,,,,,,,,,,,,,,
1000,1000,1000,1000,1000,1000,1000,1000,1500,1500,1000,1000,1000,1000,1000,1000,1000,1000,,,,,,,,,,,,,,,,,,,,,
1000,1000,1000,1000,1000,1000,1000,1000,1000,1000,1000,1000,1000,1000,1000,1000,1000,1000,,,,,,,,,,,,,,,,,,,,,
1000,1000,1000,1000,1000,1000,1000,1000,1000,1000,1000,1000,1000,1000,1000,1000,1000,1000,,,,,,,,,,,,,,,,,,,,,
1000,1000,1000,1000,1000,1000,1000,1000,1000,1000,1000,1000,1000,1000,1000,1000,1000,1000,,,,,,,,,,,,,,,,,,,,,
1000,1000,1000,1000,1000,1000,1000,1000,1000,1000,1000,1000,1000,1000,1000,1000,1000,1000,,,,,,,,,,,,,,,,,,,,,
1000,1000,1000,1000,1000,1000,1000,1000,1000,1000,1000,1000,1000,1000,1000,1000,1000,1000,,,,,,,,,,,,,,,,,,,,,
1000,1000,1000,1000,1000,1000,1000,1000,1000,1000,1000,1000,1000,1000,1000,1000,1000,1000,,,,,,,,,,,,,,,,,,,,,
1000,1000,1000,1000,1000,1000,1000,1000,1000,1000,1000,1000,1000,1000,1000,1000,1000,1000,,,,,,,,,,,,,,,,,,,,,
1000,1000,1000,1000,1000,1000,1000,1000,1000,1000,1000,1000,1000,1000,1000,1000,1000,1000,,,,,,,,,,,,,,,,,,,,,
1000,1000,1000,1000,1000,1000,1000,1000,1000,1000,1000,1000,1000,1000,1000,1000,1000,1000,,,,,,,,,,,,,,,,,,,,,
1000,1000,1000,1000,1000,1000,1000,1000,1000,1000,1000,1000,1000,1000,1000,1000,1000,1000,,,,,,,,,,,,,,,,,,,,,
1000,1000,1000,1000,1000,1000,1000,1000,1000,1000,1000,1000,1000,1000,1000,1000,1000,1000,,,,,,,,,,,,,,,,,,,,,
1000,1000,1000,1000,1000,1000,1000,1000,1000,1000,1000,1000,1000,1000,1000,1000,1000,1000,,,,,,,,,,,,,,,,,,,,,
1000,1000,1000,1000,1000,1000,1000,1000,1000,1000,1000,1000,1000,1000,1000,1000,1000,1000,,,,,,,,,,,,,,,,,,,,,
1000,1000,1000,1000,1000,1000,1000,1000,1000,1000,1000,1000,1000,1000,1000,1000,1000,1000,,,,,,,,,,,,,,,,,,,,,
1000,1000,1000,1000,1000,1000,1000,1000,1000,1000,1000,1000,1000,1000,1000,1000,1000,1000,,,,,,,,,,,,,,,,,,,,,
1000,1000,1000,1000,1000,1000,1000,1000,1000,1000,1000,1000,1000,1000,1000,1000,1000,1000,,,,,,,,,,,,,,,,,,,,,
1000,1000,1000,1000,1000,1000,1000,1000,1000,1000,1000,1000,1000,1000,1000,1000,1000,1000,,,,,,,,,,,,,,,,,,,,,
1000,1000,1000,1000,1000,1000,1000,1000,1000,1000,1000,1000,1000,1000,1000,1000,1000,1000,,,,,,,,,,,,,,,,,,,,,
1000,1000,1000,1000,1000,1000,1000,1000,1000,1000,1000,1000,1000,1000,1000,1000,1000,1000,,,,,,,,,,,,,,,,,,,,,
1000,1000,1000,1000,1000,1000,1000,1000,1000,1000,1000,1000,1000,1000,1000,1000,1000,1000,,,,,,,,,,,,,,,,,,,,,
1000,1000,1000,1000,1000,1000,1000,1000,1000,1000,1000,1000,1000,1000,1000,1000,1000,1000,,,,,,,,,,,,,,,,,,,,,
1000,1000,1000,1000,1000,1000,1000,1000,1000,1000,1000,1000,1000,1000,1000,1000,1000,1000,,,,,,,,,,,,,,,,,,,,,
1000,1000,1000,1000,1000,1000,1000,1000,1000,1000,1000,1000,1000,1000,1000,1000,1000,1000,,,,,,,,,,,,,,,,,,,,,
1000,1000,1000,1000,1000,1000,1000,1000,1000,1000,1000,1000,1000,1000,1000,1000,1000,1000,,,,,,,,,,,,,,,,,,,,,
1000,1000,1000,1000,1000,1000,1000,1000,1000,1000,1000,1000,1000,1000,1000,1000,1000,1000,,,,,,,,,,,,,,,,,,,,,
1000,1000,1000,1000,1000,1000,1000,1000,1000,1000,1000,1000,1000,1000,1000,1000,1000,1000,,,,,,,,,,,,,,,,,,,,,
1000,1000,1000,1000,1000,1000,1000,1000,1000,1000,1000,1000,1000,1000,1000,1000,1000,1000,,,,,,,,,,,,,,,,,,,,,
1000,1000,1000,1000,1000,1000,1000,1000,1000,1000,1000,1000,1000,1000,1000,1000,1000,1000,,,,,,,,,,,,,,,,,,,,,
1000,1000,1000,1000,1000,1000,1000,1000,1000,1000,1000,1000,1000,1000,1000,1000,1000,1000,,,,,,,,,,,,,,,,,,,,,
1000,1000,1000,1000,1000,1000,1000,1000,1000,1000,1000,1000,1000,1000,1000,1000,1000,1000,,,,,,,,,,,,,,,,,,,,,
1000,1000,1000,1000,1000,1000,1000,1000,1000,1000,1000,1000,1000,1000,1000,1000,1000,1000,,,,,,,,,,,,,,,,,,,,,
1000,1000,1000,1000,1000,1000,1000,1000,1000,1000,1000,1000,1000,1000,1000,1000,1000,1000,,,,,,,,,,,,,,,,,,,,,
1000,1000,1000,1000,1000,1000,1000,1000,1000,1000,1000,1000,1000,1000,1000,1000,1000,1000,,,,,,,,,,,,,,,,,,,,,
1000,1000,1000,1000,1000,1000,1000,1000,1000,1000,1000,1000,1000,1000,1000,1000,1000,1000,,,,,,,,,,,,,,,,,,,,,
1000,1000,1000,1000,1000,1000,1000,1000,1000,1000,1000,1000,1000,1000,1000,1000,1000,1300,,,,,,,,,,,,,,,,,,,,,
3000,2000,2000,2000,2000,2000,2000,2000,2000,2000,2000,2000,2000,2000,2000,2000,2000,4500,,,,,,,,,,,,,,,,,,,,,
#,raw_row_delta_min,,,,,,,,,,,,,,,,,,,,,,,,,,,,,,,,,,,,,
-3000,-1500,-1500,-1500,-1500,-1500,-1500,-1500,-1500,-1500,-1500,-1500,-1500,-1500,-1500,-1500,-1500,-3000,,,,,,,,,,,,,,,,,,,,,
-1000,-1000,-1000,-1000,-1000,-1000,-1000,-1000,-1500,-1500,-1000,-1000,-1000,-1000,-1000,-1000,-1000,-1000,,,,,,,,,,,,,,,,,,,,,
-1000,-1000,-1000,-1000,-1000,-1000,-1000,-1000,-1000,-1000,-1000,-1000,-1000,-1000,-1000,-1000,-1000,-1000,,,,,,,,,,,,,,,,,,,,,
-1000,-1000,-1000,-1000,-1000,-1000,-1000,-1000,-1000,-1000,-1000,-1000,-1000,-1000,-1000,-1000,-1000,-1000,,,,,,,,,,,,,,,,,,,,,
-1000,-1000,-1000,-1000,-1000,-1000,-1000,-1000,-1000,-1000,-1000,-1000,-1000,-1000,-1000,-1000,-1000,-1000,,,,,,,,,,,,,,,,,,,,,
-1000,-1000,-1000,-1000,-1000,-1000,-1000,-1000,-1000,-1000,-1000,-1000,-1000,-1000,-1000,-1000,-1000,-1000,,,,,,,,,,,,,,,,,,,,,
-1000,-1000,-1000,-1000,-1000,-1000,-1000,-1000,-1000,-1000,-1000,-1000,-1000,-1000,-1000,-1000,-1000,-1000,,,,,,,,,,,,,,,,,,,,,
-1000,-1000,-1000,-1000,-1000,-1000,-1000,-1000,-1000,-1000,-1000,-1000,-1000,-1000,-1000,-1000,-1000,-1000,,,,,,,,,,,,,,,,,,,,,
-1000,-1000,-1000,-1000,-1000,-1000,-1000,-1000,-1000,-1000,-1000,-1000,-1000,-1000,-1000,-1000,-1000,-1000,,,,,,,,,,,,,,,,,,,,,
-1000,-1000,-1000,-1000,-1000,-1000,-1000,-1000,-1000,-1000,-1000,-1000,-1000,-1000,-1000,-1000,-1000,-1000,,,,,,,,,,,,,,,,,,,,,
-1000,-1000,-1000,-1000,-1000,-1000,-1000,-1000,-1000,-1000,-1000,-1000,-1000,-1000,-1000,-1000,-1000,-1000,,,,,,,,,,,,,,,,,,,,,
-1000,-1000,-1000,-1000,-1000,-1000,-1000,-1000,-1000,-1000,-1000,-1000,-1000,-1000,-1000,-1000,-1000,-1000,,,,,,,,,,,,,,,,,,,,,
-1000,-1000,-1000,-1000,-1000,-1000,-1000,-1000,-1000,-1000,-1000,-1000,-1000,-1000,-1000,-1000,-1000,-1000,,,,,,,,,,,,,,,,,,,,,
-1000,-1000,-1000,-1000,-1000,-1000,-1000,-1000,-1000,-1000,-1000,-1000,-1000,-1000,-1000,-1000,-1000,-1000,,,,,,,,,,,,,,,,,,,,,
-1000,-1000,-1000,-1000,-1000,-1000,-1000,-1000,-1000,-1000,-1000,-1000,-1000,-1000,-1000,-1000,-1000,-1000,,,,,,,,,,,,,,,,,,,,,
-1000,-1000,-1000,-1000,-1000,-1000,-1000,-1000,-1000,-1000,-1000,-1000,-1000,-1000,-1000,-1000,-1000,-1000,,,,,,,,,,,,,,,,,,,,,
-1000,-1000,-1000,-1000,-1000,-1000,-1000,-1000,-1000,-1000,-1000,-1000,-1000,-1000,-1000,-1000,-1000,-1000,,,,,,,,,,,,,,,,,,,,,
-1000,-1000,-1000,-1000,-1000,-1000,-1000,-1000,-1000,-1000,-1000,-1000,-1000,-1000,-1000,-1000,-1000,-1000,,,,,,,,,,,,,,,,,,,,,
-1000,-1000,-1000,-1000,-1000,-1000,-1000,-1000,-1000,-1000,-1000,-1000,-1000,-1000,-1000,-1000,-1000,-1000,,,,,,,,,,,,,,,,,,,,,
-1000,-1000,-1000,-1000,-1000,-1000,-1000,-1000,-1000,-1000,-1000,-1000,-1000,-1000,-1000,-1000,-1000,-1000,,,,,,,,,,,,,,,,,,,,,
-1000,-1000,-1000,-1000,-1000,-1000,-1000,-1000,-1000,-1000,-1000,-1000,-1000,-1000,-1000,-1000,-1000,-1000,,,,,,,,,,,,,,,,,,,,,
-1000,-1000,-1000,-1000,-1000,-1000,-1000,-1000,-1000,-1000,-1000,-1000,-1000,-1000,-1000,-1000,-1000,-1000,,,,,,,,,,,,,,,,,,,,,
-1000,-1000,-1000,-1000,-1000,-1000,-1000,-1000,-1000,-1000,-1000,-1000,-1000,-1000,-1000,-1000,-1000,-1000,,,,,,,,,,,,,,,,,,,,,
-1000,-1000,-1000,-1000,-1000,-1000,-1000,-1000,-1000,-1000,-1000,-1000,-1000,-1000,-1000,-1000,-1000,-1000,,,,,,,,,,,,,,,,,,,,,
-1000,-1000,-1000,-1000,-1000,-1000,-1000,-1000,-1000,-1000,-1000,-1000,-1000,-1000,-1000,-1000,-1000,-1000,,,,,,,,,,,,,,,,,,,,,
-1000,-1000,-1000,-1000,-1000,-1000,-1000,-1000,-1000,-1000,-1000,-1000,-1000,-1000,-1000,-1000,-1000,-1000,,,,,,,,,,,,,,,,,,,,,
-1000,-1000,-1000,-1000,-1000,-1000,-1000,-1000,-1000,-1000,-1000,-1000,-1000,-1000,-1000,-1000,-1000,-1000,,,,,,,,,,,,,,,,,,,,,
-1000,-1000,-1000,-1000,-1000,-1000,-1000,-1000,-1000,-1000,-1000,-1000,-1000,-1000,-1000,-1000,-1000,-1000,,,,,,,,,,,,,,,,,,,,,
-1000,-1000,-1000,-1000,-1000,-1000,-1000,-1000,-1000,-1000,-1000,-1000,-1000,-1000,-1000,-1000,-1000,-1000,,,,,,,,,,,,,,,,,,,,,
-1000,-1000,-1000,-1000,-1000,-1000,-1000,-1000,-1000,-1000,-1000,-1000,-1000,-1000,-1000,-1000,-1000,-1000,,,,,,,,,,,,,,,,,,,,,
-1000,-1000,-1000,-1000,-1000,-1000,-1000,-1000,-1000,-1000,-1000,-1000,-1000,-1000,-1000,-1000,-1000,-1000,,,,,,,,,,,,,,,,,,,,,
-1000,-1000,-1000,-1000,-1000,-1000,-1000,-1000,-1000,-1000,-1000,-1000,-1000,-1000,-1000,-1000,-1000,-1000,,,,,,,,,,,,,,,,,,,,,
-1000,-1000,-1000,-1000,-1000,-1000,-1000,-1000,-1000,-1000,-1000,-1000,-1000,-1000,-1000,-1000,-1000,-1000,,,,,,,,,,,,,,,,,,,,,
-1000,-1000,-1000,-1000,-1000,-1000,-1000,-1000,-1000,-1000,-1000,-1000,-1000,-1000,-1000,-1000,-1000,-1000,,,,,,,,,,,,,,,,,,,,,
-1000,-1000,-1000,-1000,-1000,-1000,-1000,-1000,-1000,-1000,-1000,-1000,-1000,-1000,-1000,-1000,-1000,-1000,,,,,,,,,,,,,,,,,,,,,
-1000,-1000,-1000,-1000,-1000,-1000,-1000,-1000,-1000,-1000,-1000,-1000,-1000,-1000,-1000,-1000,-1000,-1000,,,,,,,,,,,,,,,,,,,,,
-1000,-1000,-1000,-1000,-1000,-1000,-1000,-1000,-1000,-1000,-1000,-1000,-1000,-1000,-1000,-1000,-1000,-1300,,,,,,,,,,,,,,,,,,,,,
-3000,-2000,-2000,-2000,-2000,-2000,-2000,-2000,-2000,-2000,-2000,-2000,-2000,-2000,-2000,-2000,-2000,-4500,,,,,,,,,,,,,,,,,,,,,
#,raw_col_delta_max,,,,,,,,,,,,,,,,,,,,,,,,,,,,,,,,,,,,,
3000,1900,1900,1900,1900,1900,1900,2400,1900,2400,1900,1900,1900,1900,1900,1900,3000,,,,,,,,,,,,,,,,,,,,,,
700,700,700,700,700,700,1000,1800,700,1800,700,700,700,700,700,1000,700,,,,,,,,,,,,,,,,,,,,,,
700,500,500,500,500,500,500,500,500,500,500,500,500,500,500,500,700,,,,,,,,,,,,,,,,,,,,,,
700,500,500,500,500,500,500,500,500,500,500,500,500,500,500,500,700,,,,,,,,,,,,,,,,,,,,,,
700,500,500,500,500,500,500,500,500,500,500,500,500,500,500,500,700,,,,,,,,,,,,,,,,,,,,,,
700,500,500,500,500,500,500,500,500,500,500,500,500,500,500,500,700,,,,,,,,,,,,,,,,,,,,,,
700,500,500,500,500,500,500,500,500,500,500,500,500,500,500,500,700,,,,,,,,,,,,,,,,,,,,,,
700,500,500,500,500,500,500,500,500,500,500,500,500,500,500,500,700,,,,,,,,,,,,,,,,,,,,,,
700,500,500,500,500,500,500,500,500,500,500,500,500,500,500,500,700,,,,,,,,,,,,,,,,,,,,,,
700,500,500,500,500,500,500,500,500,500,500,500,500,500,500,500,700,,,,,,,,,,,,,,,,,,,,,,
700,500,500,500,500,500,500,500,500,500,500,500,500,500,500,500,700,,,,,,,,,,,,,,,,,,,,,,
700,500,500,500,500,500,500,500,500,500,500,500,500,500,500,500,700,,,,,,,,,,,,,,,,,,,,,,
700,500,500,500,500,500,500,500,500,500,500,500,500,500,500,500,700,,,,,,,,,,,,,,,,,,,,,,
700,500,500,500,500,500,500,500,500,500,500,500,500,500,500,500,700,,,,,,,,,,,,,,,,,,,,,,
700,500,500,500,500,500,500,500,500,500,500,500,500,500,500,500,700,,,,,,,,,,,,,,,,,,,,,,
700,500,500,500,500,500,500,500,500,500,500,500,500,500,500,500,700,,,,,,,,,,,,,,,,,,,,,,
700,500,500,500,500,500,500,500,500,500,500,500,500,500,500,500,700,,,,,,,,,,,,,,,,,,,,,,
700,500,500,500,500,500,500,500,500,500,500,500,500,500,500,500,700,,,,,,,,,,,,,,,,,,,,,,
700,500,500,500,500,500,500,1000,1000,500,500,500,500,500,500,500,700,,,,,,,,,,,,,,,,,,,,,,
700,500,500,500,500,500,500,500,500,500,500,500,500,500,500,500,700,,,,,,,,,,,,,,,,,,,,,,
700,500,500,500,500,500,500,500,500,500,500,500,500,500,500,500,700,,,,,,,,,,,,,,,,,,,,,,
700,500,500,500,500,500,500,500,500,500,500,500,500,500,500,500,700,,,,,,,,,,,,,,,,,,,,,,
700,500,500,500,500,500,500,500,500,500,500,500,500,500,500,500,700,,,,,,,,,,,,,,,,,,,,,,
700,500,500,500,500,500,500,500,500,500,500,500,500,500,500,500,700,,,,,,,,,,,,,,,,,,,,,,
700,500,500,500,500,500,500,500,500,500,500,500,500,500,500,500,700,,,,,,,,,,,,,,,,,,,,,,
700,500,500,500,500,500,500,500,500,500,500,500,500,500,500,500,700,,,,,,,,,,,,,,,,,,,,,,
700,500,500,500,500,500,500,500,500,500,500,500,500,500,500,500,700,,,,,,,,,,,,,,,,,,,,,,
700,500,500,500,500,500,500,500,500,500,500,500,500,500,500,500,700,,,,,,,,,,,,,,,,,,,,,,
700,500,500,500,500,500,500,500,500,500,500,500,500,500,500,500,700,,,,,,,,,,,,,,,,,,,,,,
700,500,500,500,500,500,500,500,500,500,500,500,500,500,500,500,700,,,,,,,,,,,,,,,,,,,,,,
700,500,500,500,500,500,500,500,500,500,500,500,500,500,500,500,700,,,,,,,,,,,,,,,,,,,,,,
700,500,500,500,500,500,500,500,500,500,500,500,500,500,500,500,700,,,,,,,,,,,,,,,,,,,,,,
700,500,500,500,500,500,500,500,500,500,500,500,500,500,500,500,700,,,,,,,,,,,,,,,,,,,,,,
700,500,500,500,500,500,500,500,500,500,500,500,500,500,500,500,700,,,,,,,,,,,,,,,,,,,,,,
700,500,500,500,500,500,500,500,500,500,500,500,500,500,500,500,700,,,,,,,,,,,,,,,,,,,,,,
700,500,500,500,500,500,500,500,500,500,500,500,500,500,500,500,700,,,,,,,,,,,,,,,,,,,,,,
700,500,500,500,500,500,500,500,500,500,500,500,500,500,500,500,700,,,,,,,,,,,,,,,,,,,,,,
1000,500,500,500,500,500,500,500,500,500,500,500,500,500,500,500,1500,,,,,,,,,,,,,,,,,,,,,,
3000,1000,1000,1000,1000,1000,1000,1000,1000,1000,1000,1000,1000,1000,1000,1000,3000,,,,,,,,,,,,,,,,,,,,,,
#,raw_col_delta_min,,,,,,,,,,,,,,,,,,,,,,,,,,,,,,,,,,,,,
-3000,-1900,-1900,-1900,-1900,-1900,-1900,-2400,-1900,-2400,-1900,-1900,-1900,-1900,-1900,-1900,-3000,,,,,,,,,,,,,,,,,,,,,,
-700,-700,-700,-700,-700,-700,-1000,-1800,-700,-1800,-700,-700,-700,-700,-700,-1000,-700,,,,,,,,,,,,,,,,,,,,,,
-700,-500,-500,-500,-500,-500,-500,-500,-500,-500,-500,-500,-500,-500,-500,-500,-700,,,,,,,,,,,,,,,,,,,,,,
-700,-500,-500,-500,-500,-500,-500,-500,-500,-500,-500,-500,-500,-500,-500,-500,-700,,,,,,,,,,,,,,,,,,,,,,
-700,-500,-500,-500,-500,-500,-500,-500,-500,-500,-500,-500,-500,-500,-500,-500,-700,,,,,,,,,,,,,,,,,,,,,,
-700,-500,-500,-500,-500,-500,-500,-500,-500,-500,-500,-500,-500,-500,-500,-500,-700,,,,,,,,,,,,,,,,,,,,,,
-700,-500,-500,-500,-500,-500,-500,-500,-500,-500,-500,-500,-500,-500,-500,-500,-700,,,,,,,,,,,,,,,,,,,,,,
-700,-500,-500,-500,-500,-500,-500,-500,-500,-500,-500,-500,-500,-500,-500,-500,-700,,,,,,,,,,,,,,,,,,,,,,
-700,-500,-500,-500,-500,-500,-500,-500,-500,-500,-500,-500,-500,-500,-500,-500,-700,,,,,,,,,,,,,,,,,,,,,,
-700,-500,-500,-500,-500,-500,-500,-500,-500,-500,-500,-500,-500,-500,-500,-500,-700,,,,,,,,,,,,,,,,,,,,,,
-700,-500,-500,-500,-500,-500,-500,-500,-500,-500,-500,-500,-500,-500,-500,-500,-700,,,,,,,,,,,,,,,,,,,,,,
-700,-500,-500,-500,-500,-500,-500,-500,-500,-500,-500,-500,-500,-500,-500,-500,-700,,,,,,,,,,,,,,,,,,,,,,
-700,-500,-500,-500,-500,-500,-500,-500,-500,-500,-500,-500,-500,-500,-500,-500,-700,,,,,,,,,,,,,,,,,,,,,,
-700,-500,-500,-500,-500,-500,-500,-500,-500,-500,-500,-500,-500,-500,-500,-500,-700,,,,,,,,,,,,,,,,,,,,,,
-700,-500,-500,-500,-500,-500,-500,-500,-500,-500,-500,-500,-500,-500,-500,-500,-700,,,,,,,,,,,,,,,,,,,,,,
-700,-500,-500,-500,-500,-500,-500,-500,-500,-500,-500,-500,-500,-500,-500,-500,-700,,,,,,,,,,,,,,,,,,,,,,
-700,-500,-500,-500,-500,-500,-500,-500,-500,-500,-500,-500,-500,-500,-500,-500,-700,,,,,,,,,,,,,,,,,,,,,,
-700,-500,-500,-500,-500,-500,-500,-500,-500,-500,-500,-500,-500,-500,-500,-500,-700,,,,,,,,,,,,,,,,,,,,,,
-700,-500,-500,-500,-500,-500,-500,-1000,-1000,-500,-500,-500,-500,-500,-500,-500,-700,,,,,,,,,,,,,,,,,,,,,,
-700,-500,-500,-500,-500,-500,-500,-500,-500,-500,-500,-500,-500,-500,-500,-500,-700,,,,,,,,,,,,,,,,,,,,,,
-700,-500,-500,-500,-500,-500,-500,-500,-500,-500,-500,-500,-500,-500,-500,-500,-700,,,,,,,,,,,,,,,,,,,,,,
-700,-500,-500,-500,-500,-500,-500,-500,-500,-500,-500,-500,-500,-500,-500,-500,-700,,,,,,,,,,,,,,,,,,,,,,
-700,-500,-500,-500,-500,-500,-500,-500,-500,-500,-500,-500,-500,-500,-500,-500,-700,,,,,,,,,,,,,,,,,,,,,,
-700,-500,-500,-500,-500,-500,-500,-500,-500,-500,-500,-500,-500,-500,-500,-500,-700,,,,,,,,,,,,,,,,,,,,,,
-700,-500,-500,-500,-500,-500,-500,-500,-500,-500,-500,-500,-500,-500,-500,-500,-700,,,,,,,,,,,,,,,,,,,,,,
-700,-500,-500,-500,-500,-500,-500,-500,-500,-500,-500,-500,-500,-500,-500,-500,-700,,,,,,,,,,,,,,,,,,,,,,
-700,-500,-500,-500,-500,-500,-500,-500,-500,-500,-500,-500,-500,-500,-500,-500,-700,,,,,,,,,,,,,,,,,,,,,,
-700,-500,-500,-500,-500,-500,-500,-500,-500,-500,-500,-500,-500,-500,-500,-500,-700,,,,,,,,,,,,,,,,,,,,,,
-700,-500,-500,-500,-500,-500,-500,-500,-500,-500,-500,-500,-500,-500,-500,-500,-700,,,,,,,,,,,,,,,,,,,,,,
-700,-500,-500,-500,-500,-500,-500,-500,-500,-500,-500,-500,-500,-500,-500,-500,-700,,,,,,,,,,,,,,,,,,,,,,
-700,-500,-500,-500,-500,-500,-500,-500,-500,-500,-500,-500,-500,-500,-500,-500,-700,,,,,,,,,,,,,,,,,,,,,,
-700,-500,-500,-500,-500,-500,-500,-500,-500,-500,-500,-500,-500,-500,-500,-500,-700,,,,,,,,,,,,,,,,,,,,,,
-700,-500,-500,-500,-500,-500,-500,-500,-500,-500,-500,-500,-500,-500,-500,-500,-700,,,,,,,,,,,,,,,,,,,,,,
-700,-500,-500,-500,-500,-500,-500,-500,-500,-500,-500,-500,-500,-500,-500,-500,-700,,,,,,,,,,,,,,,,,,,,,,
-700,-500,-500,-500,-500,-500,-500,-500,-500,-500,-500,-500,-500,-500,-500,-500,-700,,,,,,,,,,,,,,,,,,,,,,
-700,-500,-500,-500,-500,-500,-500,-500,-500,-500,-500,-500,-500,-500,-500,-500,-700,,,,,,,,,,,,,,,,,,,,,,
-700,-500,-500,-500,-500,-500,-500,-500,-500,-500,-500,-500,-500,-500,-500,-500,-700,,,,,,,,,,,,,,,,,,,,,,
-1000,-500,-500,-500,-500,-500,-500,-500,-500,-500,-500,-500,-500,-500,-500,-500,-1500,,,,,,,,,,,,,,,,,,,,,,
-3000,-1000,-1000,-1000,-1000,-1000,-1000,-1000,-1000,-1000,-1000,-1000,-1000,-1000,-1000,-1000,-3000,,,,,,,,,,,,,,,,,,,,,,
#,line_max,,,,,,,,,,,,,,,,,,,,,,,,,,,,,,,,,,,,,
49934,53028,52641,51857,51657,49589,48938,48646,47627,46924,48040,47061,47173,47572,47519,47482,47914,46264,,,,,,,,,,,,,,,,,,,,,
45667,56414,56363,60047,56358,52447,52331,51253,47537,54508,53175,49748,49052,49592,48723,52233,53651,48245,46116,47225,47468,45800,46445,45717,45737,46904,48195,45585,46850,46108,47256,46239,50736,46497,45752,46467,49298,45937,45886
#,line_min,,,,,,,,,,,,,,,,,,,,,,,,,,,,,,,,,,,,,
21400,22726,22561,22225,22139,21253,20974,20848,20411,20110,20588,20169,20217,20388,20365,20350,20534,19828,,,,,,,,,,,,,,,,,,,,,
19571,24178,24155,25735,24154,22477,22427,21965,20373,23360,22789,21320,21022,21254,20881,22385,22993,20677,19764,20239,20344,19628,19905,19593,19601,20102,20655,19537,20078,19760,20252,19817,21744,19927,19608,19915,21128,19687,19666
