{
    "header": {
        "magicui": "6",
        "version": "2"
    },
    "configration": [
        {
            "type": "param",
            "name": "iaware_switch",
            "value": "true"
        },
        {
            "type": "param",
            "name": "supl_server_cn",
            "value": "supl.bd-caict.com"
        },
        {
            "type": "param",
            "name": "supl_port_cn",
            "value": "7275"
        },
        {
            "type": "param",
            "name": "location_settings_ignore_list",
            "value": "com.hihonor.nearby"
        }
    ]
}
