{
	"type":"CalendarExt",
	"subType":"generic",
	"params":[
		{
			"name":"smart_scan_enable",
			"type":"bool",
			"value":"true"
		},
		{
			"name":"my_day_enable",
			"type":"bool",
			"value":"true"
		}
	],
	"version":"1.10.23.111",
	"compatibleversion":"1"
}