{
  "beat": [
    0,384,576,1248,1504,1664,2528,2848,3072,3680,3936,4128,4960,5120,5280,5472,6112,6272,7392,7616,7776,7968,8576,8800,8992,9824,10336,10848,11008,11456,12288,12576,13440,13664,13824,14016,14720,15040,15232,15872,16128,16320,17152,17504,17664,18304,18496,19584,19744,19904,20224,20384,20704,20896,21088,21344,21856,22016,22304,22528,23168,23360,23552,23776,24448,24640,24896,25600,25856,26048,26880,27456,28160,28320,28544,28704,29344,30023
    ],
  "beat_count": 78,
  "downbeat": [
    0,
    2528,
    6112,
    8992,
    12288,
    15872,
    17152,
    20704,
    22016,
    26880,
    30023
    ],
  "downbeat_count": 11
}