{
    "imports" : [
        "/system_ext/lib64/libhwfilter_mtk.so"
    ],

    "filters" :
    [
        {
            "id" : "ppsource",
            "type" : "ppsource",
            "captureTotal" : 6
        },

        {
            "id" : "encoder",
            "type" : "mtk_filter_jpeg"
        },

        {
            "id" : "RemosaicAdapter",
            "type" : "RemosaicAdapter"
         },

        {
            "id" : "SuperResolution",
            "type" : "SuperResolution"
         },

        {
            "id" : "writer",
            "type" : "filewriter"
        },

        {
            "id" : "FullHdr",
            "type" : "FullHdr"
        },

        {
            "id" : "HwFaceSR",
            "type" : "HwFaceSR"
        },

        {
            "id" : "HwBeautyPp",
            "type" : "HwBeautyPp"
        },

        {
            "id" : "UndisPp",
            "type" : "UndistortPp"
        },

        {
            "id" : "Davinci",
            "type" : "Davinci"
        },

        {
            "id" : "ColorEffectCap",
            "type" : "ColorEffectCap",
            "platform" : "mtk"
        },

        {
            "id" : "Watermark",
            "type" : "Watermark"
        },

        {
            "id" : "thumbnail",
            "type" : "quickthumbnail"
        },

        {
            "id" : "notifier",
            "type" : "thumbnail-notifier"
        },

        {
            "id" : "peek",
            "type" : "peek"
        },

        {
            "id" : "peekMeta",
            "type" : "peek"
        },
        {
            "id" : "HwExifPp",
            "type" : "HwExifPp"
        }
    ],

    "connections" :
    [
        {
            "from" :
            {
                "filter" : "ppsource",
                "port" : "out0"
            },

            "to" :
            {
                "filter" : "RemosaicAdapter",
                "port" : "inMain"
            }
        },

        {
            "from" :
            {
                "filter" : "RemosaicAdapter",
                "port" : "OutDestyuv"
            },

            "to" :
            {
                "filter" : "FullHdr",
                "port" : "inMain"
            }
        },

        {
            "from" :
            {
                "filter" : "FullHdr",
                "port" : "OutDestyuv"
            },

            "to" :
            {
                "filter" : "HwFaceSR",
                "port" : "inMain"
            }
        },

        {
            "from" :
            {
                "filter" : "HwFaceSR",
                "port" : "OutDestyuv"
            },

            "to" :
            {
                "filter" : "HwBeautyPp",
                "port" : "inMain"
            }
        },

        {
            "from" :
            {
                "filter" : "HwBeautyPp",
                "port" : "OutDestyuv"
            },

            "to" :
            {
                "filter" : "Davinci",
                "port" : "inMain"
            }
        },

        {
            "from" :
            {
                "filter" : "Davinci",
                "port" : "OutDestyuv"
            },

            "to" :
            {
                "filter" : "UndisPp",
                "port" : "inMain"
            }
        },

        {
           "from" :
            {
                "filter" : "UndisPp",
                "port" : "OutDestyuv"
            },

            "to" :
            {
                "filter" : "ColorEffectCap",
                "port" : "inMain"
            }
        },

        {
            "from" :
            {
                "filter" : "ColorEffectCap",
                "port" : "OutDestyuv"
            },

            "to" :
            {
                "filter" : "Watermark",
                "port" : "inMain"
            }
        },

        {
        "from" :
            {
                "filter" : "Watermark",
                "port" : "OutDestyuv"
            },

            "to" :
            {
                "filter" : "SuperResolution",
                "port" : "inMain"
            }
        },

        {
        "from" :
            {
                "filter" : "SuperResolution",
                "port" : "OutDestyuv"
            },
          "to" :
            {
                "filter" : "HwExifPp",
                "port" : "inMain"
            }
        },
       {
            "from" :
            {
                "filter" : "HwExifPp",
                "port" : "OutDestyuv"
            },
            "to" :
            {
                "filter" : "encoder",
                "port" : "inMain"
            }
        },

        {
            "from" :
            {
                "filter" : "encoder",
                "port" : "jpeg"
            },

            "to" :
            {
                "filter" : "writer",
                "port" : "in"
            }
        },

        {
            "from" :
            {
                "filter" : "FullHdr",
                "port" : "OutQuickThumbnailyuv"
            },

            "to" :
            {
                "filter" : "thumbnail",
                "port" : "inMain"
            }
        },

        {
            "from" :
            {
                "filter" : "thumbnail",
                "port" : "outThumbnail"
            },

            "to" :
            {
                "filter" : "notifier",
                "port" : "in"
            }
        },

        {
            "from" :
            {
                "filter" : "ppsource",
                "port" : "out_meta"
            },

            "to" :
            {
                "filter" : "peekMeta",
                "port" : "in"
            }
        },

        {
            "from" :
            {
                "filter" : "peekMeta",
                "port" : "out"
            },

            "to" :
            {
                "filter" : "RemosaicAdapter",
                "port" : "inMeta"
            }
        },

        {
            "from" :
            {
                "filter" : "RemosaicAdapter",
                "port" : "OutMeta"
            },

            "to" :
            {
                "filter" : "FullHdr",
                "port" : "inMeta"
            }
        },

        {
            "from" :
            {
                "filter" : "FullHdr",
                "port" : "OutMeta"
            },

            "to" :
            {
                "filter" : "HwFaceSR",
                "port" : "inMeta"
            }
        },

        {
            "from" :
            {
                "filter" : "HwFaceSR",
                "port" : "OutMeta"
            },

            "to" :
            {
                "filter" : "HwBeautyPp",
                "port" : "inMeta"
            }
        },

        {
            "from" :
            {
                "filter" : "HwBeautyPp",
                "port" : "OutMeta"
            },

            "to" :
            {
                "filter" : "Davinci",
                "port" : "inMeta"
            }
        },

        {
            "from" :
            {
                "filter" : "Davinci",
                "port" : "OutMeta"
            },

            "to" :
            {
                "filter" : "UndisPp",
                "port" : "inMeta"
            }
        },

        {
            "from" :
            {
                "filter" : "UndisPp",
                "port" : "OutMeta"
            },

            "to" :
            {
                "filter" : "ColorEffectCap",
                "port" : "inMeta"
            }
        },

        {
            "from" :
            {
                "filter" : "ColorEffectCap",
                "port" : "OutMeta"
            },

           "to" :
            {
                "filter" : "Watermark",
                "port" : "inMeta"
            }
        },

       {
            "from" :
            {
                "filter" : "Watermark",
                "port" : "OutMeta"
            },

            "to" :
            {
                "filter" : "SuperResolution",
                "port" : "inMeta"
            }
        },

       {
            "from" :
            {
                "filter" : "SuperResolution",
                "port" : "OutMeta"
            },
            "to" :
            {
                "filter" : "HwExifPp",
                "port" : "inMeta"
            }
        },

        {
            "from" :
            {
                "filter" : "HwExifPp",
                "port" : "OutMeta"
            },
           "to" :
           {
                "filter" : "encoder",
                "port" : "inMeta"
           }
        },

        {
            "from" :
            {
                "filter" : "peekMeta",
                "port" : "peek0"
            },

            "to" :
            {
                "filter" : "thumbnail",
                "port" : "inMeta"
            }
        }
    ]
}

