{
    "DecoderParams":{
        "FeatureInfo":{
            "feature_type":"mfcc",
            "add_pitch":true,
            "use_energy":false,
            "num_bins":40,
            "num_ceps":40,
            "low_freq":40,
            "high_freq":-200,
            "normalization_left_context":10,
            "normalization_right_context":10,
            "use_most_recent_ivector":true,
            "greedy_ivector_extractor":true
        },
        "DecoderConfig":{
            "max_active":7000,
            "min_active":200,
            "prune_interval":25,
            "beam":10,
            "lattice_beam":10,
            "prune_scale":0.1
        },
        "DnnConfig":{
            "acoustic_scale":0.1,
            "max_nnet_batch_size":512
        },
        "endpoint":{
            "silence_phones":"1:2:3:4:5:6:7:8:9:10:11:12:13:14:15:16:17:18:19:20"
        }
    },
    "AsrEngineParams":{
        "EngineControl":{
            "vad_end_wait_time_ms_":60000,
            "vad_short_voice_frame_length_ms_":400,
            "vad_front_wait_time_ms_":60000,
            "chunk_length_ms_":200,
            "reset_decoder_ms_":30000,
            "skip_noise_ms_":40,
            "timeout_thres_ms_":60000,
            "sentence_len_thres_":20,
            "new_words_wait_time_ms_":60000
        },
        "JudgeThreshold":{
            "repeat_chunk_num_thres_":1,
            "tgt_words_unconf_phone_num_thres_":2,
            "tgt_words_unconf_phone_num_relative_thres_":1,
            "tgt_words_word_conf_thres_":0.3,
            "tgt_words_vowel_phone_conf_thres_":0.03,
            "tgt_words_consonant_phone_conf_thres_":-0.5,
            "tgt_words_final_word_conf_thres_":0.3,
            "tgt_words_final_vowel_phone_conf_thres_":0.03,
            "tgt_words_final_consonant_phone_conf_thres_":-0.5,
            "aux_words_unconf_phone_num_thres_":0,
            "aux_words_unconf_phone_num_relative_thres_":1,
            "aux_words_word_conf_thres_":0.23,
            "aux_words_vowel_phone_conf_thres_":-0.12,
            "aux_words_consonant_phone_conf_thres_":-0.15,
            "results_select_conf_gap_thres_":0.1,
            "short_ph_frame_num_thres_":3,
            "long_consonant_frame_num_thres_":50,
            "long_sil_btw_words_frame_num_thres_":100
        },
        "VadParams":{
            "voice_variance_thres_":0,
            "curr_ave_amp_thd":300,
            "smooth_amp_thd":200,
            "smooth_update_thd":300,
            "smooth_frm_alpha":22937,
            "curr_frm_alpha":9830,
            "beta":12,
            "arti_speech_thd_":300,
            "chop_num_thd_":8,
            "block_vad_enable_":0
        },
        "FstMakerParams":{
            "conv2pinyin_enable_":true,
            "tgt_words_add_backoff":true,
            "aux_words_add_backoff":true,
            "tgt_words_is_usr":false,
            "aux_words_is_usr":false,
            "tgt_words_insert_silence":false,
            "aux_words_insert_silence":false
        },
        "IncomingCallAnswerParams":{
            "phone_answer_thres_":0.30,
            "hang_up_thres_":0.30,
            "phone_answer_short_thres_":0.31,
            "hang_up_short_thres_":0.31
        }
    }
}