﻿{
  "type": "soothing",
  "duration": 15000,
  "name": "RomanticTrip",
  "id": "Soothing_15_2",
  "separationStep": 1500,
  "separationMinDuration": 5000,
  "separationMaxDuration": 10000,
  "transitions": [
    {
      "name": "叠化",
      "priority": 50,
      "pickCondition": -1,
      "horizon": true,
      "vertical": true
    },
    {
      "name": "模糊",
      "priority": 0,
      "pickCondition": -1,
      "horizon": true,
      "vertical": true
    },
    {
      "name": "融化",
      "priority": 0,
      "pickCondition": -1,
      "horizon": true,
      "vertical": true
    },
    {
      "name": "上移",
      "priority": 0,
      "pickCondition": -1,
      "horizon": true,
      "vertical": true
    },
    {
      "name": "下移",
      "priority": 0,
      "pickCondition": -1,
      "horizon": true,
      "vertical": true
    },
    {
      "name": "左移",
      "priority": 50,
      "pickCondition": -1,
      "horizon": true,
      "vertical": true
    },
    {
      "name": "右移",
      "priority": 50,
      "pickCondition": -1,
      "horizon": true,
      "vertical": true
    },
    {
      "name": "黑场",
      "priority": 90,
      "pickCondition": -1,
      "horizon": true,
      "vertical": true
    },
    {
      "name": "白场",
      "priority": 90,
      "pickCondition": 1,
      "horizon": true,
      "vertical": true
    },
    {
      "name": "放大",
      "priority": 90,
      "pickCondition": -1,
      "horizon": true,
      "vertical": true
    },
    {
      "name": "缩小",
      "priority": 90,
      "pickCondition": 2,
      "horizon": true,
      "vertical": true
    },
    {
      "name": "旋转",
      "priority": 30,
      "pickCondition": -1,
      "horizon": true,
      "vertical": true
    }
  ],
  "transitionMaxCount": 2,
  "filterId": "filter_res_14",
  "filterStrength": 0.3,
  "sticker": {
    "id": "best_memory",
    "scaleHorizon": 0.4,
    "scaleVertical": 0.8,
    "locationHorizonX": 0,
    "locationHorizonY": 0,
    "locationVerticalX": 0,
    "locationVerticalY": 0,
    "beginTime": 0
  },
  "borderId": "ins1",
  "specialEffect": [
    {
      "effectId": "flowers",
      "effectStart": 1
    },
    {
      "effectId": "particle_heart",
      "effectStart": -1
    },
    {
      "effectId": "golden",
      "effectStart": -1
    }
  ],
  "tail": "honor_vlog"
}