16
15,  5,  0.1187405,  0.4722461,  0.3791679, -0.0329723, 0, 0, 0,  0.93, 1, 1, 1, 0, 0, 0, 0, 0,
14,  5,   0.135373,  0.4617798,   0.416733, -0.1563024, 0, 0, 0,  0.99, 1, 1, 1, 0, 0, 0, 0, 0,
13,  5,  0.1086162,  0.5369588,  0.4072795, -0.0502569, 0, 0, 0,  0.94, 1, 1, 1, 0, 0, 0, 0, 0,
12,  5,  0.1584078,  0.5505045,  0.4243013, -0.0692802, 0, 0, 0,  0.93, 1, 1, 1, 0, 0, 0, 0, 0,
11,  5,  0.1786246,  0.5788764,  0.4454704,   -0.07313, 0, 0, 0,  0.93, 1, 1, 1, 0, 0, 0, 0, 0,
10,  5,  0.1641945,  0.5910449,  0.5023892, -0.0090743, 0, 0, 0,  0.89, 1, 1, 1, 0, 0, 0, 0, 0,
 9,  5,  0.1754423,  0.6271982,  0.5478634, -0.1814495, 0, 0, 0,  0.99, 1, 1, 1, 0, 0, 0, 0, 0,
 8,  5,  0.2021952,  0.6550446,  0.5680186, -0.2127177, 0, 0, 0,  0.99, 1, 1, 1, 0, 0, 0, 0, 0,
 7,  5,  0.2228858,  0.6984194,   0.606458, -0.2137796, 0, 0, 0,  0.99, 1, 1, 1, 0, 0, 0, 0, 0,
 6,  5,  0.2277475,  0.7591777,  0.6593549, -0.1668758, 0, 0, 0,  0.99, 1, 1, 1, 0, 0, 0, 0, 0,
 5,  5,  0.2371816,   0.836945,   0.717689, -0.1422604, 0, 0, 0,  0.99, 1, 1, 1, 0, 0, 0, 0, 0,
 4,  5,  1.1510606,  0.3293814,  0.1230112, -0.2581542, 0, 0, 0,  0.54, 1, 1, 1, 0, 0, 0, 0, 0,
 3,  5,  0.2803951,  1.0683541,  0.8746176, -0.1839698, 0, 0, 0,  0.99, 1, 1, 1, 0, 0, 0, 0, 0,
 2,  5,  0.3053493,  1.1957746,  0.9818861, -0.1072891, 0, 0, 0,  0.99, 1, 1, 1, 0, 0, 0, 0, 0,
 1,  5,  0.3337552,  1.3481632,  1.1272061,  0.0781817, 0, 0, 0,  0.99, 1, 1, 1, 0, 0, 0, 0, 0,
 0,  5,  0.3848805,  1.6170416,  1.3859812,  0.0281822, 0, 0, 0,  0.99, 1, 1, 1, 0, 0, 0, 0, 0,
0
