{
  "beat": [
    0,352,544,704,896,1088,1248,1472,1760,1984,2144,2304,2496,2688,3136,3296,3488,3680,3872,4128,4320,4480,4896,5088,5280,5472,5632,5856,6048,6240,6528,6752,6912,7136,7360,7616,7776,7936,8095,8256,8576,8768,8960,9184,9472,9728,9920,10112,10304,10464,10784,11040,11200,11360,11552,11744,11904,12096,12416,12576,12768,12928,13088,13312,13728,13888,14112,14272,14496,14656,14816,14976,15136,15360,15520,15712,15904,16063,16288,16480,16672,16896,17088,17344,17504,17728,17888,18112,18400,18688,18848,19040,19200,19456,19616,19808,20064,20320,20512,20704,20864,21120,21312,21504,21664,21856,22016,22176,22368,22592,22752,22976,23136,23328,23520,23680,23872,24160,24384,24768,24960,25152,25408,25568,25760,25920,26112,26336,26496,26816,27040,27296,27456,27648,27840,28000,28224,28416,28640,28928,29152,29408,29568,30038
    ],
  "beat_count": 144,
  "downbeat": [
    0,
    256,
    2304,
    5856,
    7616,
    9920,
    11200,
    14112,
    16896,
    18944,
    20992,
    22976,
    25920,
    28224,
    29408,
    30038
    ],
  "downbeat_count": 16
}