{
	"version": "1.0.0",
	"delay" : 10,
	"schedule_time" : 10,
	"sensor" : {
	"name":
	"system_h",
	"accuracy": 1
	},
	"temp_level" : {
	"comments" : "low_threshold, high_threshold, hysteresis_value, unit is millicentigrade",
	"table" : [
		[29000, 31000, 2000],
		[32000, 34000, 2000],
		[34000, 36000, 2000],
		[36000, 38000, 2000],
		[37000, 39000, 2000],
		[38000, 40000, 2000],
		[39000, 41000, 2000],
		[40000, 42000, 2000],
		[41000, 43000, 2000],
		[42000, 44000, 2000],
		[43000, 45000, 2000],
		[44000, 46000, 2000]
        ]
    },
	"current_limit" : {
		"comments" : "scale1, scale2, scale3, scale4, scale5, scale6, scale7, scale8, scale9, scale10, scale11, scale12",
		"wcurrent_5v" : {
			"channel" : 0,
			"prefix" : "dcp 0#",
			"limit" : [2000, 1500, 1500, 1400, 1200, 1200, 1080, 1080, 1080, 900, 900, 475]
		},
		"wcurrent_9v" : {
			"channel" : 0,
			"prefix" : "dcp 1#",
			"limit": [1500, 1500, 1500, 1400, 1200, 1200, 1080, 1080, 1080, 900, 900, 475]
		},
		"direct_charger" : {
			"channel" : 1,
			"prefix" : "lvc ",
			"limit": [4500, 4000, 4000, 3000, 2000, 2000, 1500, 1500, 2000, 1500, 1500, 1500]
		},
		"direct_charger_sc" : {
			"channel" : 0,
            "prefix" : "sc 0#",
			"limit": [7000, 7000, 7000, 6000, 5000, 5000, 4000, 4000, 3000, 2000, 2000, 2000]
		},
		"direct_charger_duo_sc" : {
			"channel" : 0,
			"prefix" : "sc 1#",
			"limit": [10500, 10500, 9000, 9000, 8500, 7500, 6000, 5000, 4000, 3000, 2000, 2000]
		},
		"wlcurrent_5v" : {
			"channel" : 0,
			"prefix" : "dcp 2#",
			"limit" : [1500, 1500, 1500, 1200, 1200, 1000, 1000, 1000, 800, 500, 500, 2000]
		},
		"wlcurrent_9v" : {
			"channel" : 0,
			"prefix" : "dcp 3#",
			"limit" : [1500, 1500, 1500, 1200, 1200, 1000, 1000, 1000, 700, 700, 700, 300]
		},
		"wlcurrent_sc" : {
			"channel" : 0,
			"prefix" : "wl_sc 0#",
			"limit" : [5200, 1500, 2500, 2200, 2200, 1800, 1300, 1300, 1100, 1000, 700, 600]
		},
		"wlcurrent_duo_sc" : {
			"channel" : 0,
			"prefix" : "wl_sc 1#",
			"limit" : [5200, 2800, 2800, 2800, 2800, 2500, 2200, 2200, 1500, 1000, 1000, 600]
		}
	},
	"su_version": "1.0.0",
	"su_delay" : 1,
	"su_current_limit" : {
		"comments" : "hota, normal",
		"wcurrent_5v" : {
			"channel" : 0,
			"prefix" : "dcp 0#",
			"limit" : [900, 1300]
		},
		"wcurrent_9v" : {
			"channel" : 0,
			"prefix" : "dcp 1#",
			"limit": [900, 1300]
		},
		"direct_charger" : {
			"channel" : 1,
			"prefix" : "lvc ",
			"limit": [1500, 1500]
		},
		"direct_charger_sc" : {
			"channel" : 0,
			"prefix" : "sc 0#",
			"limit": [1500, 1500]
		},
		"direct_charger_duo_sc" : {
			"channel" : 0,
			"prefix" : "sc 1#",
			"limit": [1500, 1500]
		},
		"wlcurrent_5v" : {
			"channel" : 0,
			"prefix" : "dcp 2#",
			"limit" : [900, 1300]
		},
		"wlcurrent_9v" : {
			"channel" : 0,
			"prefix" : "dcp 3#",
			"limit" : [900, 1300]
		},
		"wlcurrent_sc" : {
			"channel" : 0,
			"prefix" : "wl_sc 0#",
			"limit" : [1500, 1500]
		},
		"wlcurrent_duo_sc" : {
			"channel" : 0,
			"prefix" : "wl_sc 1#",
			"limit" : [1500, 1500]
		}
	},
	"thermal_adsp_version": "1.0.0",
	"thermal_adsp_delay" : 1,
	"thermal_adsp_config": [
		{
			"index_mapping": 0,
			"channel_config": [
				{
					"thermal_channel": 0,
					"state_config": [
						{
							"thermal_state": 0,
							"temp_config": {
								"comments":
									"low_tmep, high_temp, 5v_iin, 5v_chg, 9v_iin, 9v_ch, w_5v, w_9v, dc0, dc1, hdc0, hdc1, wdc0, wdc1, whdc0, whdc1, wl_ctrl volt",
								"table": [
                            [25, 30, 2000, 0, 1500, 0, 0, 0, 0,    12000, 0, 0, 0, 0, 0, 0, 0, 0],
                            [30, 32, 2000, 0, 1500, 0, 0, 0, 7000, 12000, 0, 0, 0, 0, 0, 0, 0, 0],
                            [32, 39, 2000, 0, 1500, 0, 0, 0, 7000, 9300, 0, 0, 0, 0, 0, 0, 0, 5],
                            [39, 40, 2000, 0, 1400, 0, 0, 0, 6000, 8800, 0, 0, 0, 0, 0, 0, 0, 5],
                            [40, 41, 2000, 0, 1200, 0, 0, 0, 5000, 7300, 0, 0, 0, 0, 0, 0, 0, 5],
                            [41, 42, 2000, 0, 1200, 0, 0, 0, 5000, 6900, 0, 0, 0, 0, 0, 0, 0, 5],
                            [42, 43, 1500, 0, 1080, 0, 0, 0, 4000, 5500, 0, 0, 0, 0, 0, 0, 0, 5],
                            [43, 44, 1500, 0, 1080, 0, 0, 0, 4000, 4000, 0, 0, 0, 0, 0, 0, 0, 5],
                            [44, 45, 1080, 0, 1080, 0, 0, 0, 4000, 4000, 0, 0, 0, 0, 0, 0, 0, 5],
                            [45, 46, 900,  0, 900,  0, 0, 0, 4000, 3000, 0, 0, 0, 0, 0, 0, 0, 5],
                            [46, 47, 900,  0, 900,  0, 0, 0, 3000, 2000, 0, 0, 0, 0, 0, 0, 0, 5],
                            [47, 48, 475,  0, 475,  0, 0, 0, 2000, 2000, 0, 0, 0, 0, 0, 0, 0, 5]
								]
							}
						}
					]
				}
			]
		}
	]
}
