﻿{
  "type": "happy",
  "duration": 30000,
  "name": "Merryred-30",
  "id": "Happy_30_1",
  "separationStep": 1700,
  "separationMinDuration": 4000,
  "separationMaxDuration": 8000,
  "transitions": [
    {
      "name": "叠化",
      "priority": 30,
      "pickCondition": -1,
      "horizon": true,
      "vertical": true
    },
    {
      "name": "模糊",
      "priority": 0,
      "pickCondition": -1,
      "horizon": true,
      "vertical": true
    },
    {
      "name": "融化",
      "priority": 0,
      "pickCondition": -1,
      "horizon": true,
      "vertical": true
    },
    {
      "name": "上移",
      "priority": 90,
      "pickCondition": 1,
      "horizon": true,
      "vertical": false
    },
    {
      "name": "下移",
      "priority": 90,
      "pickCondition": -1,
      "horizon": true,
      "vertical": true
    },
    {
      "name": "左移",
      "priority": 90,
      "pickCondition": 1,
      "horizon": false,
      "vertical": true
    },
    {
      "name": "右移",
      "priority": 90,
      "pickCondition": -1,
      "horizon": true,
      "vertical": true
    },
    {
      "name": "黑场",
      "priority": 10,
      "pickCondition": -1,
      "horizon": true,
      "vertical": true
    },
    {
      "name": "白场",
      "priority": 10,
      "pickCondition": -1,
      "horizon": true,
      "vertical": true
    },
    {
      "name": "放大",
      "priority": 70,
      "pickCondition": -1,
      "horizon": true,
      "vertical": true
    },
    {
      "name": "缩小",
      "priority": 70,
      "pickCondition": -1,
      "horizon": true,
      "vertical": true
    },
    {
      "name": "旋转",
      "priority": 90,
      "pickCondition": 2,
      "horizon": true,
      "vertical": true
    }
  ],
  "transitionMaxCount": 4,
  "filterId": "filter_res_04",
  "filterStrength": 0.4,
  "sticker": {
    "id": "share_happiness",
    "scaleHorizon": 0.4,
    "scaleVertical": 0.8,
    "locationHorizonX": 0,
    "locationHorizonY": -0.8,
    "locationVerticalX": 0,
    "locationVerticalY": -0.45,
    "beginTime": 0
  },
  "borderId": "hand_account4",
  "specialEffect": [
    {
      "effectId": "romantic_heart",
      "effectStart": 0
    },
    {
      "effectId": "stars",
      "effectStart": -1
    },
    {
      "effectId": "sun_halo",
      "effectStart": -1
    }
  ],
  "tail": "honor_vlog"
}