{
    "beta": 0.55,
    "mouth": 0.7,
    "eye": 0.9,
    "eyebrow": 0.8,
    "blend_weight_border":0.72,
    "smoothness": 0.9,
    "blend_weight_eyebrow": 1.0,
    "blend_weight_eye": 1.0,
    "blend_weight_mouth": 1.0,
    "blend_weight_face": 1.0,
    "quality_level": 0,
    "iso_thres":3600
}
