﻿{
  "type": "sad",
  "duration": 25000,
  "name": "Blue-30",
  "id": "Sad_30_1",
  "separationStep": 1870,
  "separationMinDuration": 5000,
  "separationMaxDuration": 10000,
  "transitions": [
    {
      "name": "叠化",
      "priority": 90,
      "pickCondition": 1,
      "horizon": true,
      "vertical": true
    },
    {
      "name": "模糊",
      "priority": 0,
      "pickCondition": -1,
      "horizon": true,
      "vertical": true
    },
    {
      "name": "融化",
      "priority": 0,
      "pickCondition": -1,
      "horizon": true,
      "vertical": true
    },
    {
      "name": "上移",
      "priority": 0,
      "pickCondition": -1,
      "horizon": true,
      "vertical": true
    },
    {
      "name": "下移",
      "priority": 0,
      "pickCondition": -1,
      "horizon": true,
      "vertical": true
    },
    {
      "name": "左移",
      "priority": 0,
      "pickCondition": -1,
      "horizon": true,
      "vertical": true
    },
    {
      "name": "右移",
      "priority": 0,
      "pickCondition": -1,
      "horizon": true,
      "vertical": true
    },
    {
      "name": "黑场",
      "priority": 90,
      "pickCondition": 2,
      "horizon": true,
      "vertical": true
    },
    {
      "name": "白场",
      "priority": 70,
      "pickCondition": -1,
      "horizon": true,
      "vertical": true
    },
    {
      "name": "放大",
      "priority": 50,
      "pickCondition": -1,
      "horizon": true,
      "vertical": true
    },
    {
      "name": "缩小",
      "priority": 50,
      "pickCondition": -1,
      "horizon": true,
      "vertical": true
    },
    {
      "name": "旋转",
      "priority": 0,
      "pickCondition": -1,
      "horizon": true,
      "vertical": true
    }
  ],
  "transitionMaxCount": 3,
  "filterId": "filter_res_01",
  "filterStrength": 0.4,
  "sticker": {
    "id": "moment",
    "scaleHorizon": 0.35,
    "scaleVertical": 0.8,
    "locationHorizonX": 0,
    "locationHorizonY": -0.9,
    "locationVerticalX": 0,
    "locationVerticalY": -0.35,
    "beginTime": 0
  },
  "borderId": "simple_white2",
  "specialEffect": [
    {
      "effectId": "light_spot",
      "effectStart": 0
    },
    {
      "effectId": "flowers",
      "effectStart": -1
    },
    {
      "effectId": "blingbling",
      "effectStart": -1
    }
  ],
  "tail": "honor_vlog"
}