{
    "iso_thres": 36000,
    "alpha": 0.45,
    "beta": 0.15,
    "smoothness": 0.65,
    "quality_level": 1,
    "max_faces": 3,
    "quality_debug": 1,
    "mouth": 0.45,
    "eye": 0.6,
    "eyebrow":0.6
}
