5ce44dd401354f69f2a31f65392ca2b03a9048ab vendor.honor.hardware.activity_recognition@1
c83d3e14690c87bcd8924f6f34af62f97c2f1032 vendor.honor.hardware.aiservice@1
b75916e7825ba24efdbfdb86cecbf02a4f466185 vendor.honor.hardware.biometrics.fingerprint@1
aa0cd7e673d34cd9b3731d4d3e7478ab88cec1d6 vendor.honor.hardware.eid@1
cff0830a2ff3f8186c2846e0231042d30445f481 vendor.honor.hardware.camera.camResource@1
8a22c2a085b6db4a8c6b2f57003a9e3e9eb7f49c vendor.honor.hardware.camera.cfgsvr@1
9f9934e97c7c6ff1cc192a94b35eebbc408ac833 vendor.honor.hardware.camera.cfgsvr@2
4549be3426d7c34be052a8dcfdf1e405e8fb8ed1 vendor.honor.hardware.camera.hiaon@1
6539c1abb1eed81eacb5f6221fba90d5e44ec7d1 vendor.honor.hardware.camera.hiaon@2
0427dd09a4f5a93701641fcc68c1d8981891836a vendor.honor.hardware.camera.factory@1
63f8629b6b0bfdfb8724348188af2c20fced59a2 vendor.honor.hardware.camera.manufacture@1
f4ebac32d1e21537d82d157131cbc65c782145fe vendor.honor.hardware.fusd@1
3823c5775d9df17fd0d66ee5cfccc8cc3bf266f1 vendor.honor.hardware.fusd@2
ed003d73176bc3111f6f1eefbde5f6c92446db48 vendor.honor.hardware.fusionproxy.controlplane@1
b9def5f282a8e2b014336bdb589f76b6d3c438fd vendor.honor.hardware.camera.vircamera@1
d16b93666c2ffb3c3df87bf7123282a755b031a6 vendor.honor.hardware.fusionproxy.dataplane@1
98fa6570f0375f92d8c6deb2457993c42e425ddb vendor.honor.hardware.hnblesensorhub@1
d60bb76cf08295c90494e9fb0a11a02d6c67e069 vendor.honor.hardware.hncamera@1
363e53fea07bca5aa1d648d9e03bd09e8969cc02 vendor.honor.hardware.hncamera@2
df3b3daf3cd0aba065acc3a25f417c240bde8294 vendor.honor.hardware.hnchipsrvhertz@1
a6f68d3cff4cb711041426412437105b2a5b9048 vendor.honor.hardware.hnchipsrvlog@1
fbc5cc3e64c7aa42bac145eac2aab0937ab01173 vendor.honor.hardware.hnchipsrvlog@2
a644916c5cef95d72686c693072f34a626b54c4b vendor.honor.hardware.hnradio@1
506c3dedb22ac0b8e42e77fee3c47cc9906fc44f vendor.honor.hardware.hnsimradio@1
5954861c325c71f2b7985f5cee1baf1a9a49211e vendor.honor.hardware.honorsigntool@1
4202fbd66e4c8e91370bef3f1d58bbc648e4d4d9 vendor.honor.hardware.hwfs@1
1d1a134aa27666c6c00b26288145f67338bac237 vendor.honor.hardware.hwhiview@2
0f8300aa82593a84aa3895e265584a155c086580 vendor.honor.hardware.hwupdate@1
ce17fe8d3edc3618f35a32bbedcc0f9bdce490e3 vendor.honor.hardware.isf@1
a84e0d0d656db7b20a7117d7e6c76364cddbb417 vendor.honor.hardware.keyboardservice@1
88b6904493fd776daf761aebedb0d84bffc12c88 vendor.honor.hardware.libteec@1
7495ff96dc7bf7a772206d4c277916f200fa1bb2 vendor.honor.hardware.nfc@1
23e142b84a03669b0e133b4e70a081427def7462 vendor.honor.hardware.motion@1
6b987636fe11db534dab8e1ed79a3c6618b80cac vendor.honor.hardware.nxpese@1
b1e9a470c2e6879277d271b0fa9c327b876d341e vendor.honor.hardware.nxpnfc@1
186d1ca998314f9cf2c75d71cd56bffe0182678b vendor.honor.hardware.power@1
44345ec972308c93fc67358e1fc3ef0473e0e47a vendor.honor.hardware.radio_radar@1
e6d48a9ffea9f9e0ca835a1ad64e0343e752065b vendor.honor.hardware.radio_radar@2
28a3c37659a2d7a330cfde1946ebb8f049598e0e vendor.honor.hardware.radio_radar@3
caa68aab0ed6a4ecf6dbe770664ee939af614e65 vendor.honor.hardware.remotesim@1
2cabbad1f7b4fa96f9fd701a9135d328e2c9dab2 vendor.honor.hardware.securecamera@1
5063e08ea6e756536d32633adff92ebdd72337ed vendor.honor.hardware.sensors@1
ea2f9c53593ed2d2e110413b1714c7e2ce407012 vendor.honor.hardware.vibrator@1
048b99a95155d3b815c534e17205611b90168d75 vendor.honor.hardware.vibrator@2
7de7d000a9c2adbf2cc51fd9ed5b90e100fb7d6c vendor.honor.hardware.vibrator@3
842c154279f441f2f4cbc3386520859e725978de vendor.honor.hardware.tp@1
c2816c5eaacfdb19a786ac0b4395a571b0af25f3 vendor.honor.hardware.hwsched@1
e8764553fb92d47e733b94004acdb6f08298d7da vendor.honor.hardware.hwstp@1
934171e8d0f46beb6445d771ce8fc57ce46a8089 vendor.honor.hardware.wifi.supplicant@1
1700975288c7c25b19d22b5791ec0f31564c7b2b vendor.honor.hardware.wifi.supplicant@2
f0dac2747915b2a2c104a77c97185c2cf6f50fcd vendor.honor.hardware.wifi.supplicant@3
3832c20f4103490aaa8158438d86c40fc9bb3043 vendor.honor.hardware.hyperhold@1
56cbff01ec196d796b2d7c319d1427e9d9dad883 vendor.honor.hardware.hwfactoryinterface@1
976ac2a6eaa86529af02ce7ee08890317db95c2 vendor.honor.hardware.hwdisplay.displayfactory@1
558923edf4a169d7f2c5b8ae6dd43abc04151a8d vendor.honor.hardware.offlinealgo@1
0a442c391ac33c7482b3438854bb17d6877c2645 vendor.honor.hardware.light@1
30fc965585d51882cfa578ec40c80985d1748811 vendor.honor.hardware.hwdisplay@1
eb83d0791196b3bf9beb84b53a91fb3eda2e00be vendor.honor.hardware.iawareperf@1
66352bfb3877e5318b090fae9b668be68721c281 vendor.honor.hardware.iawareperfpolicy@1
be0abdebccf9de3858558c7fe4a969e3e069b890 vendor.honor.hardware.weaver@1
335cb011d9957abe4599daba6d4517b3015d8915 vendor.honor.hardware.honorantitheft@1
90375a11377f5cdc851b2744ef04fb88963c3a21 vendor.honor.hardware.snpelaunch@1
e891ba6ed3fe7dc4d898f210febc9b458555bf38 vendor.honor.hardware.aoservice@1
1bafe21843cdc3bd13a6ae6eead07f61c96e4309 vendor.honor.hardware.audioremote@1
0236eceda014a6198970e835fe20f1e3c641d0a4 vendor.honor.hardware.airenderlaunch@1
d567b46db79d28186c0bfd7a62d70804960bd178 vendor.honor.hardware.hnchipsrvhertz@2
333625ebcc625987e358a4979863ad6386984931 vendor.honor.hardware.kds@1
2723f083e3fa78261986313dd413c11da038e67f vendor.honor.hardware.offlinealgo@2
