#,version,,,,,,,,,,,,,,,,,,,,,,,,,,,,,,,,,,,,,,,,,,,,,,,,,,,,,,,,,,,,,,,,,,,,,
2022,8,22,1,,,,,,,,,,,,,,,,,,,,,,,,,,,,,,,,,,,,,,,,,,,,,,,,,,,,,,,,,,,,,,,,,,,
#,row_col_num,,,,,,,,,,,,,,,,,,,,,,,,,,,,,,,,,,,,,,,,,,,,,,,,,,,,,,,,,,,,,,,,,,,,,
38,33,,,,,,,,,,,,,,,,,,,,,,,,,,,,,,,,,,,,,,,,,,,,,,,,,,,,,,,,,,,,,,,,,,,,,
#,noise,,,,,,,,,,,,,,,,,,,,,,,,,,,,,,,,,,,,,,,,,,,,,,,,,,,,,,,,,,,,,,,,,,,,,
-600,600,,,,,,,,,,,,,,,,,,,,,,,,,,,,,,,,,,,,,,,,,,,,,,,,,,,,,,,,,,,,,,,,,,,,,
#,raw_max,,,,,,,,,,,,,,,,,,,,,,,,,,,,,,,,,,,,,,,,,,,,,,,,,,,,,,,,,,,,,,,,,,,,,
10000,6500,6500,6500,6500,6500,6500,6500,6500,6500,6500,6500,6500,6500,6500,6500,6500,6500,6500,6500,6500,6500,6500,6500,6500,6500,6500,6500,6500,6500,6500,6500,10000,,,,,,,,,,,,,,,,,,,,,,,,,,,,,,,,,,,,,,
6500,4524,4517,4503,4495,4521,4505,4510,4530,4501,4503,4527,4524,4534,4541,4546,4553,4570,4575,4566,4590,4594,4595,4647,3646,4323,4632,4608,4629,4647,4648,4684,6500,,,,,,,,,,,,,,,,,,,,,,,,,,,,,,,,,,,,,,
6500,4666,4659,4646,4638,4663,4648,4653,4672,4642,4645,4668,4666,4676,4681,4687,4695,4712,4715,4707,4729,4736,4733,4761,4730,4739,4769,4743,4763,4778,4775,4805,6500,,,,,,,,,,,,,,,,,,,,,,,,,,,,,,,,,,,,,,
6500,4714,4708,4694,4685,4711,4697,4703,4721,4690,4692,4716,4713,4723,4729,4735,4742,4759,4763,4750,4777,4777,4779,4806,4786,4783,4813,4786,4800,4818,4813,4839,6500,,,,,,,,,,,,,,,,,,,,,,,,,,,,,,,,,,,,,,
6500,4738,4730,4715,4705,4734,4717,4722,4741,4710,4714,4737,4734,4744,4750,4755,4762,4778,4782,4772,4796,4796,4799,4824,4804,4800,4828,4799,4817,4829,4822,4845,6500,,,,,,,,,,,,,,,,,,,,,,,,,,,,,,,,,,,,,,
6500,4761,4751,4736,4725,4751,4736,4743,4763,4732,4735,4759,4755,4765,4771,4776,4783,4798,4801,4788,4815,4815,4812,4841,4825,4816,4841,4814,4826,4842,4833,4853,6500,,,,,,,,,,,,,,,,,,,,,,,,,,,,,,,,,,,,,,
6500,4643,4635,4622,4613,4641,4626,4633,4654,4624,4627,4650,4646,4655,4661,4665,4673,4687,4690,4676,4703,4702,4698,4727,4706,4701,4723,4698,4708,4723,4713,4731,6500,,,,,,,,,,,,,,,,,,,,,,,,,,,,,,,,,,,,,,
6500,4781,4773,4757,4749,4777,4762,4770,4791,4760,4763,4786,4784,4792,4797,4798,4800,4816,4825,4810,4833,4836,4832,4861,4836,4833,4854,4828,4838,4852,4841,4857,6500,,,,,,,,,,,,,,,,,,,,,,,,,,,,,,,,,,,,,,
6500,4806,4799,4782,4773,4801,4787,4793,4815,4784,4787,4810,4805,4814,4819,4823,4831,4844,4847,4832,4857,4857,4852,4881,4856,4851,4871,4844,4854,4868,4855,4870,6500,,,,,,,,,,,,,,,,,,,,,,,,,,,,,,,,,,,,,,
6500,4796,4789,4772,4763,4792,4777,4783,4805,4774,4777,4797,4788,4797,4808,4805,4809,4824,4837,4817,4839,4841,4836,4865,4839,4835,4856,4827,4836,4850,4835,4848,6500,,,,,,,,,,,,,,,,,,,,,,,,,,,,,,,,,,,,,,
6500,4816,4808,4792,4783,4812,4796,4803,4824,4793,4796,4819,4813,4822,4827,4833,4828,4847,4852,4835,4857,4858,4853,4882,4855,4850,4871,4841,4850,4862,4847,4859,6500,,,,,,,,,,,,,,,,,,,,,,,,,,,,,,,,,,,,,,
6500,4702,4694,4678,4668,4697,4682,4686,4710,4677,4679,4704,4694,4708,4710,4707,4709,4725,4733,4715,4737,4738,4730,4761,4733,4728,4751,4720,4726,4739,4721,4732,6500,,,,,,,,,,,,,,,,,,,,,,,,,,,,,,,,,,,,,,
6500,4810,4802,4786,4776,4804,4789,4795,4817,4784,4786,4813,4796,4810,4816,4813,4816,4830,4839,4821,4842,4843,4836,4865,4838,4832,4854,4823,4830,4841,4823,4832,6500,,,,,,,,,,,,,,,,,,,,,,,,,,,,,,,,,,,,,,
6500,4781,4774,4758,4748,4775,4759,4768,4784,4748,4750,4773,4766,4775,4780,4781,4783,4799,4800,4788,4808,4809,4803,4832,4803,4798,4818,4787,4794,4804,4785,4794,6500,,,,,,,,,,,,,,,,,,,,,,,,,,,,,,,,,,,,,,
6500,4812,4808,4794,4782,4807,4790,4795,4817,4787,4783,4803,4796,4805,4816,4811,4812,4827,4829,4816,4836,4837,4830,4859,4831,4825,4845,4813,4819,4829,4810,4818,6500,,,,,,,,,,,,,,,,,,,,,,,,,,,,,,,,,,,,,,
6500,4771,4767,4756,4742,4766,4748,4753,4778,4735,4737,4761,4753,4762,4770,4767,4768,4783,4784,4771,4791,4791,4784,4813,4784,4778,4799,4767,4773,4782,4762,4770,6500,,,,,,,,,,,,,,,,,,,,,,,,,,,,,,,,,,,,,,
6500,4672,4670,4658,4644,4668,4650,4653,4677,4639,4637,4662,4653,4661,4675,4666,4667,4682,4684,4670,4690,4689,4680,4712,4681,4675,4697,4664,4669,4680,4659,4667,6500,,,,,,,,,,,,,,,,,,,,,,,,,,,,,,,,,,,,,,
6500,4778,4774,4761,4747,4771,4753,4756,4779,4745,4749,4764,4755,4763,4774,4768,4769,4783,4788,4772,4791,4790,4783,4812,4782,4777,4798,4765,4771,4780,4760,4767,6500,,,,,,,,,,,,,,,,,,,,,,,,,,,,,,,,,,,,,,
6500,4688,4681,4668,4655,4678,4661,4661,4680,4646,4648,4670,4661,4669,4675,4674,4675,4689,4690,4676,4696,4695,4686,4716,4686,4680,4701,4669,4674,4683,4662,4670,6500,,,,,,,,,,,,,,,,,,,,,,,,,,,,,,,,,,,,,,
6500,4637,4636,4624,4611,4633,4618,4612,4633,4600,4602,4624,4616,4624,4629,4629,4630,4643,4644,4630,4649,4648,4641,4670,4640,4634,4654,4622,4628,4637,4617,4624,6500,,,,,,,,,,,,,,,,,,,,,,,,,,,,,,,,,,,,,,
6500,4720,4725,4712,4695,4723,4697,4699,4721,4687,4689,4711,4703,4712,4717,4717,4718,4732,4732,4718,4738,4737,4730,4759,4729,4722,4743,4711,4717,4727,4706,4714,6500,,,,,,,,,,,,,,,,,,,,,,,,,,,,,,,,,,,,,,
6500,4727,4735,4721,4700,4726,4704,4707,4729,4696,4698,4720,4712,4721,4726,4727,4728,4742,4742,4728,4747,4747,4739,4768,4738,4732,4753,4721,4727,4737,4717,4724,6500,,,,,,,,,,,,,,,,,,,,,,,,,,,,,,,,,,,,,,
6500,4765,4765,4754,4739,4761,4743,4747,4770,4736,4738,4760,4752,4761,4767,4767,4769,4783,4783,4769,4789,4788,4780,4810,4780,4774,4795,4763,4770,4779,4759,4767,6500,,,,,,,,,,,,,,,,,,,,,,,,,,,,,,,,,,,,,,
6500,4611,4615,4602,4589,4614,4595,4594,4618,4584,4585,4610,4601,4609,4616,4616,4617,4631,4632,4617,4638,4638,4629,4659,4630,4623,4646,4614,4620,4630,4609,4618,6500,,,,,,,,,,,,,,,,,,,,,,,,,,,,,,,,,,,,,,
6500,4617,4613,4601,4587,4614,4599,4602,4626,4592,4594,4618,4610,4617,4624,4625,4626,4640,4641,4626,4648,4648,4639,4670,4641,4634,4657,4626,4632,4642,4622,4631,6500,,,,,,,,,,,,,,,,,,,,,,,,,,,,,,,,,,,,,,
6500,4757,4756,4740,4734,4759,4737,4743,4764,4732,4734,4757,4749,4758,4763,4766,4768,4782,4782,4768,4789,4789,4783,4812,4784,4779,4799,4769,4777,4787,4767,4777,6500,,,,,,,,,,,,,,,,,,,,,,,,,,,,,,,,,,,,,,
6500,4782,4776,4759,4750,4778,4763,4768,4790,4757,4759,4782,4774,4783,4789,4792,4795,4809,4809,4796,4817,4818,4811,4841,4813,4808,4829,4799,4806,4817,4799,4809,6500,,,,,,,,,,,,,,,,,,,,,,,,,,,,,,,,,,,,,,
6500,4755,4752,4741,4723,4751,4736,4741,4763,4731,4734,4756,4749,4758,4763,4767,4771,4785,4785,4773,4793,4794,4789,4818,4791,4787,4807,4778,4786,4798,4781,4792,6500,,,,,,,,,,,,,,,,,,,,,,,,,,,,,,,,,,,,,,
6500,4699,4692,4676,4666,4694,4679,4683,4706,4676,4678,4700,4693,4703,4709,4712,4716,4730,4732,4720,4740,4742,4737,4766,4739,4735,4755,4728,4737,4750,4734,4746,6500,,,,,,,,,,,,,,,,,,,,,,,,,,,,,,,,,,,,,,
6500,4594,4587,4571,4562,4589,4575,4581,4601,4571,4573,4595,4590,4600,4605,4608,4612,4627,4629,4617,4637,4639,4635,4663,4638,4635,4656,4630,4639,4652,4639,4653,6500,,,,,,,,,,,,,,,,,,,,,,,,,,,,,,,,,,,,,,
6500,4693,4687,4671,4662,4690,4676,4682,4702,4672,4675,4697,4692,4701,4707,4711,4716,4731,4732,4721,4742,4744,4740,4770,4745,4742,4763,4738,4748,4762,4750,4767,6500,,,,,,,,,,,,,,,,,,,,,,,,,,,,,,,,,,,,,,
6500,4653,4646,4631,4623,4650,4637,4643,4664,4633,4636,4658,4654,4664,4669,4673,4678,4693,4695,4685,4705,4708,4705,4734,4711,4709,4731,4706,4717,4732,4722,4740,6500,,,,,,,,,,,,,,,,,,,,,,,,,,,,,,,,,,,,,,
6500,4651,4643,4627,4618,4643,4629,4636,4656,4626,4629,4651,4647,4657,4663,4667,4673,4687,4689,4679,4699,4704,4700,4730,4708,4705,4729,4705,4717,4732,4723,4743,6500,,,,,,,,,,,,,,,,,,,,,,,,,,,,,,,,,,,,,,
6500,4516,4508,4493,4483,4511,4497,4501,4523,4492,4494,4518,4513,4523,4530,4533,4539,4554,4557,4546,4568,4572,4568,4600,4578,4575,4601,4577,4588,4605,4598,4621,6500,,,,,,,,,,,,,,,,,,,,,,,,,,,,,,,,,,,,,,
6500,4607,4597,4582,4574,4601,4588,4596,4614,4584,4586,4608,4605,4616,4622,4626,4632,4648,4651,4641,4662,4667,4666,4696,4676,4675,4699,4677,4690,4709,4704,4730,6500,,,,,,,,,,,,,,,,,,,,,,,,,,,,,,,,,,,,,,
6500,4612,4603,4587,4580,4607,4593,4601,4620,4591,4593,4615,4612,4622,4629,4634,4640,4656,4658,4649,4670,4676,4675,4705,4686,4686,4710,4690,4705,4725,4723,4753,6500,,,,,,,,,,,,,,,,,,,,,,,,,,,,,,,,,,,,,,
6500,4579,4569,4554,4546,4573,4560,4567,4586,4557,4559,4581,4578,4589,4595,4600,4607,4622,4626,4617,4639,4645,4645,4676,4658,4658,4683,4665,4681,4704,4706,4742,6500,,,,,,,,,,,,,,,,,,,,,,,,,,,,,,,,,,,,,,
10000,6500,6500,6500,6500,6500,6500,6500,6500,6500,6500,6500,6500,6500,6500,6500,6500,6500,6500,6500,6500,6500,6500,6500,6500,6500,6500,6500,6500,6500,6500,6500,10000,,,,,,,,,,,,,,,,,,,,,,,,,,,,,,,,,,,,,,
#,raw_min,,,,,,,,,,,,,,,,,,,,,,,,,,,,,,,,,,,,,,,,,,,,,,,,,,,,,,,,,,,,,,,,,,,,,
1500,2000,2000,2000,2000,2000,2000,2000,2000,2000,2000,2000,2000,2000,2000,2000,2000,2000,2000,2000,2000,2000,2000,2000,500,2000,2000,2000,2000,2000,2000,2000,1500,,,,,,,,,,,,,,,,,,,,,,,,,,,,,,,,,,,,,,
2000,2436,2432,2424,2420,2434,2426,2428,2439,2423,2425,2437,2436,2441,2445,2448,2452,2461,2463,2459,2471,2473,2474,2502,1963,2328,2494,2481,2492,2502,2502,2522,2000,,,,,,,,,,,,,,,,,,,,,,,,,,,,,,,,,,,,,,
2000,2512,2509,2501,2497,2511,2503,2505,2515,2499,2501,2513,2512,2518,2521,2524,2528,2537,2539,2535,2546,2550,2548,2564,2547,2552,2568,2554,2564,2572,2571,2587,2000,,,,,,,,,,,,,,,,,,,,,,,,,,,,,,,,,,,,,,
2000,2538,2535,2527,2523,2537,2529,2532,2542,2525,2526,2539,2538,2543,2546,2549,2553,2562,2564,2557,2572,2572,2573,2588,2577,2575,2591,2577,2584,2594,2591,2605,2000,,,,,,,,,,,,,,,,,,,,,,,,,,,,,,,,,,,,,,
2000,2551,2547,2539,2533,2549,2540,2542,2553,2536,2538,2551,2549,2554,2558,2560,2564,2572,2575,2569,2582,2582,2584,2597,2587,2584,2599,2584,2594,2600,2596,2609,2000,,,,,,,,,,,,,,,,,,,,,,,,,,,,,,,,,,,,,,
2000,2563,2558,2550,2544,2558,2550,2554,2564,2548,2550,2562,2560,2566,2569,2572,2575,2583,2585,2578,2593,2593,2591,2607,2598,2593,2607,2592,2598,2607,2602,2613,2000,,,,,,,,,,,,,,,,,,,,,,,,,,,,,,,,,,,,,,
2000,2500,2496,2489,2484,2499,2491,2494,2506,2489,2491,2504,2501,2506,2509,2512,2516,2523,2525,2517,2532,2531,2530,2545,2534,2531,2543,2529,2535,2543,2537,2547,2000,,,,,,,,,,,,,,,,,,,,,,,,,,,,,,,,,,,,,,
2000,2574,2570,2561,2557,2572,2564,2568,2579,2563,2565,2577,2576,2580,2583,2583,2584,2593,2598,2590,2602,2604,2602,2617,2604,2602,2614,2599,2605,2613,2606,2615,2000,,,,,,,,,,,,,,,,,,,,,,,,,,,,,,,,,,,,,,
2000,2588,2584,2575,2570,2585,2577,2581,2593,2576,2578,2590,2587,2592,2595,2597,2601,2608,2610,2601,2615,2615,2612,2628,2614,2612,2623,2608,2614,2621,2614,2622,2000,,,,,,,,,,,,,,,,,,,,,,,,,,,,,,,,,,,,,,
2000,2582,2578,2569,2564,2580,2572,2575,2587,2570,2572,2583,2578,2583,2589,2587,2589,2598,2604,2594,2606,2607,2604,2620,2606,2603,2614,2599,2604,2611,2603,2610,2000,,,,,,,,,,,,,,,,,,,,,,,,,,,,,,,,,,,,,,
2000,2593,2589,2580,2575,2591,2582,2586,2597,2580,2582,2595,2592,2596,2599,2602,2600,2610,2612,2603,2615,2616,2613,2628,2614,2611,2623,2607,2611,2618,2609,2616,2000,,,,,,,,,,,,,,,,,,,,,,,,,,,,,,,,,,,,,,
2000,2531,2527,2519,2514,2529,2521,2523,2536,2518,2519,2533,2527,2535,2536,2534,2535,2544,2548,2539,2550,2551,2547,2564,2549,2545,2558,2541,2545,2551,2542,2548,2000,,,,,,,,,,,,,,,,,,,,,,,,,,,,,,,,,,,,,,
2000,2590,2586,2577,2572,2587,2578,2582,2593,2576,2577,2591,2582,2590,2593,2591,2593,2601,2605,2595,2607,2608,2604,2620,2605,2602,2613,2597,2600,2606,2597,2602,2000,,,,,,,,,,,,,,,,,,,,,,,,,,,,,,,,,,,,,,
2000,2574,2570,2562,2556,2571,2563,2567,2576,2557,2557,2570,2566,2571,2573,2574,2575,2584,2585,2578,2589,2589,2586,2602,2586,2583,2594,2578,2581,2587,2576,2581,2000,,,,,,,,,,,,,,,,,,,,,,,,,,,,,,,,,,,,,,
2000,2591,2588,2581,2575,2588,2579,2582,2594,2577,2575,2586,2582,2587,2593,2590,2591,2599,2600,2593,2604,2604,2601,2616,2601,2598,2608,2592,2595,2600,2590,2594,2000,,,,,,,,,,,,,,,,,,,,,,,,,,,,,,,,,,,,,,
2000,2569,2567,2561,2553,2566,2557,2559,2573,2550,2551,2563,2559,2564,2568,2566,2567,2575,2576,2569,2580,2579,2576,2592,2576,2572,2584,2566,2570,2575,2564,2568,2000,,,,,,,,,,,,,,,,,,,,,,,,,,,,,,,,,,,,,,
2000,2516,2514,2508,2500,2513,2504,2505,2518,2498,2497,2510,2505,2510,2517,2512,2513,2521,2522,2514,2525,2525,2520,2537,2520,2517,2529,2511,2514,2520,2508,2513,2000,,,,,,,,,,,,,,,,,,,,,,,,,,,,,,,,,,,,,,
2000,2572,2570,2563,2556,2569,2559,2561,2573,2555,2557,2565,2560,2565,2570,2567,2568,2575,2578,2569,2580,2579,2575,2591,2575,2572,2583,2566,2569,2574,2563,2567,2000,,,,,,,,,,,,,,,,,,,,,,,,,,,,,,,,,,,,,,
2000,2524,2520,2514,2506,2519,2509,2509,2520,2501,2502,2514,2510,2514,2517,2517,2517,2525,2525,2518,2528,2528,2523,2539,2523,2520,2531,2514,2517,2521,2510,2514,2000,,,,,,,,,,,,,,,,,,,,,,,,,,,,,,,,,,,,,,
2000,2497,2496,2490,2482,2494,2486,2483,2495,2476,2478,2490,2485,2490,2492,2492,2493,2500,2500,2493,2503,2503,2499,2514,2498,2495,2506,2489,2492,2496,2486,2490,2000,,,,,,,,,,,,,,,,,,,,,,,,,,,,,,,,,,,,,,
2000,2541,2544,2537,2528,2543,2529,2530,2542,2523,2525,2537,2532,2537,2539,2540,2540,2548,2548,2540,2551,2551,2547,2562,2546,2543,2554,2536,2539,2545,2534,2538,2000,,,,,,,,,,,,,,,,,,,,,,,,,,,,,,,,,,,,,,
2000,2545,2549,2542,2530,2544,2533,2534,2546,2528,2529,2541,2537,2542,2545,2545,2546,2553,2553,2546,2556,2556,2552,2567,2551,2548,2559,2542,2545,2551,2540,2544,2000,,,,,,,,,,,,,,,,,,,,,,,,,,,,,,,,,,,,,,
2000,2565,2566,2560,2551,2564,2554,2556,2568,2550,2551,2563,2558,2564,2566,2567,2568,2575,2575,2568,2578,2578,2574,2590,2574,2570,2582,2565,2568,2573,2562,2567,2000,,,,,,,,,,,,,,,,,,,,,,,,,,,,,,,,,,,,,,
2000,2483,2485,2478,2471,2484,2474,2474,2487,2468,2469,2482,2477,2482,2485,2485,2486,2493,2494,2486,2497,2497,2492,2509,2493,2489,2501,2484,2487,2493,2482,2487,2000,,,,,,,,,,,,,,,,,,,,,,,,,,,,,,,,,,,,,,
2000,2486,2484,2477,2470,2484,2476,2478,2491,2473,2473,2487,2482,2486,2490,2490,2491,2498,2499,2491,2502,2502,2498,2514,2499,2495,2507,2491,2494,2499,2488,2493,2000,,,,,,,,,,,,,,,,,,,,,,,,,,,,,,,,,,,,,,
2000,2561,2561,2552,2549,2562,2550,2554,2565,2548,2549,2561,2557,2562,2565,2566,2567,2575,2575,2567,2578,2579,2575,2591,2576,2573,2584,2568,2572,2577,2567,2572,2000,,,,,,,,,,,,,,,,,,,,,,,,,,,,,,,,,,,,,,
2000,2575,2571,2562,2557,2573,2564,2567,2579,2561,2562,2575,2571,2575,2578,2580,2581,2589,2589,2582,2594,2594,2590,2606,2591,2589,2600,2584,2588,2594,2584,2589,2000,,,,,,,,,,,,,,,,,,,,,,,,,,,,,,,,,,,,,,
2000,2560,2559,2553,2543,2558,2550,2553,2564,2547,2549,2561,2557,2562,2565,2566,2569,2576,2576,2570,2581,2581,2578,2594,2580,2577,2588,2573,2577,2583,2574,2580,2000,,,,,,,,,,,,,,,,,,,,,,,,,,,,,,,,,,,,,,
2000,2530,2526,2517,2512,2527,2519,2522,2534,2517,2519,2530,2527,2532,2535,2537,2539,2547,2548,2542,2552,2553,2551,2566,2552,2549,2560,2546,2550,2557,2549,2555,2000,,,,,,,,,,,,,,,,,,,,,,,,,,,,,,,,,,,,,,
2000,2473,2470,2461,2456,2471,2463,2467,2477,2461,2462,2474,2471,2476,2479,2481,2483,2491,2492,2486,2497,2498,2496,2511,2497,2495,2507,2493,2498,2505,2497,2505,2000,,,,,,,,,,,,,,,,,,,,,,,,,,,,,,,,,,,,,,
2000,2527,2523,2515,2510,2525,2518,2521,2532,2515,2517,2529,2526,2531,2534,2537,2539,2547,2548,2542,2553,2554,2552,2568,2555,2553,2565,2551,2556,2564,2558,2567,2000,,,,,,,,,,,,,,,,,,,,,,,,,,,,,,,,,,,,,,
2000,2505,2501,2493,2489,2504,2496,2500,2511,2494,2496,2508,2506,2511,2514,2516,2519,2527,2528,2522,2533,2535,2533,2549,2536,2535,2547,2534,2540,2548,2542,2552,2000,,,,,,,,,,,,,,,,,,,,,,,,,,,,,,,,,,,,,,
2000,2504,2500,2491,2486,2500,2492,2496,2507,2491,2492,2504,2502,2507,2510,2513,2516,2524,2525,2519,2530,2532,2531,2547,2535,2533,2546,2533,2539,2548,2543,2554,2000,,,,,,,,,,,,,,,,,,,,,,,,,,,,,,,,,,,,,,
2000,2432,2427,2419,2414,2429,2421,2423,2435,2419,2420,2433,2430,2435,2439,2441,2444,2452,2453,2448,2459,2462,2460,2477,2465,2463,2477,2464,2470,2480,2475,2488,2000,,,,,,,,,,,,,,,,,,,,,,,,,,,,,,,,,,,,,,
2000,2480,2475,2467,2463,2477,2470,2474,2484,2468,2469,2481,2479,2485,2488,2491,2494,2502,2504,2499,2510,2513,2512,2528,2518,2517,2530,2518,2525,2535,2533,2547,2000,,,,,,,,,,,,,,,,,,,,,,,,,,,,,,,,,,,,,,
2000,2483,2478,2470,2466,2480,2473,2477,2487,2472,2473,2485,2483,2489,2492,2495,2498,2507,2508,2503,2514,2517,2517,2533,2523,2523,2536,2525,2533,2544,2543,2559,2000,,,,,,,,,,,,,,,,,,,,,,,,,,,,,,,,,,,,,,
2000,2465,2460,2452,2448,2462,2455,2459,2469,2454,2454,2466,2465,2471,2474,2477,2480,2489,2490,2486,2498,2501,2501,2517,2508,2508,2521,2511,2521,2533,2534,2553,2000,,,,,,,,,,,,,,,,,,,,,,,,,,,,,,,,,,,,,,
1500,2000,2000,2000,2000,2000,2000,2000,2000,2000,2000,2000,2000,2000,2000,2000,2000,2000,2000,2000,2000,2000,2000,2000,2000,2000,2000,2000,2000,2000,2000,2000,1500,,,,,,,,,,,,,,,,,,,,,,,,,,,,,,,,,,,,,,
#,raw_row_delta_max,,,,,,,,,,,,,,,,,,,,,,,,,,,,,,,,,,,,,,,,,,,,,,,,,,,,,,,,,,,,,,,,,,,,,
1000,800,800,800,800,800,800,800,800,800,800,800,800,800,800,800,800,800,800,800,800,800,800,800,3500,800,800,800,800,800,800,800,1000,,,,,,,,,,,,,,,,,,,,,,,,,,,,,,,,,,,,,,
800,800,800,800,800,800,800,800,800,800,800,800,800,800,800,800,800,800,800,800,800,800,800,800,3500,800,800,800,800,800,800,800,800,,,,,,,,,,,,,,,,,,,,,,,,,,,,,,,,,,,,,,
800,800,800,800,800,800,800,800,800,800,800,800,800,800,800,800,800,800,800,800,800,800,800,800,800,800,800,800,800,800,800,800,800,,,,,,,,,,,,,,,,,,,,,,,,,,,,,,,,,,,,,,
800,800,800,800,800,800,800,800,800,800,800,800,800,800,800,800,800,800,800,800,800,800,800,800,800,800,800,800,800,800,800,800,800,,,,,,,,,,,,,,,,,,,,,,,,,,,,,,,,,,,,,,
800,800,800,800,800,800,800,800,800,800,800,800,800,800,800,800,800,800,800,800,800,800,800,800,800,800,800,800,800,800,800,800,800,,,,,,,,,,,,,,,,,,,,,,,,,,,,,,,,,,,,,,
800,800,800,800,800,800,800,800,800,800,800,800,800,800,800,800,800,800,800,800,800,800,800,800,800,800,800,800,800,800,800,800,800,,,,,,,,,,,,,,,,,,,,,,,,,,,,,,,,,,,,,,
800,800,800,800,800,800,800,800,800,800,800,800,800,800,800,800,800,800,800,800,800,800,800,800,800,800,800,800,800,800,800,800,800,,,,,,,,,,,,,,,,,,,,,,,,,,,,,,,,,,,,,,
800,800,800,800,800,800,800,800,800,800,800,800,800,800,800,800,800,800,800,800,800,800,800,800,800,800,800,800,800,800,800,800,800,,,,,,,,,,,,,,,,,,,,,,,,,,,,,,,,,,,,,,
800,800,800,800,800,800,800,800,800,800,800,800,800,800,800,800,800,800,800,800,800,800,800,800,800,800,800,800,800,800,800,800,800,,,,,,,,,,,,,,,,,,,,,,,,,,,,,,,,,,,,,,
800,800,800,800,800,800,800,800,800,800,800,800,800,800,800,800,800,800,800,800,800,800,800,800,800,800,800,800,800,800,800,800,800,,,,,,,,,,,,,,,,,,,,,,,,,,,,,,,,,,,,,,
800,800,800,800,800,800,800,800,800,800,800,800,800,800,800,800,800,800,800,800,800,800,800,800,800,800,800,800,800,800,800,800,800,,,,,,,,,,,,,,,,,,,,,,,,,,,,,,,,,,,,,,
800,800,800,800,800,800,800,800,800,800,800,800,800,800,800,800,800,800,800,800,800,800,800,800,800,800,800,800,800,800,800,800,800,,,,,,,,,,,,,,,,,,,,,,,,,,,,,,,,,,,,,,
800,800,800,800,800,800,800,800,800,800,800,800,800,800,800,800,800,800,800,800,800,800,800,800,800,800,800,800,800,800,800,800,800,,,,,,,,,,,,,,,,,,,,,,,,,,,,,,,,,,,,,,
800,800,800,800,800,800,800,800,800,800,800,800,800,800,800,800,800,800,800,800,800,800,800,800,800,800,800,800,800,800,800,800,800,,,,,,,,,,,,,,,,,,,,,,,,,,,,,,,,,,,,,,
800,800,800,800,800,800,800,800,800,800,800,800,800,800,800,800,800,800,800,800,800,800,800,800,800,800,800,800,800,800,800,800,800,,,,,,,,,,,,,,,,,,,,,,,,,,,,,,,,,,,,,,
800,800,800,800,800,800,800,800,800,800,800,800,800,800,800,800,800,800,800,800,800,800,800,800,800,800,800,800,800,800,800,800,800,,,,,,,,,,,,,,,,,,,,,,,,,,,,,,,,,,,,,,
800,800,800,800,800,800,800,800,800,800,800,800,800,800,800,800,800,800,800,800,800,800,800,800,800,800,800,800,800,800,800,800,800,,,,,,,,,,,,,,,,,,,,,,,,,,,,,,,,,,,,,,
800,800,800,800,800,800,800,800,800,800,800,800,800,800,800,800,800,800,800,800,800,800,800,800,800,800,800,800,800,800,800,800,800,,,,,,,,,,,,,,,,,,,,,,,,,,,,,,,,,,,,,,
800,800,800,800,800,800,800,800,800,800,800,800,800,800,800,800,800,800,800,800,800,800,800,800,800,800,800,800,800,800,800,800,800,,,,,,,,,,,,,,,,,,,,,,,,,,,,,,,,,,,,,,
800,800,800,800,800,800,800,800,800,800,800,800,800,800,800,800,800,800,800,800,800,800,800,800,800,800,800,800,800,800,800,800,800,,,,,,,,,,,,,,,,,,,,,,,,,,,,,,,,,,,,,,
800,800,800,800,800,800,800,800,800,800,800,800,800,800,800,800,800,800,800,800,800,800,800,800,800,800,800,800,800,800,800,800,800,,,,,,,,,,,,,,,,,,,,,,,,,,,,,,,,,,,,,,
800,800,800,800,800,800,800,800,800,800,800,800,800,800,800,800,800,800,800,800,800,800,800,800,800,800,800,800,800,800,800,800,800,,,,,,,,,,,,,,,,,,,,,,,,,,,,,,,,,,,,,,
800,800,800,800,800,800,800,800,800,800,800,800,800,800,800,800,800,800,800,800,800,800,800,800,800,800,800,800,800,800,800,800,800,,,,,,,,,,,,,,,,,,,,,,,,,,,,,,,,,,,,,,
800,800,800,800,800,800,800,800,800,800,800,800,800,800,800,800,800,800,800,800,800,800,800,800,800,800,800,800,800,800,800,800,800,,,,,,,,,,,,,,,,,,,,,,,,,,,,,,,,,,,,,,
800,800,800,800,800,800,800,800,800,800,800,800,800,800,800,800,800,800,800,800,800,800,800,800,800,800,800,800,800,800,800,800,800,,,,,,,,,,,,,,,,,,,,,,,,,,,,,,,,,,,,,,
800,800,800,800,800,800,800,800,800,800,800,800,800,800,800,800,800,800,800,800,800,800,800,800,800,800,800,800,800,800,800,800,800,,,,,,,,,,,,,,,,,,,,,,,,,,,,,,,,,,,,,,
800,800,800,800,800,800,800,800,800,800,800,800,800,800,800,800,800,800,800,800,800,800,800,800,800,800,800,800,800,800,800,800,800,,,,,,,,,,,,,,,,,,,,,,,,,,,,,,,,,,,,,,
800,800,800,800,800,800,800,800,800,800,800,800,800,800,800,800,800,800,800,800,800,800,800,800,800,800,800,800,800,800,800,800,800,,,,,,,,,,,,,,,,,,,,,,,,,,,,,,,,,,,,,,
800,800,800,800,800,800,800,800,800,800,800,800,800,800,800,800,800,800,800,800,800,800,800,800,800,800,800,800,800,800,800,800,800,,,,,,,,,,,,,,,,,,,,,,,,,,,,,,,,,,,,,,
800,800,800,800,800,800,800,800,800,800,800,800,800,800,800,800,800,800,800,800,800,800,800,800,800,800,800,800,800,800,800,800,800,,,,,,,,,,,,,,,,,,,,,,,,,,,,,,,,,,,,,,
800,800,800,800,800,800,800,800,800,800,800,800,800,800,800,800,800,800,800,800,800,800,800,800,800,800,800,800,800,800,800,800,800,,,,,,,,,,,,,,,,,,,,,,,,,,,,,,,,,,,,,,
800,800,800,800,800,800,800,800,800,800,800,800,800,800,800,800,800,800,800,800,800,800,800,800,800,800,800,800,800,800,800,800,800,,,,,,,,,,,,,,,,,,,,,,,,,,,,,,,,,,,,,,
800,800,800,800,800,800,800,800,800,800,800,800,800,800,800,800,800,800,800,800,800,800,800,800,800,800,800,800,800,800,800,800,800,,,,,,,,,,,,,,,,,,,,,,,,,,,,,,,,,,,,,,
800,800,800,800,800,800,800,800,800,800,800,800,800,800,800,800,800,800,800,800,800,800,800,800,800,800,800,800,800,800,800,800,800,,,,,,,,,,,,,,,,,,,,,,,,,,,,,,,,,,,,,,
800,800,800,800,800,800,800,800,800,800,800,800,800,800,800,800,800,800,800,800,800,800,800,800,800,800,800,800,800,800,800,800,800,,,,,,,,,,,,,,,,,,,,,,,,,,,,,,,,,,,,,,
800,800,800,800,800,800,800,800,800,800,800,800,800,800,800,800,800,800,800,800,800,800,800,800,800,800,800,800,800,800,800,800,800,,,,,,,,,,,,,,,,,,,,,,,,,,,,,,,,,,,,,,
1000,800,800,800,800,800,800,800,800,800,800,800,800,800,800,800,800,800,800,800,800,800,800,800,800,800,800,800,800,800,800,800,1000,,,,,,,,,,,,,,,,,,,,,,,,,,,,,,,,,,,,,,
#,raw_row_delta_min,,,,,,,,,,,,,,,,,,,,,,,,,,,,,,,,,,,,,,,,,,,,,,,,,,,,,,,,,,,,,,,,,,,,,
-1000,-800,-800,-800,-800,-800,-800,-800,-800,-800,-800,-800,-800,-800,-800,-800,-800,-800,-800,-800,-800,-800,-800,-800,-3500,-800,-800,-800,-800,-800,-800,-800,-1000,,,,,,,,,,,,,,,,,,,,,,,,,,,,,,,,,,,,,,
-800,-800,-800,-800,-800,-800,-800,-800,-800,-800,-800,-800,-800,-800,-800,-800,-800,-800,-800,-800,-800,-800,-800,-800,-3500,-800,-800,-800,-800,-800,-800,-800,-800,,,,,,,,,,,,,,,,,,,,,,,,,,,,,,,,,,,,,,
-800,-800,-800,-800,-800,-800,-800,-800,-800,-800,-800,-800,-800,-800,-800,-800,-800,-800,-800,-800,-800,-800,-800,-800,-800,-800,-800,-800,-800,-800,-800,-800,-800,,,,,,,,,,,,,,,,,,,,,,,,,,,,,,,,,,,,,,
-800,-800,-800,-800,-800,-800,-800,-800,-800,-800,-800,-800,-800,-800,-800,-800,-800,-800,-800,-800,-800,-800,-800,-800,-800,-800,-800,-800,-800,-800,-800,-800,-800,,,,,,,,,,,,,,,,,,,,,,,,,,,,,,,,,,,,,,
-800,-800,-800,-800,-800,-800,-800,-800,-800,-800,-800,-800,-800,-800,-800,-800,-800,-800,-800,-800,-800,-800,-800,-800,-800,-800,-800,-800,-800,-800,-800,-800,-800,,,,,,,,,,,,,,,,,,,,,,,,,,,,,,,,,,,,,,
-800,-800,-800,-800,-800,-800,-800,-800,-800,-800,-800,-800,-800,-800,-800,-800,-800,-800,-800,-800,-800,-800,-800,-800,-800,-800,-800,-800,-800,-800,-800,-800,-800,,,,,,,,,,,,,,,,,,,,,,,,,,,,,,,,,,,,,,
-800,-800,-800,-800,-800,-800,-800,-800,-800,-800,-800,-800,-800,-800,-800,-800,-800,-800,-800,-800,-800,-800,-800,-800,-800,-800,-800,-800,-800,-800,-800,-800,-800,,,,,,,,,,,,,,,,,,,,,,,,,,,,,,,,,,,,,,
-800,-800,-800,-800,-800,-800,-800,-800,-800,-800,-800,-800,-800,-800,-800,-800,-800,-800,-800,-800,-800,-800,-800,-800,-800,-800,-800,-800,-800,-800,-800,-800,-800,,,,,,,,,,,,,,,,,,,,,,,,,,,,,,,,,,,,,,
-800,-800,-800,-800,-800,-800,-800,-800,-800,-800,-800,-800,-800,-800,-800,-800,-800,-800,-800,-800,-800,-800,-800,-800,-800,-800,-800,-800,-800,-800,-800,-800,-800,,,,,,,,,,,,,,,,,,,,,,,,,,,,,,,,,,,,,,
-800,-800,-800,-800,-800,-800,-800,-800,-800,-800,-800,-800,-800,-800,-800,-800,-800,-800,-800,-800,-800,-800,-800,-800,-800,-800,-800,-800,-800,-800,-800,-800,-800,,,,,,,,,,,,,,,,,,,,,,,,,,,,,,,,,,,,,,
-800,-800,-800,-800,-800,-800,-800,-800,-800,-800,-800,-800,-800,-800,-800,-800,-800,-800,-800,-800,-800,-800,-800,-800,-800,-800,-800,-800,-800,-800,-800,-800,-800,,,,,,,,,,,,,,,,,,,,,,,,,,,,,,,,,,,,,,
-800,-800,-800,-800,-800,-800,-800,-800,-800,-800,-800,-800,-800,-800,-800,-800,-800,-800,-800,-800,-800,-800,-800,-800,-800,-800,-800,-800,-800,-800,-800,-800,-800,,,,,,,,,,,,,,,,,,,,,,,,,,,,,,,,,,,,,,
-800,-800,-800,-800,-800,-800,-800,-800,-800,-800,-800,-800,-800,-800,-800,-800,-800,-800,-800,-800,-800,-800,-800,-800,-800,-800,-800,-800,-800,-800,-800,-800,-800,,,,,,,,,,,,,,,,,,,,,,,,,,,,,,,,,,,,,,
-800,-800,-800,-800,-800,-800,-800,-800,-800,-800,-800,-800,-800,-800,-800,-800,-800,-800,-800,-800,-800,-800,-800,-800,-800,-800,-800,-800,-800,-800,-800,-800,-800,,,,,,,,,,,,,,,,,,,,,,,,,,,,,,,,,,,,,,
-800,-800,-800,-800,-800,-800,-800,-800,-800,-800,-800,-800,-800,-800,-800,-800,-800,-800,-800,-800,-800,-800,-800,-800,-800,-800,-800,-800,-800,-800,-800,-800,-800,,,,,,,,,,,,,,,,,,,,,,,,,,,,,,,,,,,,,,
-800,-800,-800,-800,-800,-800,-800,-800,-800,-800,-800,-800,-800,-800,-800,-800,-800,-800,-800,-800,-800,-800,-800,-800,-800,-800,-800,-800,-800,-800,-800,-800,-800,,,,,,,,,,,,,,,,,,,,,,,,,,,,,,,,,,,,,,
-800,-800,-800,-800,-800,-800,-800,-800,-800,-800,-800,-800,-800,-800,-800,-800,-800,-800,-800,-800,-800,-800,-800,-800,-800,-800,-800,-800,-800,-800,-800,-800,-800,,,,,,,,,,,,,,,,,,,,,,,,,,,,,,,,,,,,,,
-800,-800,-800,-800,-800,-800,-800,-800,-800,-800,-800,-800,-800,-800,-800,-800,-800,-800,-800,-800,-800,-800,-800,-800,-800,-800,-800,-800,-800,-800,-800,-800,-800,,,,,,,,,,,,,,,,,,,,,,,,,,,,,,,,,,,,,,
-800,-800,-800,-800,-800,-800,-800,-800,-800,-800,-800,-800,-800,-800,-800,-800,-800,-800,-800,-800,-800,-800,-800,-800,-800,-800,-800,-800,-800,-800,-800,-800,-800,,,,,,,,,,,,,,,,,,,,,,,,,,,,,,,,,,,,,,
-800,-800,-800,-800,-800,-800,-800,-800,-800,-800,-800,-800,-800,-800,-800,-800,-800,-800,-800,-800,-800,-800,-800,-800,-800,-800,-800,-800,-800,-800,-800,-800,-800,,,,,,,,,,,,,,,,,,,,,,,,,,,,,,,,,,,,,,
-800,-800,-800,-800,-800,-800,-800,-800,-800,-800,-800,-800,-800,-800,-800,-800,-800,-800,-800,-800,-800,-800,-800,-800,-800,-800,-800,-800,-800,-800,-800,-800,-800,,,,,,,,,,,,,,,,,,,,,,,,,,,,,,,,,,,,,,
-800,-800,-800,-800,-800,-800,-800,-800,-800,-800,-800,-800,-800,-800,-800,-800,-800,-800,-800,-800,-800,-800,-800,-800,-800,-800,-800,-800,-800,-800,-800,-800,-800,,,,,,,,,,,,,,,,,,,,,,,,,,,,,,,,,,,,,,
-800,-800,-800,-800,-800,-800,-800,-800,-800,-800,-800,-800,-800,-800,-800,-800,-800,-800,-800,-800,-800,-800,-800,-800,-800,-800,-800,-800,-800,-800,-800,-800,-800,,,,,,,,,,,,,,,,,,,,,,,,,,,,,,,,,,,,,,
-800,-800,-800,-800,-800,-800,-800,-800,-800,-800,-800,-800,-800,-800,-800,-800,-800,-800,-800,-800,-800,-800,-800,-800,-800,-800,-800,-800,-800,-800,-800,-800,-800,,,,,,,,,,,,,,,,,,,,,,,,,,,,,,,,,,,,,,
-800,-800,-800,-800,-800,-800,-800,-800,-800,-800,-800,-800,-800,-800,-800,-800,-800,-800,-800,-800,-800,-800,-800,-800,-800,-800,-800,-800,-800,-800,-800,-800,-800,,,,,,,,,,,,,,,,,,,,,,,,,,,,,,,,,,,,,,
-800,-800,-800,-800,-800,-800,-800,-800,-800,-800,-800,-800,-800,-800,-800,-800,-800,-800,-800,-800,-800,-800,-800,-800,-800,-800,-800,-800,-800,-800,-800,-800,-800,,,,,,,,,,,,,,,,,,,,,,,,,,,,,,,,,,,,,,
-800,-800,-800,-800,-800,-800,-800,-800,-800,-800,-800,-800,-800,-800,-800,-800,-800,-800,-800,-800,-800,-800,-800,-800,-800,-800,-800,-800,-800,-800,-800,-800,-800,,,,,,,,,,,,,,,,,,,,,,,,,,,,,,,,,,,,,,
-800,-800,-800,-800,-800,-800,-800,-800,-800,-800,-800,-800,-800,-800,-800,-800,-800,-800,-800,-800,-800,-800,-800,-800,-800,-800,-800,-800,-800,-800,-800,-800,-800,,,,,,,,,,,,,,,,,,,,,,,,,,,,,,,,,,,,,,
-800,-800,-800,-800,-800,-800,-800,-800,-800,-800,-800,-800,-800,-800,-800,-800,-800,-800,-800,-800,-800,-800,-800,-800,-800,-800,-800,-800,-800,-800,-800,-800,-800,,,,,,,,,,,,,,,,,,,,,,,,,,,,,,,,,,,,,,
-800,-800,-800,-800,-800,-800,-800,-800,-800,-800,-800,-800,-800,-800,-800,-800,-800,-800,-800,-800,-800,-800,-800,-800,-800,-800,-800,-800,-800,-800,-800,-800,-800,,,,,,,,,,,,,,,,,,,,,,,,,,,,,,,,,,,,,,
-800,-800,-800,-800,-800,-800,-800,-800,-800,-800,-800,-800,-800,-800,-800,-800,-800,-800,-800,-800,-800,-800,-800,-800,-800,-800,-800,-800,-800,-800,-800,-800,-800,,,,,,,,,,,,,,,,,,,,,,,,,,,,,,,,,,,,,,
-800,-800,-800,-800,-800,-800,-800,-800,-800,-800,-800,-800,-800,-800,-800,-800,-800,-800,-800,-800,-800,-800,-800,-800,-800,-800,-800,-800,-800,-800,-800,-800,-800,,,,,,,,,,,,,,,,,,,,,,,,,,,,,,,,,,,,,,
-800,-800,-800,-800,-800,-800,-800,-800,-800,-800,-800,-800,-800,-800,-800,-800,-800,-800,-800,-800,-800,-800,-800,-800,-800,-800,-800,-800,-800,-800,-800,-800,-800,,,,,,,,,,,,,,,,,,,,,,,,,,,,,,,,,,,,,,
-800,-800,-800,-800,-800,-800,-800,-800,-800,-800,-800,-800,-800,-800,-800,-800,-800,-800,-800,-800,-800,-800,-800,-800,-800,-800,-800,-800,-800,-800,-800,-800,-800,,,,,,,,,,,,,,,,,,,,,,,,,,,,,,,,,,,,,,
-800,-800,-800,-800,-800,-800,-800,-800,-800,-800,-800,-800,-800,-800,-800,-800,-800,-800,-800,-800,-800,-800,-800,-800,-800,-800,-800,-800,-800,-800,-800,-800,-800,,,,,,,,,,,,,,,,,,,,,,,,,,,,,,,,,,,,,,
-800,-800,-800,-800,-800,-800,-800,-800,-800,-800,-800,-800,-800,-800,-800,-800,-800,-800,-800,-800,-800,-800,-800,-800,-800,-800,-800,-800,-800,-800,-800,-800,-800,,,,,,,,,,,,,,,,,,,,,,,,,,,,,,,,,,,,,,
-1000,-800,-800,-800,-800,-800,-800,-800,-800,-800,-800,-800,-800,-800,-800,-800,-800,-800,-800,-800,-800,-800,-800,-800,-800,-800,-800,-800,-800,-800,-800,-800,-1000,,,,,,,,,,,,,,,,,,,,,,,,,,,,,,,,,,,,,,
#,raw_col_delta_max,,,,,,,,,,,,,,,,,,,,,,,,,,,,,,,,,,,,,,,,,,,,,,,,,,,,,,,,,,,,,,,,,,,,,
1500,1000,1000,1000,1000,1000,1000,1000,1000,1000,1000,1000,1000,1000,1000,1000,1000,1000,1000,1000,1000,1000,1000,3500,3500,3500,1000,1000,1000,1000,1000,1500,,,,,,,,,,,,,,,,,,,,,,,,,,,,,,,,,,,,,,,
1000,1000,1000,1000,1000,1000,1000,1000,1000,1000,1000,1000,1000,1000,1000,1000,1000,1000,1000,1000,1000,1000,1000,3500,3500,3500,1000,1000,1000,1000,1000,1000,,,,,,,,,,,,,,,,,,,,,,,,,,,,,,,,,,,,,,,
1000,1000,1000,1000,1000,1000,1000,1000,1000,1000,1000,1000,1000,1000,1000,1000,1000,1000,1000,1000,1000,1000,1000,1000,1000,1000,1000,1000,1000,1000,1000,1000,,,,,,,,,,,,,,,,,,,,,,,,,,,,,,,,,,,,,,,
1000,1000,1000,1000,1000,1000,1000,1000,1000,1000,1000,1000,1000,1000,1000,1000,1000,1000,1000,1000,1000,1000,1000,1000,1000,1000,1000,1000,1000,1000,1000,1000,,,,,,,,,,,,,,,,,,,,,,,,,,,,,,,,,,,,,,,
1000,1000,1000,1000,1000,1000,1000,1000,1000,1000,1000,1000,1000,1000,1000,1000,1000,1000,1000,1000,1000,1000,1000,1000,1000,1000,1000,1000,1000,1000,1000,1000,,,,,,,,,,,,,,,,,,,,,,,,,,,,,,,,,,,,,,,
1000,1000,1000,1000,1000,1000,1000,1000,1000,1000,1000,1000,1000,1000,1000,1000,1000,1000,1000,1000,1000,1000,1000,1000,1000,1000,1000,1000,1000,1000,1000,1000,,,,,,,,,,,,,,,,,,,,,,,,,,,,,,,,,,,,,,,
1000,1000,1000,1000,1000,1000,1000,1000,1000,1000,1000,1000,1000,1000,1000,1000,1000,1000,1000,1000,1000,1000,1000,1000,1000,1000,1000,1000,1000,1000,1000,1000,,,,,,,,,,,,,,,,,,,,,,,,,,,,,,,,,,,,,,,
1000,1000,1000,1000,1000,1000,1000,1000,1000,1000,1000,1000,1000,1000,1000,1000,1000,1000,1000,1000,1000,1000,1000,1000,1000,1000,1000,1000,1000,1000,1000,1000,,,,,,,,,,,,,,,,,,,,,,,,,,,,,,,,,,,,,,,
1000,1000,1000,1000,1000,1000,1000,1000,1000,1000,1000,1000,1000,1000,1000,1000,1000,1000,1000,1000,1000,1000,1000,1000,1000,1000,1000,1000,1000,1000,1000,1000,,,,,,,,,,,,,,,,,,,,,,,,,,,,,,,,,,,,,,,
1000,1000,1000,1000,1000,1000,1000,1000,1000,1000,1000,1000,1000,1000,1000,1000,1000,1000,1000,1000,1000,1000,1000,1000,1000,1000,1000,1000,1000,1000,1000,1000,,,,,,,,,,,,,,,,,,,,,,,,,,,,,,,,,,,,,,,
1000,1000,1000,1000,1000,1000,1000,1000,1000,1000,1000,1000,1000,1000,1000,1000,1000,1000,1000,1000,1000,1000,1000,1000,1000,1000,1000,1000,1000,1000,1000,1000,,,,,,,,,,,,,,,,,,,,,,,,,,,,,,,,,,,,,,,
1000,1000,1000,1000,1000,1000,1000,1000,1000,1000,1000,1000,1000,1000,1000,1000,1000,1000,1000,1000,1000,1000,1000,1000,1000,1000,1000,1000,1000,1000,1000,1000,,,,,,,,,,,,,,,,,,,,,,,,,,,,,,,,,,,,,,,
1000,1000,1000,1000,1000,1000,1000,1000,1000,1000,1000,1000,1000,1000,1000,1000,1000,1000,1000,1000,1000,1000,1000,1000,1000,1000,1000,1000,1000,1000,1000,1000,,,,,,,,,,,,,,,,,,,,,,,,,,,,,,,,,,,,,,,
1000,1000,1000,1000,1000,1000,1000,1000,1000,1000,1000,1000,1000,1000,1000,1000,1000,1000,1000,1000,1000,1000,1000,1000,1000,1000,1000,1000,1000,1000,1000,1000,,,,,,,,,,,,,,,,,,,,,,,,,,,,,,,,,,,,,,,
1000,1000,1000,1000,1000,1000,1000,1000,1000,1000,1000,1000,1000,1000,1000,1000,1000,1000,1000,1000,1000,1000,1000,1000,1000,1000,1000,1000,1000,1000,1000,1000,,,,,,,,,,,,,,,,,,,,,,,,,,,,,,,,,,,,,,,
1000,1000,1000,1000,1000,1000,1000,1000,1000,1000,1000,1000,1000,1000,1000,1000,1000,1000,1000,1000,1000,1000,1000,1000,1000,1000,1000,1000,1000,1000,1000,1000,,,,,,,,,,,,,,,,,,,,,,,,,,,,,,,,,,,,,,,
1000,1000,1000,1000,1000,1000,1000,1000,1000,1000,1000,1000,1000,1000,1000,1000,1000,1000,1000,1000,1000,1000,1000,1000,1000,1000,1000,1000,1000,1000,1000,1000,,,,,,,,,,,,,,,,,,,,,,,,,,,,,,,,,,,,,,,
1000,1000,1000,1000,1000,1000,1000,1000,1000,1000,1000,1000,1000,1000,1000,1000,1000,1000,1000,1000,1000,1000,1000,1000,1000,1000,1000,1000,1000,1000,1000,1000,,,,,,,,,,,,,,,,,,,,,,,,,,,,,,,,,,,,,,,
1000,1000,1000,1000,1000,1000,1000,1000,1000,1000,1000,1000,1000,1000,1000,1000,1000,1000,1000,1000,1000,1000,1000,1000,1000,1000,1000,1000,1000,1000,1000,1000,,,,,,,,,,,,,,,,,,,,,,,,,,,,,,,,,,,,,,,
1000,1000,1000,1000,1000,1000,1000,1000,1000,1000,1000,1000,1000,1000,1000,1000,1000,1000,1000,1000,1000,1000,1000,1000,1000,1000,1000,1000,1000,1000,1000,1000,,,,,,,,,,,,,,,,,,,,,,,,,,,,,,,,,,,,,,,
1000,1000,1000,1000,1000,1000,1000,1000,1000,1000,1000,1000,1000,1000,1000,1000,1000,1000,1000,1000,1000,1000,1000,1000,1000,1000,1000,1000,1000,1000,1000,1000,,,,,,,,,,,,,,,,,,,,,,,,,,,,,,,,,,,,,,,
1000,1000,1000,1000,1000,1000,1000,1000,1000,1000,1000,1000,1000,1000,1000,1000,1000,1000,1000,1000,1000,1000,1000,1000,1000,1000,1000,1000,1000,1000,1000,1000,,,,,,,,,,,,,,,,,,,,,,,,,,,,,,,,,,,,,,,
1000,1000,1000,1000,1000,1000,1000,1000,1000,1000,1000,1000,1000,1000,1000,1000,1000,1000,1000,1000,1000,1000,1000,1000,1000,1000,1000,1000,1000,1000,1000,1000,,,,,,,,,,,,,,,,,,,,,,,,,,,,,,,,,,,,,,,
1000,1000,1000,1000,1000,1000,1000,1000,1000,1000,1000,1000,1000,1000,1000,1000,1000,1000,1000,1000,1000,1000,1000,1000,1000,1000,1000,1000,1000,1000,1000,1000,,,,,,,,,,,,,,,,,,,,,,,,,,,,,,,,,,,,,,,
1000,1000,1000,1000,1000,1000,1000,1000,1000,1000,1000,1000,1000,1000,1000,1000,1000,1000,1000,1000,1000,1000,1000,1000,1000,1000,1000,1000,1000,1000,1000,1000,,,,,,,,,,,,,,,,,,,,,,,,,,,,,,,,,,,,,,,
1000,1000,1000,1000,1000,1000,1000,1000,1000,1000,1000,1000,1000,1000,1000,1000,1000,1000,1000,1000,1000,1000,1000,1000,1000,1000,1000,1000,1000,1000,1000,1000,,,,,,,,,,,,,,,,,,,,,,,,,,,,,,,,,,,,,,,
1000,1000,1000,1000,1000,1000,1000,1000,1000,1000,1000,1000,1000,1000,1000,1000,1000,1000,1000,1000,1000,1000,1000,1000,1000,1000,1000,1000,1000,1000,1000,1000,,,,,,,,,,,,,,,,,,,,,,,,,,,,,,,,,,,,,,,
1000,1000,1000,1000,1000,1000,1000,1000,1000,1000,1000,1000,1000,1000,1000,1000,1000,1000,1000,1000,1000,1000,1000,1000,1000,1000,1000,1000,1000,1000,1000,1000,,,,,,,,,,,,,,,,,,,,,,,,,,,,,,,,,,,,,,,
1000,1000,1000,1000,1000,1000,1000,1000,1000,1000,1000,1000,1000,1000,1000,1000,1000,1000,1000,1000,1000,1000,1000,1000,1000,1000,1000,1000,1000,1000,1000,1000,,,,,,,,,,,,,,,,,,,,,,,,,,,,,,,,,,,,,,,
1000,1000,1000,1000,1000,1000,1000,1000,1000,1000,1000,1000,1000,1000,1000,1000,1000,1000,1000,1000,1000,1000,1000,1000,1000,1000,1000,1000,1000,1000,1000,1000,,,,,,,,,,,,,,,,,,,,,,,,,,,,,,,,,,,,,,,
1000,1000,1000,1000,1000,1000,1000,1000,1000,1000,1000,1000,1000,1000,1000,1000,1000,1000,1000,1000,1000,1000,1000,1000,1000,1000,1000,1000,1000,1000,1000,1000,,,,,,,,,,,,,,,,,,,,,,,,,,,,,,,,,,,,,,,
1000,1000,1000,1000,1000,1000,1000,1000,1000,1000,1000,1000,1000,1000,1000,1000,1000,1000,1000,1000,1000,1000,1000,1000,1000,1000,1000,1000,1000,1000,1000,1000,,,,,,,,,,,,,,,,,,,,,,,,,,,,,,,,,,,,,,,
1000,1000,1000,1000,1000,1000,1000,1000,1000,1000,1000,1000,1000,1000,1000,1000,1000,1000,1000,1000,1000,1000,1000,1000,1000,1000,1000,1000,1000,1000,1000,1000,,,,,,,,,,,,,,,,,,,,,,,,,,,,,,,,,,,,,,,
1000,1000,1000,1000,1000,1000,1000,1000,1000,1000,1000,1000,1000,1000,1000,1000,1000,1000,1000,1000,1000,1000,1000,1000,1000,1000,1000,1000,1000,1000,1000,1000,,,,,,,,,,,,,,,,,,,,,,,,,,,,,,,,,,,,,,,
1000,1000,1000,1000,1000,1000,1000,1000,1000,1000,1000,1000,1000,1000,1000,1000,1000,1000,1000,1000,1000,1000,1000,1000,1000,1000,1000,1000,1000,1000,1000,1000,,,,,,,,,,,,,,,,,,,,,,,,,,,,,,,,,,,,,,,
1000,1000,1000,1000,1000,1000,1000,1000,1000,1000,1000,1000,1000,1000,1000,1000,1000,1000,1000,1000,1000,1000,1000,1000,1000,1000,1000,1000,1000,1000,1000,1000,,,,,,,,,,,,,,,,,,,,,,,,,,,,,,,,,,,,,,,
1000,1000,1000,1000,1000,1000,1000,1000,1000,1000,1000,1000,1000,1000,1000,1000,1000,1000,1000,1000,1000,1000,1000,1000,1000,1000,1000,1000,1000,1000,1000,1000,,,,,,,,,,,,,,,,,,,,,,,,,,,,,,,,,,,,,,,
1500,1000,1000,1000,1000,1000,1000,1000,1000,1000,1000,1000,1000,1000,1000,1000,1000,1000,1000,1000,1000,1000,1000,1000,1000,1000,1000,1000,1000,1000,1000,1500,,,,,,,,,,,,,,,,,,,,,,,,,,,,,,,,,,,,,,,
#,raw_col_delta_min,,,,,,,,,,,,,,,,,,,,,,,,,,,,,,,,,,,,,,,,,,,,,,,,,,,,,,,,,,,,,,,,,,,,,
-1500,-1000,-1000,-1000,-1000,-1000,-1000,-1000,-1000,-1000,-1000,-1000,-1000,-1000,-1000,-1000,-1000,-1000,-1000,-1000,-1000,-1000,-1000,-3500,-3500,-3500,-1000,-1000,-1000,-1000,-1000,-1500,,,,,,,,,,,,,,,,,,,,,,,,,,,,,,,,,,,,,,,
-1000,-1000,-1000,-1000,-1000,-1000,-1000,-1000,-1000,-1000,-1000,-1000,-1000,-1000,-1000,-1000,-1000,-1000,-1000,-1000,-1000,-1000,-1000,-3500,-3500,-3500,-1000,-1000,-1000,-1000,-1000,-1000,,,,,,,,,,,,,,,,,,,,,,,,,,,,,,,,,,,,,,,
-1000,-1000,-1000,-1000,-1000,-1000,-1000,-1000,-1000,-1000,-1000,-1000,-1000,-1000,-1000,-1000,-1000,-1000,-1000,-1000,-1000,-1000,-1000,-1000,-1000,-1000,-1000,-1000,-1000,-1000,-1000,-1000,,,,,,,,,,,,,,,,,,,,,,,,,,,,,,,,,,,,,,,
-1000,-1000,-1000,-1000,-1000,-1000,-1000,-1000,-1000,-1000,-1000,-1000,-1000,-1000,-1000,-1000,-1000,-1000,-1000,-1000,-1000,-1000,-1000,-1000,-1000,-1000,-1000,-1000,-1000,-1000,-1000,-1000,,,,,,,,,,,,,,,,,,,,,,,,,,,,,,,,,,,,,,,
-1000,-1000,-1000,-1000,-1000,-1000,-1000,-1000,-1000,-1000,-1000,-1000,-1000,-1000,-1000,-1000,-1000,-1000,-1000,-1000,-1000,-1000,-1000,-1000,-1000,-1000,-1000,-1000,-1000,-1000,-1000,-1000,,,,,,,,,,,,,,,,,,,,,,,,,,,,,,,,,,,,,,,
-1000,-1000,-1000,-1000,-1000,-1000,-1000,-1000,-1000,-1000,-1000,-1000,-1000,-1000,-1000,-1000,-1000,-1000,-1000,-1000,-1000,-1000,-1000,-1000,-1000,-1000,-1000,-1000,-1000,-1000,-1000,-1000,,,,,,,,,,,,,,,,,,,,,,,,,,,,,,,,,,,,,,,
-1000,-1000,-1000,-1000,-1000,-1000,-1000,-1000,-1000,-1000,-1000,-1000,-1000,-1000,-1000,-1000,-1000,-1000,-1000,-1000,-1000,-1000,-1000,-1000,-1000,-1000,-1000,-1000,-1000,-1000,-1000,-1000,,,,,,,,,,,,,,,,,,,,,,,,,,,,,,,,,,,,,,,
-1000,-1000,-1000,-1000,-1000,-1000,-1000,-1000,-1000,-1000,-1000,-1000,-1000,-1000,-1000,-1000,-1000,-1000,-1000,-1000,-1000,-1000,-1000,-1000,-1000,-1000,-1000,-1000,-1000,-1000,-1000,-1000,,,,,,,,,,,,,,,,,,,,,,,,,,,,,,,,,,,,,,,
-1000,-1000,-1000,-1000,-1000,-1000,-1000,-1000,-1000,-1000,-1000,-1000,-1000,-1000,-1000,-1000,-1000,-1000,-1000,-1000,-1000,-1000,-1000,-1000,-1000,-1000,-1000,-1000,-1000,-1000,-1000,-1000,,,,,,,,,,,,,,,,,,,,,,,,,,,,,,,,,,,,,,,
-1000,-1000,-1000,-1000,-1000,-1000,-1000,-1000,-1000,-1000,-1000,-1000,-1000,-1000,-1000,-1000,-1000,-1000,-1000,-1000,-1000,-1000,-1000,-1000,-1000,-1000,-1000,-1000,-1000,-1000,-1000,-1000,,,,,,,,,,,,,,,,,,,,,,,,,,,,,,,,,,,,,,,
-1000,-1000,-1000,-1000,-1000,-1000,-1000,-1000,-1000,-1000,-1000,-1000,-1000,-1000,-1000,-1000,-1000,-1000,-1000,-1000,-1000,-1000,-1000,-1000,-1000,-1000,-1000,-1000,-1000,-1000,-1000,-1000,,,,,,,,,,,,,,,,,,,,,,,,,,,,,,,,,,,,,,,
-1000,-1000,-1000,-1000,-1000,-1000,-1000,-1000,-1000,-1000,-1000,-1000,-1000,-1000,-1000,-1000,-1000,-1000,-1000,-1000,-1000,-1000,-1000,-1000,-1000,-1000,-1000,-1000,-1000,-1000,-1000,-1000,,,,,,,,,,,,,,,,,,,,,,,,,,,,,,,,,,,,,,,
-1000,-1000,-1000,-1000,-1000,-1000,-1000,-1000,-1000,-1000,-1000,-1000,-1000,-1000,-1000,-1000,-1000,-1000,-1000,-1000,-1000,-1000,-1000,-1000,-1000,-1000,-1000,-1000,-1000,-1000,-1000,-1000,,,,,,,,,,,,,,,,,,,,,,,,,,,,,,,,,,,,,,,
-1000,-1000,-1000,-1000,-1000,-1000,-1000,-1000,-1000,-1000,-1000,-1000,-1000,-1000,-1000,-1000,-1000,-1000,-1000,-1000,-1000,-1000,-1000,-1000,-1000,-1000,-1000,-1000,-1000,-1000,-1000,-1000,,,,,,,,,,,,,,,,,,,,,,,,,,,,,,,,,,,,,,,
-1000,-1000,-1000,-1000,-1000,-1000,-1000,-1000,-1000,-1000,-1000,-1000,-1000,-1000,-1000,-1000,-1000,-1000,-1000,-1000,-1000,-1000,-1000,-1000,-1000,-1000,-1000,-1000,-1000,-1000,-1000,-1000,,,,,,,,,,,,,,,,,,,,,,,,,,,,,,,,,,,,,,,
-1000,-1000,-1000,-1000,-1000,-1000,-1000,-1000,-1000,-1000,-1000,-1000,-1000,-1000,-1000,-1000,-1000,-1000,-1000,-1000,-1000,-1000,-1000,-1000,-1000,-1000,-1000,-1000,-1000,-1000,-1000,-1000,,,,,,,,,,,,,,,,,,,,,,,,,,,,,,,,,,,,,,,
-1000,-1000,-1000,-1000,-1000,-1000,-1000,-1000,-1000,-1000,-1000,-1000,-1000,-1000,-1000,-1000,-1000,-1000,-1000,-1000,-1000,-1000,-1000,-1000,-1000,-1000,-1000,-1000,-1000,-1000,-1000,-1000,,,,,,,,,,,,,,,,,,,,,,,,,,,,,,,,,,,,,,,
-1000,-1000,-1000,-1000,-1000,-1000,-1000,-1000,-1000,-1000,-1000,-1000,-1000,-1000,-1000,-1000,-1000,-1000,-1000,-1000,-1000,-1000,-1000,-1000,-1000,-1000,-1000,-1000,-1000,-1000,-1000,-1000,,,,,,,,,,,,,,,,,,,,,,,,,,,,,,,,,,,,,,,
-1000,-1000,-1000,-1000,-1000,-1000,-1000,-1000,-1000,-1000,-1000,-1000,-1000,-1000,-1000,-1000,-1000,-1000,-1000,-1000,-1000,-1000,-1000,-1000,-1000,-1000,-1000,-1000,-1000,-1000,-1000,-1000,,,,,,,,,,,,,,,,,,,,,,,,,,,,,,,,,,,,,,,
-1000,-1000,-1000,-1000,-1000,-1000,-1000,-1000,-1000,-1000,-1000,-1000,-1000,-1000,-1000,-1000,-1000,-1000,-1000,-1000,-1000,-1000,-1000,-1000,-1000,-1000,-1000,-1000,-1000,-1000,-1000,-1000,,,,,,,,,,,,,,,,,,,,,,,,,,,,,,,,,,,,,,,
-1000,-1000,-1000,-1000,-1000,-1000,-1000,-1000,-1000,-1000,-1000,-1000,-1000,-1000,-1000,-1000,-1000,-1000,-1000,-1000,-1000,-1000,-1000,-1000,-1000,-1000,-1000,-1000,-1000,-1000,-1000,-1000,,,,,,,,,,,,,,,,,,,,,,,,,,,,,,,,,,,,,,,
-1000,-1000,-1000,-1000,-1000,-1000,-1000,-1000,-1000,-1000,-1000,-1000,-1000,-1000,-1000,-1000,-1000,-1000,-1000,-1000,-1000,-1000,-1000,-1000,-1000,-1000,-1000,-1000,-1000,-1000,-1000,-1000,,,,,,,,,,,,,,,,,,,,,,,,,,,,,,,,,,,,,,,
-1000,-1000,-1000,-1000,-1000,-1000,-1000,-1000,-1000,-1000,-1000,-1000,-1000,-1000,-1000,-1000,-1000,-1000,-1000,-1000,-1000,-1000,-1000,-1000,-1000,-1000,-1000,-1000,-1000,-1000,-1000,-1000,,,,,,,,,,,,,,,,,,,,,,,,,,,,,,,,,,,,,,,
-1000,-1000,-1000,-1000,-1000,-1000,-1000,-1000,-1000,-1000,-1000,-1000,-1000,-1000,-1000,-1000,-1000,-1000,-1000,-1000,-1000,-1000,-1000,-1000,-1000,-1000,-1000,-1000,-1000,-1000,-1000,-1000,,,,,,,,,,,,,,,,,,,,,,,,,,,,,,,,,,,,,,,
-1000,-1000,-1000,-1000,-1000,-1000,-1000,-1000,-1000,-1000,-1000,-1000,-1000,-1000,-1000,-1000,-1000,-1000,-1000,-1000,-1000,-1000,-1000,-1000,-1000,-1000,-1000,-1000,-1000,-1000,-1000,-1000,,,,,,,,,,,,,,,,,,,,,,,,,,,,,,,,,,,,,,,
-1000,-1000,-1000,-1000,-1000,-1000,-1000,-1000,-1000,-1000,-1000,-1000,-1000,-1000,-1000,-1000,-1000,-1000,-1000,-1000,-1000,-1000,-1000,-1000,-1000,-1000,-1000,-1000,-1000,-1000,-1000,-1000,,,,,,,,,,,,,,,,,,,,,,,,,,,,,,,,,,,,,,,
-1000,-1000,-1000,-1000,-1000,-1000,-1000,-1000,-1000,-1000,-1000,-1000,-1000,-1000,-1000,-1000,-1000,-1000,-1000,-1000,-1000,-1000,-1000,-1000,-1000,-1000,-1000,-1000,-1000,-1000,-1000,-1000,,,,,,,,,,,,,,,,,,,,,,,,,,,,,,,,,,,,,,,
-1000,-1000,-1000,-1000,-1000,-1000,-1000,-1000,-1000,-1000,-1000,-1000,-1000,-1000,-1000,-1000,-1000,-1000,-1000,-1000,-1000,-1000,-1000,-1000,-1000,-1000,-1000,-1000,-1000,-1000,-1000,-1000,,,,,,,,,,,,,,,,,,,,,,,,,,,,,,,,,,,,,,,
-1000,-1000,-1000,-1000,-1000,-1000,-1000,-1000,-1000,-1000,-1000,-1000,-1000,-1000,-1000,-1000,-1000,-1000,-1000,-1000,-1000,-1000,-1000,-1000,-1000,-1000,-1000,-1000,-1000,-1000,-1000,-1000,,,,,,,,,,,,,,,,,,,,,,,,,,,,,,,,,,,,,,,
-1000,-1000,-1000,-1000,-1000,-1000,-1000,-1000,-1000,-1000,-1000,-1000,-1000,-1000,-1000,-1000,-1000,-1000,-1000,-1000,-1000,-1000,-1000,-1000,-1000,-1000,-1000,-1000,-1000,-1000,-1000,-1000,,,,,,,,,,,,,,,,,,,,,,,,,,,,,,,,,,,,,,,
-1000,-1000,-1000,-1000,-1000,-1000,-1000,-1000,-1000,-1000,-1000,-1000,-1000,-1000,-1000,-1000,-1000,-1000,-1000,-1000,-1000,-1000,-1000,-1000,-1000,-1000,-1000,-1000,-1000,-1000,-1000,-1000,,,,,,,,,,,,,,,,,,,,,,,,,,,,,,,,,,,,,,,
-1000,-1000,-1000,-1000,-1000,-1000,-1000,-1000,-1000,-1000,-1000,-1000,-1000,-1000,-1000,-1000,-1000,-1000,-1000,-1000,-1000,-1000,-1000,-1000,-1000,-1000,-1000,-1000,-1000,-1000,-1000,-1000,,,,,,,,,,,,,,,,,,,,,,,,,,,,,,,,,,,,,,,
-1000,-1000,-1000,-1000,-1000,-1000,-1000,-1000,-1000,-1000,-1000,-1000,-1000,-1000,-1000,-1000,-1000,-1000,-1000,-1000,-1000,-1000,-1000,-1000,-1000,-1000,-1000,-1000,-1000,-1000,-1000,-1000,,,,,,,,,,,,,,,,,,,,,,,,,,,,,,,,,,,,,,,
-1000,-1000,-1000,-1000,-1000,-1000,-1000,-1000,-1000,-1000,-1000,-1000,-1000,-1000,-1000,-1000,-1000,-1000,-1000,-1000,-1000,-1000,-1000,-1000,-1000,-1000,-1000,-1000,-1000,-1000,-1000,-1000,,,,,,,,,,,,,,,,,,,,,,,,,,,,,,,,,,,,,,,
-1000,-1000,-1000,-1000,-1000,-1000,-1000,-1000,-1000,-1000,-1000,-1000,-1000,-1000,-1000,-1000,-1000,-1000,-1000,-1000,-1000,-1000,-1000,-1000,-1000,-1000,-1000,-1000,-1000,-1000,-1000,-1000,,,,,,,,,,,,,,,,,,,,,,,,,,,,,,,,,,,,,,,
-1000,-1000,-1000,-1000,-1000,-1000,-1000,-1000,-1000,-1000,-1000,-1000,-1000,-1000,-1000,-1000,-1000,-1000,-1000,-1000,-1000,-1000,-1000,-1000,-1000,-1000,-1000,-1000,-1000,-1000,-1000,-1000,,,,,,,,,,,,,,,,,,,,,,,,,,,,,,,,,,,,,,,
-1000,-1000,-1000,-1000,-1000,-1000,-1000,-1000,-1000,-1000,-1000,-1000,-1000,-1000,-1000,-1000,-1000,-1000,-1000,-1000,-1000,-1000,-1000,-1000,-1000,-1000,-1000,-1000,-1000,-1000,-1000,-1000,,,,,,,,,,,,,,,,,,,,,,,,,,,,,,,,,,,,,,,
-1500,-1000,-1000,-1000,-1000,-1000,-1000,-1000,-1000,-1000,-1000,-1000,-1000,-1000,-1000,-1000,-1000,-1000,-1000,-1000,-1000,-1000,-1000,-1000,-1000,-1000,-1000,-1000,-1000,-1000,-1000,-1500,,,,,,,,,,,,,,,,,,,,,,,,,,,,,,,,,,,,,,,
#,line_max,,,,,,,,,,,,,,,,,,,,,,,,,,,,,,,,,,,,,,,,,,,,,,,,,,,,,,,,,,,,,,,,,,,,,
8000,8000,8000,8000,8000,8000,8000,8000,8000,8000,8000,8000,8000,8000,8000,8000,8000,8000,8000,8000,8000,8000,8000,8000,8000,8000,8000,8000,8000,8000,8000,8000,8000,8000,8000,8000,8000,8000,8000,8000,8000,8000,8000,8000,8000,8000,8000,8000,8000,8000,8000,8000,8000,8000,8000,8000,8000,8000,8000,8000,8000,8000,8000,8000,8000,8000,8000,8000,8000,8000,8000
#,line_min,,,,,,,,,,,,,,,,,,,,,,,,,,,,,,,,,,,,,,,,,,,,,,,,,,,,,,,,,,,,,,,,,,,,,
300,300,300,300,300,300,300,300,300,300,300,300,300,300,300,300,300,300,300,300,300,300,300,300,300,300,300,300,300,300,300,300,300,300,300,300,300,300,300,300,300,300,300,300,300,300,300,300,300,300,300,300,300,300,300,300,300,300,300,300,300,300,300,300,300,300,300,300,300,300,300
