﻿{
    "id": "hwtemplate_dualView",
    "version": 100000,
    "name": "双景",
    "duration": 13600,
    "timeCreated": 1587956099851,
    "timeModified": 1588045904884,
    "preview": "preview/preview.jpg",
    "previewVideo": "preview/previewVideo.mp4",
    "canvas_config": {
        "ratio": "2520:1080",
        "width": 2520,
        "height": 1080
    },
    "editTracks": [
        {
            "id": "1vt",
            "type": "video",
            "editSegments": [
                {
                    "id": "1vt1vs",
                    "timeRangeInSource": {
                        "start": 0,
                        "duration": 4750
                    },
                    "timeRangeInTarget": {
                        "start": 0,
                        "duration": 4750
                    },
                    "playSpeed": 1.0,
                    "mirror": false,
                    "reverse": false,
                    "volume": 0,
                    "sizeCut": {
                        "scale": {
                            "x": 1,
                            "y": 1
                        },
                        "rotation": 0,
                        "transform": {
                            "x": 0,
                            "y": 0
                        },
                        "flip": {
                            "horizontal": false,
                            "vertical": false
                        },
                        "alpha": 1
                    },
                    "mainMaterialId": "1v_material_id",
					"attachedExtraMaterialRefs": ["1trs_material_id"],
                    "render_index": 1,
                    "attachInfo": {
                        "videoId": "",
                        "offset": 0
                    }
                },
                {
                    "id": "1vt2vs",
                    "timeRangeInSource": {
                        "start": 0,
                        "duration": 5700
                    },
                    "timeRangeInTarget": {
                        "start": 3850,
                        "duration": 5700
                    },
                    "playSpeed": 1.0,
                    "mirror": false,
                    "reverse": false,
                    "volume": 0,
                    "sizeCut": {
                        "scale": {
                            "x": 1,
                            "y": 1
                        },
                        "rotation": 0,
                        "transform": {
                            "x": 0,
                            "y": 0
                        },
                        "flip": {
                            "horizontal": false,
                            "vertical": false
                        },
                        "alpha": 1
                    },
                    "mainMaterialId": "2v_material_id",
                    "attachedExtraMaterialRefs": ["1trs_material_id"],
                    "render_index": 1,
                    "attachInfo": {
                        "videoId": "",
                        "offset": 0
                    }
                },
                {
                    "id": "1vt3vs",
                    "timeRangeInSource": {
                        "start": 0,
                        "duration": 4950
                    },
                    "timeRangeInTarget": {
                        "start": 8650,
                        "duration": 4950
                    },
                    "playSpeed": 1.0,
                    "mirror": false,
                    "reverse": false,
                    "volume": 0,
                    "sizeCut": {
                        "scale": {
                            "x": 1,
                            "y": 1
                        },
                        "rotation": 0,
                        "transform": {
                            "x": 0,
                            "y": 0
                        },
                        "flip": {
                            "horizontal": false,
                            "vertical": false
                        },
                        "alpha": 1
                    },
                    "mainMaterialId": "3v_material_id",
                    "attachedExtraMaterialRefs": ["2trs_material_id"],
                    "render_index": 1,
                    "attachInfo": {
                        "videoId": "",
                        "offset": 0
                    }
                }
            ],
            "flag": 0
        },
        {
            "id": "1at",
            "type": "audio",
            "editSegments": [
                {
                    "id": "1at1as",
                    "timeRangeInSource": {
                        "start": 0,
                        "duration": 13600
                    },
                    "timeRangeInTarget": {
                        "start": 0,
                        "duration": 13600
                    },
                    "playSpeed": 1.0,
                    "mirror": false,
                    "reverse": false,
                    "volume": 1,
                    "sizeCut": {
                        "scale": {
                            "x": 1,
                            "y": 1
                        },
                        "rotation": 0,
                        "transform": {
                            "x": 0,
                            "y": 0
                        },
                        "flip": {
                            "horizontal": false,
                            "vertical": false
                        },
                        "alpha": 1
                    },
                    "mainMaterialId": "1a_material_id",
                    "attachedExtraMaterialRefs": [],
                    "render_index": 1,
                    "attachInfo": {
                        "videoId": "",
                        "offset": 0
                    }
                }
            ],
            "flag": 0
        },
        {
            "id": "1mk",
            "type": "mask",
            "editSegments": [
                {
                    "id": "1mt1ms",
                    "timeRangeInSource": {
                        "start": 0,
                        "duration": 0
                    },
                    "timeRangeInTarget": {
                        "start": 12800,
                        "duration": 800
                    },
                    "playSpeed": 1.0,
                    "mirror": false,
                    "reverse": false,
                    "volume": 0,
                    "sizeCut": {
                        "scale": {
                            "x": 1,
                            "y": 1
                        },
                        "rotation": 0,
                        "transform": {
                            "x": 0,
                            "y": 0
                        },
                        "flip": {
                            "horizontal": false,
                            "vertical": false
                        },
                        "alpha": 1
                    },
                    "mainMaterialId": "color_fading_black",
                    "attachedExtraMaterialRefs": [],
                    "render_index": 1,
                    "attachInfo": {
                        "videoId": "1v",
                        "offset": 0
                    }
                }
            ],
            "flag": 0
        }
    ],
    "editMaterials": {
        "videos": [
            {
                "id": "1v_material_id",
                "type": "video",
                "duration": 0,
                "path": null,
                "width": 0,
                "height": 0,
                "category_name": null,
                "rotation": 0.0
            },
            {
                "id": "2v_material_id",
                "type": "video",
                "duration": 0,
                "path": null,
                "width": 0,
                "height": 0,
                "category_name": null,
                "rotation": 0.0
            },
            {
                "id": "3v_material_id",
                "type": "video",
                "duration": 0,
                "path": null,
                "width": 0,
                "height": 0,
                "category_name": null,
                "rotation": 0.0
            }
        ],
        "audios": [
            {
                "id": "1a_material_id",
                "type": "music",
                "duration": 13600,
                "path": "com.hihonor.movietemplate/Resource/music/out.aac",
                "name": "music_name"
            }
        ],
        "effects": [{
                "id": "color_fading_black",
                "type": "mask",
                "effect_id": "mask_res_1",
                "name": "effect_fading_black",
                "path": "/thepath",
                "value": 0,
                "category_name": ""
            }],
        "tail_leaders": [
            {
                "id": "1tl_material_id",
                "type": "tail_leader",
                "text": "",
                "index": 0,
                "start": 13600,
                "duration": 1000
            }
        ],
        "transitions": [
            {
                "id": "1trs_material_id",
                "type": "transition",
                "name": "叠化",
                "path": "/thepath",
                "duration": 900,
                "is_overlap": true,
                "resource_id": "transition_res_honor_local_overlap",
                "category_id": "2001"
            },
            {
                "id": "2trs_material_id",
                "type": "transition",
                "name": "黑场",
                "path": "/thepath",
                "duration": 800,
                "is_overlap": false,
                "resource_id": "transition_res_honor_local_blackfield",
                "category_id": "2001"
            }
        ]
    }
}