#,version,,,,,,,,,,,,,,,,,,,,,,,,,,,,,,,,,,,,,,,,,,,,,,,,,,,,
2022,9,20,1,,,,,,,,,,,,,,,,,,,,,,,,,,,,,,,,,,,,,,,,,,,,,,,,,,
#,row_col_num,,,,,,,,,,,,,,,,,,,,,,,,,,,,,,,,,,,,,,,,,,,,,,,,,,,,
38,16,,,,,,,,,,,,,,,,,,,,,,,,,,,,,,,,,,,,,,,,,,,,,,,,,,,,
#,noise,,,,,,,,,,,,,,,,,,,,,,,,,,,,,,,,,,,,,,,,,,,,,,,,,,,,
-600,600,,,,,,,,,,,,,,,,,,,,,,,,,,,,,,,,,,,,,,,,,,,,,,,,,,,,
#,raw_max,,,,,,,,,,,,,,,,,,,,,,,,,,,,,,,,,,,,,,,,,,,,,,,,,,,,
21951,21085,21240,21152,21112,21165,21222,22900,22888,21153,21147,21159,21180,21045,20995,22158,,,,,,,,,,,,,,,,,,,,,,,,,,,,,,,,,,,,,,
21217,21205,21213,21222,21213,21225,21226,22898,22842,21252,21232,21229,21231,21224,21213,21327,,,,,,,,,,,,,,,,,,,,,,,,,,,,,,,,,,,,,,
21195,21172,21174,21177,21173,21176,21183,21221,21230,21210,21200,21199,21200,21194,21191,21314,,,,,,,,,,,,,,,,,,,,,,,,,,,,,,,,,,,,,,
21212,21190,21189,21210,21187,21280,21190,21209,21217,21215,21210,21211,21213,21208,21208,21326,,,,,,,,,,,,,,,,,,,,,,,,,,,,,,,,,,,,,,
21306,21285,21283,21288,21283,21280,21282,21297,21305,21305,21305,21306,21308,21305,21305,21409,,,,,,,,,,,,,,,,,,,,,,,,,,,,,,,,,,,,,,
21327,21309,21311,21313,21306,21302,21306,21318,21326,21331,21329,21333,21335,21328,21328,21420,,,,,,,,,,,,,,,,,,,,,,,,,,,,,,,,,,,,,,
21274,21254,21255,21257,21251,21248,21251,21266,21272,21278,21278,21282,21283,21277,21275,21357,,,,,,,,,,,,,,,,,,,,,,,,,,,,,,,,,,,,,,
21162,21144,21144,21146,21141,21139,21142,21162,21167,21172,21172,21176,21178,21173,21171,21241,,,,,,,,,,,,,,,,,,,,,,,,,,,,,,,,,,,,,,
21314,21314,21308,21309,21305,21302,21304,21324,21331,21336,21336,21339,21339,21336,21333,21397,,,,,,,,,,,,,,,,,,,,,,,,,,,,,,,,,,,,,,
21314,21308,21310,21309,21308,21305,21306,21327,21333,21339,21340,21341,21343,21338,21336,21394,,,,,,,,,,,,,,,,,,,,,,,,,,,,,,,,,,,,,,
21350,21344,21348,21346,21344,21342,21350,21363,21369,21375,21374,21376,21377,21375,21371,21423,,,,,,,,,,,,,,,,,,,,,,,,,,,,,,,,,,,,,,
21385,21377,21380,21380,21379,21377,21378,21396,21403,21407,21408,21411,21411,21408,21404,21445,,,,,,,,,,,,,,,,,,,,,,,,,,,,,,,,,,,,,,
21328,21325,21326,21338,21326,21325,21324,21340,21348,21351,21352,21356,21352,21350,21347,21380,,,,,,,,,,,,,,,,,,,,,,,,,,,,,,,,,,,,,,
21265,21258,21259,21261,21261,21259,21260,21272,21279,21284,21283,21286,21284,21281,21279,21303,,,,,,,,,,,,,,,,,,,,,,,,,,,,,,,,,,,,,,
21286,21285,21288,21288,21295,21286,21288,21298,21305,21308,21308,21309,21307,21304,21305,21321,,,,,,,,,,,,,,,,,,,,,,,,,,,,,,,,,,,,,,
21427,21426,21428,21429,21429,21427,21427,21441,21450,21451,21449,21450,21449,21448,21450,21461,,,,,,,,,,,,,,,,,,,,,,,,,,,,,,,,,,,,,,
21397,21390,21391,21394,21393,21399,21390,21409,21415,21415,21414,21415,21411,21414,21420,21424,,,,,,,,,,,,,,,,,,,,,,,,,,,,,,,,,,,,,,
21341,21342,21353,21345,21343,21342,21341,21377,21367,21367,21364,21366,21362,21365,21375,21373,,,,,,,,,,,,,,,,,,,,,,,,,,,,,,,,,,,,,,
21380,21387,21389,21398,21387,21387,21387,21404,21411,21412,21411,21413,21408,21411,21422,21414,,,,,,,,,,,,,,,,,,,,,,,,,,,,,,,,,,,,,,
21396,21401,21401,21401,21398,21395,21396,21536,21420,21420,21420,21420,21417,21421,21430,21415,,,,,,,,,,,,,,,,,,,,,,,,,,,,,,,,,,,,,,
21407,21414,21416,21415,21413,21412,21410,21380,21389,21390,21387,21392,21388,21378,21381,21362,,,,,,,,,,,,,,,,,,,,,,,,,,,,,,,,,,,,,,
21442,21445,21445,21445,21442,21441,21440,21407,21416,21419,21416,21419,21417,21409,21412,21425,,,,,,,,,,,,,,,,,,,,,,,,,,,,,,,,,,,,,,
21445,21448,21447,21445,21443,21440,21439,21408,21416,21419,21417,21419,21416,21410,21411,21376,,,,,,,,,,,,,,,,,,,,,,,,,,,,,,,,,,,,,,
21451,21454,21451,21448,21446,21440,21439,21408,21419,21421,21420,21422,21418,21409,21415,21371,,,,,,,,,,,,,,,,,,,,,,,,,,,,,,,,,,,,,,
21422,21428,21424,21422,21419,21412,21409,21379,21389,21390,21392,21391,21389,21382,21385,21338,,,,,,,,,,,,,,,,,,,,,,,,,,,,,,,,,,,,,,
21445,21457,21452,21447,21444,21437,21433,21403,21414,21417,21415,21416,21413,21529,21515,21488,,,,,,,,,,,,,,,,,,,,,,,,,,,,,,,,,,,,,,
21428,21448,21444,21440,21435,21430,21427,21395,21404,21405,21405,21406,21402,21396,21400,21339,,,,,,,,,,,,,,,,,,,,,,,,,,,,,,,,,,,,,,
21512,21532,21527,21523,21520,21512,21510,21478,21487,21487,21490,21488,21486,21480,21484,21416,,,,,,,,,,,,,,,,,,,,,,,,,,,,,,,,,,,,,,
21375,21394,21389,21385,21382,21374,21369,21337,21347,21345,21349,21351,21351,21342,21347,21283,,,,,,,,,,,,,,,,,,,,,,,,,,,,,,,,,,,,,,
21471,21497,21492,21489,21482,21476,21470,21438,21458,21447,21449,21452,21460,21447,21450,21376,,,,,,,,,,,,,,,,,,,,,,,,,,,,,,,,,,,,,,
21390,21411,21405,21401,21396,21389,21384,21351,21361,21363,21363,21368,21374,21406,21410,21390,,,,,,,,,,,,,,,,,,,,,,,,,,,,,,,,,,,,,,
21385,21407,21398,21394,21390,21383,21378,21345,21353,21354,21356,21368,21369,21365,21364,21285,,,,,,,,,,,,,,,,,,,,,,,,,,,,,,,,,,,,,,
21461,21492,21483,21478,21472,21468,21463,21427,21437,21446,21442,21455,21458,21446,21452,21369,,,,,,,,,,,,,,,,,,,,,,,,,,,,,,,,,,,,,,
21413,21451,21443,21438,21430,21426,21426,21389,21398,21399,21407,21420,21431,21411,21415,21327,,,,,,,,,,,,,,,,,,,,,,,,,,,,,,,,,,,,,,
21378,21417,21410,21406,21400,21397,21395,21362,21370,21369,21380,21398,21396,21382,21387,21292,,,,,,,,,,,,,,,,,,,,,,,,,,,,,,,,,,,,,,
21362,21420,21415,21415,21411,21411,21408,21372,21384,21391,21400,21399,21402,21387,21390,21286,,,,,,,,,,,,,,,,,,,,,,,,,,,,,,,,,,,,,,
21259,21330,21338,21349,21352,21348,21346,21315,21331,21332,21330,21335,21330,21310,21309,21197,,,,,,,,,,,,,,,,,,,,,,,,,,,,,,,,,,,,,,
22185,21536,21385,21429,21616,21568,21595,21600,21484,21496,21517,21376,21375,21586,21623,22364,,,,,,,,,,,,,,,,,,,,,,,,,,,,,,,,,,,,,,
#,raw_min,,,,,,,,,,,,,,,,,,,,,,,,,,,,,,,,,,,,,,,,,,,,,,,,,,,,
10569,11353,11437,11390,11368,11397,11427,9817,9810,11390,11387,11393,11404,11332,11305,10700,,,,,,,,,,,,,,,,,,,,,,,,,,,,,,,,,,,,,,
11425,11418,11422,11427,11422,11429,11429,9812,9789,11443,11433,11431,11432,11428,11422,11483,,,,,,,,,,,,,,,,,,,,,,,,,,,,,,,,,,,,,,
11413,11400,11401,11403,11400,11402,11406,11427,11432,11421,11415,11415,11415,11412,11410,11476,,,,,,,,,,,,,,,,,,,,,,,,,,,,,,,,,,,,,,
11422,11410,11409,11421,11408,11458,11410,11420,11424,11423,11421,11421,11422,11419,11419,11483,,,,,,,,,,,,,,,,,,,,,,,,,,,,,,,,,,,,,,
11472,11461,11460,11462,11460,11458,11459,11467,11472,11472,11472,11472,11473,11472,11472,11528,,,,,,,,,,,,,,,,,,,,,,,,,,,,,,,,,,,,,,
11484,11474,11475,11476,11472,11470,11472,11479,11483,11485,11485,11487,11488,11484,11484,11533,,,,,,,,,,,,,,,,,,,,,,,,,,,,,,,,,,,,,,
11455,11444,11445,11446,11443,11441,11443,11450,11454,11457,11457,11459,11460,11456,11456,11499,,,,,,,,,,,,,,,,,,,,,,,,,,,,,,,,,,,,,,
11394,11385,11385,11386,11384,11382,11384,11394,11398,11400,11400,11402,11404,11401,11400,11437,,,,,,,,,,,,,,,,,,,,,,,,,,,,,,,,,,,,,,
11476,11477,11473,11474,11471,11470,11471,11482,11485,11488,11489,11490,11490,11488,11487,11521,,,,,,,,,,,,,,,,,,,,,,,,,,,,,,,,,,,,,,
11476,11474,11474,11474,11473,11472,11472,11483,11487,11490,11490,11491,11492,11490,11488,11519,,,,,,,,,,,,,,,,,,,,,,,,,,,,,,,,,,,,,,
11496,11493,11495,11494,11493,11492,11496,11503,11506,11510,11509,11510,11510,11510,11507,11535,,,,,,,,,,,,,,,,,,,,,,,,,,,,,,,,,,,,,,
11515,11510,11512,11512,11511,11511,11511,11521,11525,11527,11527,11529,11529,11527,11525,11547,,,,,,,,,,,,,,,,,,,,,,,,,,,,,,,,,,,,,,
11484,11482,11483,11490,11483,11482,11482,11491,11495,11497,11497,11499,11497,11496,11495,11512,,,,,,,,,,,,,,,,,,,,,,,,,,,,,,,,,,,,,,
11450,11447,11447,11448,11448,11447,11447,11454,11457,11460,11460,11461,11460,11459,11458,11471,,,,,,,,,,,,,,,,,,,,,,,,,,,,,,,,,,,,,,
11461,11461,11462,11462,11466,11461,11462,11468,11472,11474,11473,11474,11473,11471,11472,11480,,,,,,,,,,,,,,,,,,,,,,,,,,,,,,,,,,,,,,
11538,11537,11538,11539,11539,11537,11537,11545,11550,11550,11549,11550,11549,11549,11550,11556,,,,,,,,,,,,,,,,,,,,,,,,,,,,,,,,,,,,,,
11521,11518,11518,11519,11519,11522,11517,11527,11531,11531,11530,11531,11529,11530,11534,11536,,,,,,,,,,,,,,,,,,,,,,,,,,,,,,,,,,,,,,
11491,11492,11498,11493,11492,11492,11491,11510,11505,11505,11504,11505,11503,11504,11509,11508,,,,,,,,,,,,,,,,,,,,,,,,,,,,,,,,,,,,,,
11512,11516,11517,11522,11516,11516,11516,11525,11529,11529,11529,11530,11527,11529,11534,11531,,,,,,,,,,,,,,,,,,,,,,,,,,,,,,,,,,,,,,
11521,11523,11523,11523,11522,11520,11521,11596,11534,11534,11534,11534,11532,11534,11539,11531,,,,,,,,,,,,,,,,,,,,,,,,,,,,,,,,,,,,,,
11526,11531,11531,11531,11530,11529,11528,11512,11517,11518,11516,11519,11516,11511,11513,11502,,,,,,,,,,,,,,,,,,,,,,,,,,,,,,,,,,,,,,
11545,11547,11547,11547,11546,11545,11544,11527,11531,11533,11532,11533,11532,11527,11529,11536,,,,,,,,,,,,,,,,,,,,,,,,,,,,,,,,,,,,,,
11547,11549,11548,11547,11546,11545,11544,11527,11532,11533,11532,11533,11531,11528,11529,11510,,,,,,,,,,,,,,,,,,,,,,,,,,,,,,,,,,,,,,
11550,11552,11550,11549,11548,11545,11544,11527,11533,11534,11534,11535,11532,11528,11531,11507,,,,,,,,,,,,,,,,,,,,,,,,,,,,,,,,,,,,,,
11535,11538,11536,11535,11533,11529,11528,11511,11517,11518,11519,11518,11517,11513,11515,11489,,,,,,,,,,,,,,,,,,,,,,,,,,,,,,,,,,,,,,
11547,11553,11551,11548,11547,11543,11541,11524,11530,11532,11531,11531,11530,11592,11585,11570,,,,,,,,,,,,,,,,,,,,,,,,,,,,,,,,,,,,,,
11538,11549,11547,11544,11542,11539,11538,11520,11525,11526,11526,11526,11524,11521,11523,11490,,,,,,,,,,,,,,,,,,,,,,,,,,,,,,,,,,,,,,
11583,11594,11591,11589,11587,11583,11582,11565,11569,11570,11571,11570,11569,11566,11568,11532,,,,,,,,,,,,,,,,,,,,,,,,,,,,,,,,,,,,,,
11509,11520,11517,11515,11513,11509,11506,11489,11494,11493,11496,11497,11496,11491,11494,11460,,,,,,,,,,,,,,,,,,,,,,,,,,,,,,,,,,,,,,
11561,11575,11572,11571,11567,11564,11561,11543,11554,11548,11549,11551,11555,11548,11550,11510,,,,,,,,,,,,,,,,,,,,,,,,,,,,,,,,,,,,,,
11518,11529,11526,11523,11521,11517,11514,11497,11502,11503,11503,11506,11509,11526,11528,11517,,,,,,,,,,,,,,,,,,,,,,,,,,,,,,,,,,,,,,
11515,11527,11522,11520,11517,11514,11511,11493,11498,11498,11499,11506,11506,11504,11503,11461,,,,,,,,,,,,,,,,,,,,,,,,,,,,,,,,,,,,,,
11556,11572,11568,11565,11562,11559,11557,11538,11543,11547,11546,11553,11554,11547,11551,11506,,,,,,,,,,,,,,,,,,,,,,,,,,,,,,,,,,,,,,
11530,11551,11546,11543,11539,11537,11537,11517,11522,11522,11527,11534,11540,11529,11531,11484,,,,,,,,,,,,,,,,,,,,,,,,,,,,,,,,,,,,,,
11511,11532,11528,11526,11523,11521,11520,11502,11506,11506,11512,11522,11521,11513,11516,11465,,,,,,,,,,,,,,,,,,,,,,,,,,,,,,,,,,,,,,
11502,11534,11531,11531,11529,11529,11527,11508,11514,11518,11523,11522,11524,11516,11517,11461,,,,,,,,,,,,,,,,,,,,,,,,,,,,,,,,,,,,,,
11447,11485,11490,11496,11497,11495,11494,11477,11486,11486,11485,11488,11485,11474,11474,11414,,,,,,,,,,,,,,,,,,,,,,,,,,,,,,,,,,,,,,
10681,11596,11515,11539,11639,11613,11628,11630,11568,11574,11586,11510,11510,11623,11643,10700,,,,,,,,,,,,,,,,,,,,,,,,,,,,,,,,,,,,,,
#,raw_row_delta_max,,,,,,,,,,,,,,,,,,,,,,,,,,,,,,,,,,,,,,,,,,,,,,,,,,,,
800,800,800,800,800,800,800,1500,1500,800,800,800,800,800,800,800,,,,,,,,,,,,,,,,,,,,,,,,,,,,,,,,,,,,,,
600,600,600,600,600,600,600,1500,1500,600,600,600,600,600,600,600,,,,,,,,,,,,,,,,,,,,,,,,,,,,,,,,,,,,,,
600,600,600,600,600,600,600,600,600,600,600,600,600,600,600,600,,,,,,,,,,,,,,,,,,,,,,,,,,,,,,,,,,,,,,
600,600,600,600,600,600,600,600,600,600,600,600,600,600,600,600,,,,,,,,,,,,,,,,,,,,,,,,,,,,,,,,,,,,,,
600,600,600,600,600,600,600,600,600,600,600,600,600,600,600,600,,,,,,,,,,,,,,,,,,,,,,,,,,,,,,,,,,,,,,
600,600,600,600,600,600,600,600,600,600,600,600,600,600,600,600,,,,,,,,,,,,,,,,,,,,,,,,,,,,,,,,,,,,,,
600,600,600,600,600,600,600,600,600,600,600,600,600,600,600,600,,,,,,,,,,,,,,,,,,,,,,,,,,,,,,,,,,,,,,
600,600,600,600,600,600,600,600,600,600,600,600,600,600,600,600,,,,,,,,,,,,,,,,,,,,,,,,,,,,,,,,,,,,,,
600,600,600,600,600,600,600,600,600,600,600,600,600,600,600,600,,,,,,,,,,,,,,,,,,,,,,,,,,,,,,,,,,,,,,
600,600,600,600,600,600,600,600,600,600,600,600,600,600,600,600,,,,,,,,,,,,,,,,,,,,,,,,,,,,,,,,,,,,,,
600,600,600,600,600,600,600,600,600,600,600,600,600,600,600,600,,,,,,,,,,,,,,,,,,,,,,,,,,,,,,,,,,,,,,
600,600,600,600,600,600,600,600,600,600,600,600,600,600,600,600,,,,,,,,,,,,,,,,,,,,,,,,,,,,,,,,,,,,,,
600,600,600,600,600,600,600,600,600,600,600,600,600,600,600,600,,,,,,,,,,,,,,,,,,,,,,,,,,,,,,,,,,,,,,
600,600,600,600,600,600,600,600,600,600,600,600,600,600,600,600,,,,,,,,,,,,,,,,,,,,,,,,,,,,,,,,,,,,,,
600,600,600,600,600,600,600,600,600,600,600,600,600,600,600,600,,,,,,,,,,,,,,,,,,,,,,,,,,,,,,,,,,,,,,
600,600,600,600,600,600,600,600,600,600,600,600,600,600,600,600,,,,,,,,,,,,,,,,,,,,,,,,,,,,,,,,,,,,,,
600,600,600,600,600,600,600,600,600,600,600,600,600,600,600,600,,,,,,,,,,,,,,,,,,,,,,,,,,,,,,,,,,,,,,
600,600,600,600,600,600,600,600,600,600,600,600,600,600,600,600,,,,,,,,,,,,,,,,,,,,,,,,,,,,,,,,,,,,,,
600,600,600,600,600,600,600,600,600,600,600,600,600,600,600,600,,,,,,,,,,,,,,,,,,,,,,,,,,,,,,,,,,,,,,
600,600,600,600,600,600,600,600,600,600,600,600,600,600,600,600,,,,,,,,,,,,,,,,,,,,,,,,,,,,,,,,,,,,,,
600,600,600,600,600,600,600,600,600,600,600,600,600,600,600,600,,,,,,,,,,,,,,,,,,,,,,,,,,,,,,,,,,,,,,
600,600,600,600,600,600,600,600,600,600,600,600,600,600,600,600,,,,,,,,,,,,,,,,,,,,,,,,,,,,,,,,,,,,,,
600,600,600,600,600,600,600,600,600,600,600,600,600,600,600,600,,,,,,,,,,,,,,,,,,,,,,,,,,,,,,,,,,,,,,
600,600,600,600,600,600,600,600,600,600,600,600,600,600,600,600,,,,,,,,,,,,,,,,,,,,,,,,,,,,,,,,,,,,,,
600,600,600,600,600,600,600,600,600,600,600,600,600,600,600,600,,,,,,,,,,,,,,,,,,,,,,,,,,,,,,,,,,,,,,
600,600,600,600,600,600,600,600,600,600,600,600,600,600,600,600,,,,,,,,,,,,,,,,,,,,,,,,,,,,,,,,,,,,,,
600,600,600,600,600,600,600,600,600,600,600,600,600,600,600,600,,,,,,,,,,,,,,,,,,,,,,,,,,,,,,,,,,,,,,
600,600,600,600,600,600,600,600,600,600,600,600,600,600,600,600,,,,,,,,,,,,,,,,,,,,,,,,,,,,,,,,,,,,,,
600,600,600,600,600,600,600,600,600,600,600,600,600,600,600,600,,,,,,,,,,,,,,,,,,,,,,,,,,,,,,,,,,,,,,
600,600,600,600,600,600,600,600,600,600,600,600,600,600,600,600,,,,,,,,,,,,,,,,,,,,,,,,,,,,,,,,,,,,,,
600,600,600,600,600,600,600,600,600,600,600,600,600,600,600,600,,,,,,,,,,,,,,,,,,,,,,,,,,,,,,,,,,,,,,
600,600,600,600,600,600,600,600,600,600,600,600,600,600,600,600,,,,,,,,,,,,,,,,,,,,,,,,,,,,,,,,,,,,,,
600,600,600,600,600,600,600,600,600,600,600,600,600,600,600,600,,,,,,,,,,,,,,,,,,,,,,,,,,,,,,,,,,,,,,
600,600,600,600,600,600,600,600,600,600,600,600,600,600,600,600,,,,,,,,,,,,,,,,,,,,,,,,,,,,,,,,,,,,,,
600,600,600,600,600,600,600,600,600,600,600,600,600,600,600,600,,,,,,,,,,,,,,,,,,,,,,,,,,,,,,,,,,,,,,
600,600,600,600,600,600,600,600,600,600,600,600,600,600,600,600,,,,,,,,,,,,,,,,,,,,,,,,,,,,,,,,,,,,,,
800,800,800,800,800,800,800,800,800,800,800,800,800,800,800,800,,,,,,,,,,,,,,,,,,,,,,,,,,,,,,,,,,,,,,
#,raw_row_delta_min,,,,,,,,,,,,,,,,,,,,,,,,,,,,,,,,,,,,,,,,,,,,,,,,,,,,
-800,-800,-800,-800,-800,-800,-800,-1500,-1500,-800,-800,-800,-800,-800,-800,-800,,,,,,,,,,,,,,,,,,,,,,,,,,,,,,,,,,,,,,
-600,-600,-600,-600,-600,-600,-600,-1500,-1500,-600,-600,-600,-600,-600,-600,-600,,,,,,,,,,,,,,,,,,,,,,,,,,,,,,,,,,,,,,
-600,-600,-600,-600,-600,-600,-600,-600,-600,-600,-600,-600,-600,-600,-600,-600,,,,,,,,,,,,,,,,,,,,,,,,,,,,,,,,,,,,,,
-600,-600,-600,-600,-600,-600,-600,-600,-600,-600,-600,-600,-600,-600,-600,-600,,,,,,,,,,,,,,,,,,,,,,,,,,,,,,,,,,,,,,
-600,-600,-600,-600,-600,-600,-600,-600,-600,-600,-600,-600,-600,-600,-600,-600,,,,,,,,,,,,,,,,,,,,,,,,,,,,,,,,,,,,,,
-600,-600,-600,-600,-600,-600,-600,-600,-600,-600,-600,-600,-600,-600,-600,-600,,,,,,,,,,,,,,,,,,,,,,,,,,,,,,,,,,,,,,
-600,-600,-600,-600,-600,-600,-600,-600,-600,-600,-600,-600,-600,-600,-600,-600,,,,,,,,,,,,,,,,,,,,,,,,,,,,,,,,,,,,,,
-600,-600,-600,-600,-600,-600,-600,-600,-600,-600,-600,-600,-600,-600,-600,-600,,,,,,,,,,,,,,,,,,,,,,,,,,,,,,,,,,,,,,
-600,-600,-600,-600,-600,-600,-600,-600,-600,-600,-600,-600,-600,-600,-600,-600,,,,,,,,,,,,,,,,,,,,,,,,,,,,,,,,,,,,,,
-600,-600,-600,-600,-600,-600,-600,-600,-600,-600,-600,-600,-600,-600,-600,-600,,,,,,,,,,,,,,,,,,,,,,,,,,,,,,,,,,,,,,
-600,-600,-600,-600,-600,-600,-600,-600,-600,-600,-600,-600,-600,-600,-600,-600,,,,,,,,,,,,,,,,,,,,,,,,,,,,,,,,,,,,,,
-600,-600,-600,-600,-600,-600,-600,-600,-600,-600,-600,-600,-600,-600,-600,-600,,,,,,,,,,,,,,,,,,,,,,,,,,,,,,,,,,,,,,
-600,-600,-600,-600,-600,-600,-600,-600,-600,-600,-600,-600,-600,-600,-600,-600,,,,,,,,,,,,,,,,,,,,,,,,,,,,,,,,,,,,,,
-600,-600,-600,-600,-600,-600,-600,-600,-600,-600,-600,-600,-600,-600,-600,-600,,,,,,,,,,,,,,,,,,,,,,,,,,,,,,,,,,,,,,
-600,-600,-600,-600,-600,-600,-600,-600,-600,-600,-600,-600,-600,-600,-600,-600,,,,,,,,,,,,,,,,,,,,,,,,,,,,,,,,,,,,,,
-600,-600,-600,-600,-600,-600,-600,-600,-600,-600,-600,-600,-600,-600,-600,-600,,,,,,,,,,,,,,,,,,,,,,,,,,,,,,,,,,,,,,
-600,-600,-600,-600,-600,-600,-600,-600,-600,-600,-600,-600,-600,-600,-600,-600,,,,,,,,,,,,,,,,,,,,,,,,,,,,,,,,,,,,,,
-600,-600,-600,-600,-600,-600,-600,-600,-600,-600,-600,-600,-600,-600,-600,-600,,,,,,,,,,,,,,,,,,,,,,,,,,,,,,,,,,,,,,
-600,-600,-600,-600,-600,-600,-600,-600,-600,-600,-600,-600,-600,-600,-600,-600,,,,,,,,,,,,,,,,,,,,,,,,,,,,,,,,,,,,,,
-600,-600,-600,-600,-600,-600,-600,-600,-600,-600,-600,-600,-600,-600,-600,-600,,,,,,,,,,,,,,,,,,,,,,,,,,,,,,,,,,,,,,
-600,-600,-600,-600,-600,-600,-600,-600,-600,-600,-600,-600,-600,-600,-600,-600,,,,,,,,,,,,,,,,,,,,,,,,,,,,,,,,,,,,,,
-600,-600,-600,-600,-600,-600,-600,-600,-600,-600,-600,-600,-600,-600,-600,-600,,,,,,,,,,,,,,,,,,,,,,,,,,,,,,,,,,,,,,
-600,-600,-600,-600,-600,-600,-600,-600,-600,-600,-600,-600,-600,-600,-600,-600,,,,,,,,,,,,,,,,,,,,,,,,,,,,,,,,,,,,,,
-600,-600,-600,-600,-600,-600,-600,-600,-600,-600,-600,-600,-600,-600,-600,-600,,,,,,,,,,,,,,,,,,,,,,,,,,,,,,,,,,,,,,
-600,-600,-600,-600,-600,-600,-600,-600,-600,-600,-600,-600,-600,-600,-600,-600,,,,,,,,,,,,,,,,,,,,,,,,,,,,,,,,,,,,,,
-600,-600,-600,-600,-600,-600,-600,-600,-600,-600,-600,-600,-600,-600,-600,-600,,,,,,,,,,,,,,,,,,,,,,,,,,,,,,,,,,,,,,
-600,-600,-600,-600,-600,-600,-600,-600,-600,-600,-600,-600,-600,-600,-600,-600,,,,,,,,,,,,,,,,,,,,,,,,,,,,,,,,,,,,,,
-600,-600,-600,-600,-600,-600,-600,-600,-600,-600,-600,-600,-600,-600,-600,-600,,,,,,,,,,,,,,,,,,,,,,,,,,,,,,,,,,,,,,
-600,-600,-600,-600,-600,-600,-600,-600,-600,-600,-600,-600,-600,-600,-600,-600,,,,,,,,,,,,,,,,,,,,,,,,,,,,,,,,,,,,,,
-600,-600,-600,-600,-600,-600,-600,-600,-600,-600,-600,-600,-600,-600,-600,-600,,,,,,,,,,,,,,,,,,,,,,,,,,,,,,,,,,,,,,
-600,-600,-600,-600,-600,-600,-600,-600,-600,-600,-600,-600,-600,-600,-600,-600,,,,,,,,,,,,,,,,,,,,,,,,,,,,,,,,,,,,,,
-600,-600,-600,-600,-600,-600,-600,-600,-600,-600,-600,-600,-600,-600,-600,-600,,,,,,,,,,,,,,,,,,,,,,,,,,,,,,,,,,,,,,
-600,-600,-600,-600,-600,-600,-600,-600,-600,-600,-600,-600,-600,-600,-600,-600,,,,,,,,,,,,,,,,,,,,,,,,,,,,,,,,,,,,,,
-600,-600,-600,-600,-600,-600,-600,-600,-600,-600,-600,-600,-600,-600,-600,-600,,,,,,,,,,,,,,,,,,,,,,,,,,,,,,,,,,,,,,
-600,-600,-600,-600,-600,-600,-600,-600,-600,-600,-600,-600,-600,-600,-600,-600,,,,,,,,,,,,,,,,,,,,,,,,,,,,,,,,,,,,,,
-600,-600,-600,-600,-600,-600,-600,-600,-600,-600,-600,-600,-600,-600,-600,-600,,,,,,,,,,,,,,,,,,,,,,,,,,,,,,,,,,,,,,
-800,-800,-800,-800,-800,-800,-800,-800,-800,-800,-800,-800,-800,-800,-800,-800,,,,,,,,,,,,,,,,,,,,,,,,,,,,,,,,,,,,,,
#,raw_col_delta_max,,,,,,,,,,,,,,,,,,,,,,,,,,,,,,,,,,,,,,,,,,,,,,,,,,,,
800,600,600,600,600,600,600,1500,1500,600,600,600,600,600,800,,,,,,,,,,,,,,,,,,,,,,,,,,,,,,,,,,,,,,,
800,600,600,600,600,600,600,600,600,600,600,600,600,600,800,,,,,,,,,,,,,,,,,,,,,,,,,,,,,,,,,,,,,,,
800,600,600,600,600,600,600,600,600,600,600,600,600,600,800,,,,,,,,,,,,,,,,,,,,,,,,,,,,,,,,,,,,,,,
800,600,600,600,600,600,600,600,600,600,600,600,600,600,800,,,,,,,,,,,,,,,,,,,,,,,,,,,,,,,,,,,,,,,
800,600,600,600,600,600,600,600,600,600,600,600,600,600,800,,,,,,,,,,,,,,,,,,,,,,,,,,,,,,,,,,,,,,,
800,600,600,600,600,600,600,600,600,600,600,600,600,600,800,,,,,,,,,,,,,,,,,,,,,,,,,,,,,,,,,,,,,,,
800,600,600,600,600,600,600,600,600,600,600,600,600,600,800,,,,,,,,,,,,,,,,,,,,,,,,,,,,,,,,,,,,,,,
800,600,600,600,600,600,600,600,600,600,600,600,600,600,800,,,,,,,,,,,,,,,,,,,,,,,,,,,,,,,,,,,,,,,
800,600,600,600,600,600,600,600,600,600,600,600,600,600,800,,,,,,,,,,,,,,,,,,,,,,,,,,,,,,,,,,,,,,,
800,600,600,600,600,600,600,600,600,600,600,600,600,600,800,,,,,,,,,,,,,,,,,,,,,,,,,,,,,,,,,,,,,,,
800,600,600,600,600,600,600,600,600,600,600,600,600,600,800,,,,,,,,,,,,,,,,,,,,,,,,,,,,,,,,,,,,,,,
800,600,600,600,600,600,600,600,600,600,600,600,600,600,800,,,,,,,,,,,,,,,,,,,,,,,,,,,,,,,,,,,,,,,
800,600,600,600,600,600,600,600,600,600,600,600,600,600,800,,,,,,,,,,,,,,,,,,,,,,,,,,,,,,,,,,,,,,,
800,600,600,600,600,600,600,600,600,600,600,600,600,600,800,,,,,,,,,,,,,,,,,,,,,,,,,,,,,,,,,,,,,,,
800,600,600,600,600,600,600,600,600,600,600,600,600,600,800,,,,,,,,,,,,,,,,,,,,,,,,,,,,,,,,,,,,,,,
800,600,600,600,600,600,600,600,600,600,600,600,600,600,800,,,,,,,,,,,,,,,,,,,,,,,,,,,,,,,,,,,,,,,
800,600,600,600,600,600,600,600,600,600,600,600,600,600,800,,,,,,,,,,,,,,,,,,,,,,,,,,,,,,,,,,,,,,,
800,600,600,600,600,600,600,600,600,600,600,600,600,600,800,,,,,,,,,,,,,,,,,,,,,,,,,,,,,,,,,,,,,,,
800,600,600,600,600,600,600,600,600,600,600,600,600,600,800,,,,,,,,,,,,,,,,,,,,,,,,,,,,,,,,,,,,,,,
800,600,600,600,600,600,600,600,600,600,600,600,600,600,800,,,,,,,,,,,,,,,,,,,,,,,,,,,,,,,,,,,,,,,
800,600,600,600,600,600,600,600,600,600,600,600,600,600,800,,,,,,,,,,,,,,,,,,,,,,,,,,,,,,,,,,,,,,,
800,600,600,600,600,600,600,600,600,600,600,600,600,600,800,,,,,,,,,,,,,,,,,,,,,,,,,,,,,,,,,,,,,,,
800,600,600,600,600,600,600,600,600,600,600,600,600,600,800,,,,,,,,,,,,,,,,,,,,,,,,,,,,,,,,,,,,,,,
800,600,600,600,600,600,600,600,600,600,600,600,600,600,800,,,,,,,,,,,,,,,,,,,,,,,,,,,,,,,,,,,,,,,
800,600,600,600,600,600,600,600,600,600,600,600,600,600,800,,,,,,,,,,,,,,,,,,,,,,,,,,,,,,,,,,,,,,,
800,600,600,600,600,600,600,600,600,600,600,600,600,600,800,,,,,,,,,,,,,,,,,,,,,,,,,,,,,,,,,,,,,,,
800,600,600,600,600,600,600,600,600,600,600,600,600,600,800,,,,,,,,,,,,,,,,,,,,,,,,,,,,,,,,,,,,,,,
800,600,600,600,600,600,600,600,600,600,600,600,600,600,800,,,,,,,,,,,,,,,,,,,,,,,,,,,,,,,,,,,,,,,
800,600,600,600,600,600,600,600,600,600,600,600,600,600,800,,,,,,,,,,,,,,,,,,,,,,,,,,,,,,,,,,,,,,,
800,600,600,600,600,600,600,600,600,600,600,600,600,600,800,,,,,,,,,,,,,,,,,,,,,,,,,,,,,,,,,,,,,,,
800,600,600,600,600,600,600,600,600,600,600,600,600,600,800,,,,,,,,,,,,,,,,,,,,,,,,,,,,,,,,,,,,,,,
800,600,600,600,600,600,600,600,600,600,600,600,600,600,800,,,,,,,,,,,,,,,,,,,,,,,,,,,,,,,,,,,,,,,
800,600,600,600,600,600,600,600,600,600,600,600,600,600,800,,,,,,,,,,,,,,,,,,,,,,,,,,,,,,,,,,,,,,,
800,600,600,600,600,600,600,600,600,600,600,600,600,600,800,,,,,,,,,,,,,,,,,,,,,,,,,,,,,,,,,,,,,,,
800,600,600,600,600,600,600,600,600,600,600,600,600,600,800,,,,,,,,,,,,,,,,,,,,,,,,,,,,,,,,,,,,,,,
800,600,600,600,600,600,600,600,600,600,600,600,600,600,800,,,,,,,,,,,,,,,,,,,,,,,,,,,,,,,,,,,,,,,
800,600,600,600,600,600,600,600,600,600,600,600,600,600,800,,,,,,,,,,,,,,,,,,,,,,,,,,,,,,,,,,,,,,,
800,600,600,600,600,600,600,600,600,600,600,600,600,600,800,,,,,,,,,,,,,,,,,,,,,,,,,,,,,,,,,,,,,,,
#,raw_col_delta_min,,,,,,,,,,,,,,,,,,,,,,,,,,,,,,,,,,,,,,,,,,,,,,,,,,,,
-800,-600,-600,-600,-600,-600,-600,-1500,-1500,-600,-600,-600,-600,-600,-800,,,,,,,,,,,,,,,,,,,,,,,,,,,,,,,,,,,,,,,
-800,-600,-600,-600,-600,-600,-600,-600,-600,-600,-600,-600,-600,-600,-800,,,,,,,,,,,,,,,,,,,,,,,,,,,,,,,,,,,,,,,
-800,-600,-600,-600,-600,-600,-600,-600,-600,-600,-600,-600,-600,-600,-800,,,,,,,,,,,,,,,,,,,,,,,,,,,,,,,,,,,,,,,
-800,-600,-600,-600,-600,-600,-600,-600,-600,-600,-600,-600,-600,-600,-800,,,,,,,,,,,,,,,,,,,,,,,,,,,,,,,,,,,,,,,
-800,-600,-600,-600,-600,-600,-600,-600,-600,-600,-600,-600,-600,-600,-800,,,,,,,,,,,,,,,,,,,,,,,,,,,,,,,,,,,,,,,
-800,-600,-600,-600,-600,-600,-600,-600,-600,-600,-600,-600,-600,-600,-800,,,,,,,,,,,,,,,,,,,,,,,,,,,,,,,,,,,,,,,
-800,-600,-600,-600,-600,-600,-600,-600,-600,-600,-600,-600,-600,-600,-800,,,,,,,,,,,,,,,,,,,,,,,,,,,,,,,,,,,,,,,
-800,-600,-600,-600,-600,-600,-600,-600,-600,-600,-600,-600,-600,-600,-800,,,,,,,,,,,,,,,,,,,,,,,,,,,,,,,,,,,,,,,
-800,-600,-600,-600,-600,-600,-600,-600,-600,-600,-600,-600,-600,-600,-800,,,,,,,,,,,,,,,,,,,,,,,,,,,,,,,,,,,,,,,
-800,-600,-600,-600,-600,-600,-600,-600,-600,-600,-600,-600,-600,-600,-800,,,,,,,,,,,,,,,,,,,,,,,,,,,,,,,,,,,,,,,
-800,-600,-600,-600,-600,-600,-600,-600,-600,-600,-600,-600,-600,-600,-800,,,,,,,,,,,,,,,,,,,,,,,,,,,,,,,,,,,,,,,
-800,-600,-600,-600,-600,-600,-600,-600,-600,-600,-600,-600,-600,-600,-800,,,,,,,,,,,,,,,,,,,,,,,,,,,,,,,,,,,,,,,
-800,-600,-600,-600,-600,-600,-600,-600,-600,-600,-600,-600,-600,-600,-800,,,,,,,,,,,,,,,,,,,,,,,,,,,,,,,,,,,,,,,
-800,-600,-600,-600,-600,-600,-600,-600,-600,-600,-600,-600,-600,-600,-800,,,,,,,,,,,,,,,,,,,,,,,,,,,,,,,,,,,,,,,
-800,-600,-600,-600,-600,-600,-600,-600,-600,-600,-600,-600,-600,-600,-800,,,,,,,,,,,,,,,,,,,,,,,,,,,,,,,,,,,,,,,
-800,-600,-600,-600,-600,-600,-600,-600,-600,-600,-600,-600,-600,-600,-800,,,,,,,,,,,,,,,,,,,,,,,,,,,,,,,,,,,,,,,
-800,-600,-600,-600,-600,-600,-600,-600,-600,-600,-600,-600,-600,-600,-800,,,,,,,,,,,,,,,,,,,,,,,,,,,,,,,,,,,,,,,
-800,-600,-600,-600,-600,-600,-600,-600,-600,-600,-600,-600,-600,-600,-800,,,,,,,,,,,,,,,,,,,,,,,,,,,,,,,,,,,,,,,
-800,-600,-600,-600,-600,-600,-600,-600,-600,-600,-600,-600,-600,-600,-800,,,,,,,,,,,,,,,,,,,,,,,,,,,,,,,,,,,,,,,
-800,-600,-600,-600,-600,-600,-600,-600,-600,-600,-600,-600,-600,-600,-800,,,,,,,,,,,,,,,,,,,,,,,,,,,,,,,,,,,,,,,
-800,-600,-600,-600,-600,-600,-600,-600,-600,-600,-600,-600,-600,-600,-800,,,,,,,,,,,,,,,,,,,,,,,,,,,,,,,,,,,,,,,
-800,-600,-600,-600,-600,-600,-600,-600,-600,-600,-600,-600,-600,-600,-800,,,,,,,,,,,,,,,,,,,,,,,,,,,,,,,,,,,,,,,
-800,-600,-600,-600,-600,-600,-600,-600,-600,-600,-600,-600,-600,-600,-800,,,,,,,,,,,,,,,,,,,,,,,,,,,,,,,,,,,,,,,
-800,-600,-600,-600,-600,-600,-600,-600,-600,-600,-600,-600,-600,-600,-800,,,,,,,,,,,,,,,,,,,,,,,,,,,,,,,,,,,,,,,
-800,-600,-600,-600,-600,-600,-600,-600,-600,-600,-600,-600,-600,-600,-800,,,,,,,,,,,,,,,,,,,,,,,,,,,,,,,,,,,,,,,
-800,-600,-600,-600,-600,-600,-600,-600,-600,-600,-600,-600,-600,-600,-800,,,,,,,,,,,,,,,,,,,,,,,,,,,,,,,,,,,,,,,
-800,-600,-600,-600,-600,-600,-600,-600,-600,-600,-600,-600,-600,-600,-800,,,,,,,,,,,,,,,,,,,,,,,,,,,,,,,,,,,,,,,
-800,-600,-600,-600,-600,-600,-600,-600,-600,-600,-600,-600,-600,-600,-800,,,,,,,,,,,,,,,,,,,,,,,,,,,,,,,,,,,,,,,
-800,-600,-600,-600,-600,-600,-600,-600,-600,-600,-600,-600,-600,-600,-800,,,,,,,,,,,,,,,,,,,,,,,,,,,,,,,,,,,,,,,
-800,-600,-600,-600,-600,-600,-600,-600,-600,-600,-600,-600,-600,-600,-800,,,,,,,,,,,,,,,,,,,,,,,,,,,,,,,,,,,,,,,
-800,-600,-600,-600,-600,-600,-600,-600,-600,-600,-600,-600,-600,-600,-800,,,,,,,,,,,,,,,,,,,,,,,,,,,,,,,,,,,,,,,
-800,-600,-600,-600,-600,-600,-600,-600,-600,-600,-600,-600,-600,-600,-800,,,,,,,,,,,,,,,,,,,,,,,,,,,,,,,,,,,,,,,
-800,-600,-600,-600,-600,-600,-600,-600,-600,-600,-600,-600,-600,-600,-800,,,,,,,,,,,,,,,,,,,,,,,,,,,,,,,,,,,,,,,
-800,-600,-600,-600,-600,-600,-600,-600,-600,-600,-600,-600,-600,-600,-800,,,,,,,,,,,,,,,,,,,,,,,,,,,,,,,,,,,,,,,
-800,-600,-600,-600,-600,-600,-600,-600,-600,-600,-600,-600,-600,-600,-800,,,,,,,,,,,,,,,,,,,,,,,,,,,,,,,,,,,,,,,
-800,-600,-600,-600,-600,-600,-600,-600,-600,-600,-600,-600,-600,-600,-800,,,,,,,,,,,,,,,,,,,,,,,,,,,,,,,,,,,,,,,
-800,-600,-600,-600,-600,-600,-600,-600,-600,-600,-600,-600,-600,-600,-800,,,,,,,,,,,,,,,,,,,,,,,,,,,,,,,,,,,,,,,
-800,-600,-600,-600,-600,-600,-600,-600,-600,-600,-600,-600,-600,-600,-800,,,,,,,,,,,,,,,,,,,,,,,,,,,,,,,,,,,,,,,
#,line_max,,,,,,,,,,,,,,,,,,,,,,,,,,,,,,,,,,,,,,,,,,,,,,,,,,,,
60000,60000,60000,60000,60000,60000,60000,60000,60000,60000,60000,60000,60000,60000,60000,60000,60000,60000,60000,60000,60000,60000,60000,60000,60000,60000,60000,60000,60000,60000,60000,60000,60000,60000,60000,60000,60000,60000,60000,60000,60000,60000,60000,60000,60000,60000,60000,60000,60000,60000,60000,60000,60000,60000
#,line_min,,,,,,,,,,,,,,,,,,,,,,,,,,,,,,,,,,,,,,,,,,,,,,,,,,,,
500,500,500,500,500,500,500,500,500,500,500,500,500,500,500,500,500,500,500,500,500,500,500,500,500,500,500,500,500,500,500,500,500,500,500,500,500,500,500,500,500,500,500,500,500,500,500,500,500,500,500,500,500,500
