﻿{
    "order": 10,
    "lockScreenInfo": {
        "templateId": "08_new_year",
        "templateName": [
            {
                "region": "zh-rCN",
                "name": "恭贺新禧"
            },
            {
                "region": "en",
                "name": "Happy new year"
            }
        ],
        "thumbnailSrc": "08_preview_lockscreen.png",
        "originSrc": "08_origin.png",
        "cropSrc": "08_crop.png",
        "decorateType": 1,
        "isDepthOfFieldSupported": true,
        "isDepthOfFieldOpened": true,
        "jointPosition": [
            0.44,
            0.155,
            0.44,
            0.155
        ],
        "frameRectangle": [
            0.11,
            0.26,
            0.89,
            0.85
        ],
        "layers": [
            {
                "id": "layer_origin",
                "type": 0,
                "src": "08_origin.png"
            },
            {
                "id": "layer_res1",
                "type": 2,
                "src": "08_res1_1.png",
                "colorPolicy": 1,
                "color": "#FF993226"
            },
            {
                "id": "layer_res3",
                "type": 2,
                "src": "08_res1_3.png"
            },
            {
                "id": "layer_timer",
                "type": 3,
                "layout": 0,
                "font": "HonorDigits_SerifVF.ttf",
                "color": "#FFF2BCB6",
                "colorPolicy": 4
            },
            {
                "id": "layer_crop",
                "type": 4,
                "src": "08_crop.png"
            },
            {
                "id": "layer_res2",
                "type": 2,
                "src": "08_res1_2.png",
                "colorPolicy": 1,
                "color": "#FF993226"
            },
            {
                "id": "layer_res4",
                "type": 2,
                "src": "08_res1_4.png"
            }
        ],
        "styles": [
            "人物",
            "宠物"
        ],
        "decorateReses": [
            {
                "id": "res1",
                "src": "08_res1.png",
                "jointPosition": [
                    0.44,
                    0.155,
                    0.44,
                    0.155
                ],
                "resLayerMappings": {
                    "layer_res1": "08_res1_1.png",
                    "layer_res2": "08_res1_2.png",
                    "layer_res3": "08_res1_3.png",
                    "layer_res4": "08_res1_4.png"
                }
            },
            {
                "id": "res2",
                "src": "08_res2.png",
                "jointPosition": [
                    0.44,
                    0.155,
                    0.44,
                    0.155
                ],
                "resLayerMappings": {
                    "layer_res1": "08_res2_1.png",
                    "layer_res2": "08_res2_2.png",
                    "layer_res3": "08_res2_3.png",
                    "layer_res4": "08_res2_4.png"
                }
            },
            {
                "id": "res3",
                "src": "08_res3.png",
                "jointPosition": [
                    0.44,
                    0.175,
                    0.44,
                    0.175
                ],
                "resLayerMappings": {
                    "layer_res1": "08_res3_1.png",
                    "layer_res2": "08_res3_2.png",
                    "layer_res3": "08_res3_3.png",
                    "layer_res4": "08_res3_4.png"
                }
            }
        ],
        "decorateColors": [
            {
                "mainColor": "#FF993226",
                "timerColor": "#FFF2BCB6"
            },
            {
                "mainColor": "#FFA65832",
                "timerColor": "#FFF2CAB6"
            },
            {
                "mainColor": "#FFA68542",
                "timerColor": "#FFF2DEB6"
            },
            {
                "mainColor": "#FF736939",
                "timerColor": "#FFF2E8B6"
            },
            {
                "mainColor": "#FF4F5931",
                "timerColor": "#FFE3F2B6"
            },
            {
                "mainColor": "#FF425931",
                "timerColor": "#FFCFF2B6"
            },
            {
                "mainColor": "#FF31593E",
                "timerColor": "#FFB6F2CA"
            },
            {
                "mainColor": "#FF2D594E",
                "timerColor": "#FFB6F2E3"
            },
            {
                "mainColor": "#FF244C59",
                "timerColor": "#FFB6E3F2"
            },
            {
                "mainColor": "#FF294266",
                "timerColor": "#FFB6CFF2"
            },
            {
                "mainColor": "#FF333C66",
                "timerColor": "#FFB6C0F2"
            },
            {
                "mainColor": "#FF3C3866",
                "timerColor": "#FFBBB6F2"
            },
            {
                "mainColor": "#FF473866",
                "timerColor": "#FFCAB6F2"
            },
            {
                "mainColor": "#FF533866",
                "timerColor": "#FFD9B6F2"
            },
            {
                "mainColor": "#FF663866",
                "timerColor": "#FFF2B6F2"
            },
            {
                "mainColor": "#FF803355",
                "timerColor": "#FFF2B6D1"
            },
            {
                "mainColor": "#FF998E6B",
                "timerColor": "#FFF2E3B6"
            },
            {
                "mainColor": "#FF777880",
                "timerColor": "#FFE6E8F2"
            }
        ]
    },
    "desktopInfo": {
        "templateId": "08_new_year",
        "groupImageRes": {
            "src": "08_origin.png"
        }
    }
}