{
  "templateId": "local_default_wm_yg",
  "categoryId": "honor_classic",
  "titleId": "text_watermark",
  "templateDescId": "text_wm_description",
  "templateType": 1,
  "baseOnValue": 6144,
  "isEditable": false,
  "status": "local",
  "order":3,
  "foregroundElements": [
    {
      "elementId": "device",
      "order": 1,
      "isGrouped": false,
      "groupId": -1,
      "elementType": "picture",
      "isEditable": false,
      "isEditableForPhoto": false,
      "uiDefaultValue": "on",
      "location": {
        "width": "wrap_content",
        "height": "464",
        "margin": [304, 0, 0, 176],
        "layout_gravity": "left|bottom"
      }
    },
    {
      "elementId": "yg",
      "order": 2,
      "isGrouped": false,
      "groupId": -1,
      "elementType": "picture",
      "isEditable": false,
      "isEditableForPhoto": false,
      "uiDefaultValue": "on",
	  "values": [
        {
          "content": "/yg.png"
        }
      ],
      "location": {
        "width": "672",
        "height": "504",
        "margin": [0, 0, 299, 86],
        "layout_gravity": "right|bottom"
      }
    }
  ]
}
