﻿{
    "order": 9,
    "lockScreenInfo": {
        "templateId": "09_lantern_festival",
        "templateName": [
            {
                "region": "zh-rCN",
                "name": "元宵快乐"
            },
            {
                "region": "en",
                "name": "Happy Lantern Festival"
            }
        ],
        "thumbnailSrc": "09_preview_lockscreen.png",
        "originSrc": "09_origin.png",
        "cropSrc": "09_crop.png",
        "decorateType": 1,
        "isDepthOfFieldSupported": true,
        "isDepthOfFieldOpened": true,
        "jointPosition": [
            0.44,
            0.154,
            0.44,
            0.154
        ],
        "frameRectangle": [
            0.102,
            0.26,
            0.897,
            0.874
        ],
        "layers": [
            {
                "id": "layer_origin",
                "type": 0,
                "src": "09_origin.png"
            },
            {
                "id": "layer_res1",
                "type": 2,
                "src": "09_res1_1.png",
                "colorPolicy": 1,
                "color": "#FFC03535"
            },
            {
                "id": "layer_res3",
                "type": 2,
                "src": "09_res1_3.png"
            },
            {
                "id": "layer_timer",
                "type": 3,
                "layout": 0,
                "font": "HonorDigits_SerifVF.ttf",
                "color": "#FFF2CF9D",
                "colorPolicy": 4
            },
            {
                "id": "layer_crop",
                "type": 4,
                "src": "09_crop.png"
            },
            {
                "id": "layer_res2",
                "type": 2,
                "src": "09_res1_2.png",
                "colorPolicy": 1,
                "color": "#FFC03535"
            },
            {
                "id": "layer_res4",
                "type": 2,
                "src": "09_res1_4.png"
            }
        ],
        "styles": [
            "人物",
            "宠物"
        ],
        "decorateReses": [
            {
                "id": "res1",
                "src": "09_res1.png",
                "jointPosition": [
                    0.44,
                    0.154,
                    0.44,
                    0.154
                ],
                "resLayerMappings": {
                    "layer_res1": "09_res1_1.png",
                    "layer_res2": "09_res1_2.png",
                    "layer_res3": "09_res1_3.png",
                    "layer_res4": "09_res1_4.png"
                }
            },
            {
                "id": "res2",
                "src": "09_res2.png",
                "jointPosition": [
                    0.44,
                    0.149,
                    0.44,
                    0.149
                ],
                "resLayerMappings": {
                    "layer_res1": "09_res2_1.png",
                    "layer_res2": "09_res2_2.png",
                    "layer_res3": "09_res2_3.png",
                    "layer_res4": "09_res2_4.png"
                }
            },
            {
                "id": "res3",
                "src": "09_res3.png",
                "jointPosition": [
                    0.44,
                    0.15,
                    0.44,
                    0.15
                ],
                "resLayerMappings": {
                    "layer_res1": "09_res3_1.png",
                    "layer_res2": "09_res3_2.png",
                    "layer_res3": "09_res3_3.png",
                    "layer_res4": "09_res3_4.png"
                }
            },
            {
                "id": "res4",
                "src": "09_res4.png",
                "jointPosition": [
                    0.44,
                    0.15,
                    0.44,
                    0.15
                ],
                "resLayerMappings": {
                    "layer_res1": "09_res4_1.png",
                    "layer_res2": "09_res4_2.png",
                    "layer_res3": "09_res4_3.png",
                    "layer_res4": "09_res4_4.png"
                }
            }
        ],
        "decorateColors": [
            {
                "mainColor": "#FFC03535",
                "timerColor": "#FFF2CF9D"
            },
            {
                "mainColor": "#FFA5281A",
                "timerColor": "#FFE6C495"
            },
            {
                "mainColor": "#FFB3401B",
                "timerColor": "#FFD9BE98"
            },
            {
                "mainColor": "#FF993226",
                "timerColor": "#FFF2BCB6"
            }
        ]
    },
    "desktopInfo": {
        "templateId": "09_lantern_festival",
        "groupImageRes": {
            "src": "09_origin.png"
        }
    }
}