{
	"version": "1.0.0",
	"delay" : 10,
	"schedule_time" : 10,
	"sensor" : {
		"name":
		"system_h",
		"accuracy": 1
	},
	"temp_level" : {
	"comments" : "low_threshold, high_threshold, hysteresis_value, unit is millicentigrade",
	"table" : [
		[32000, 34000, 2000],
		[35000, 37000, 2000],
		[37000, 39000, 2000],
		[38000, 40000, 2000],
		[40000, 42000, 2000],
		[42000, 44000, 2000],
		[44000, 46000, 2000],
		[46000, 48000, 2000],
		[48000, 50000, 2000],
		[50000, 52000, 2000],
		[52000, 54000, 2000]
		]
	},
	"current_limit" : {
		"comments" : "scale1, scale2, scale3, scale4, scale5, scale6, scale7, scale8, scale9, scale10, scale11",
		"wcurrent_5v" : {
			"channel" : 0,
			"prefix" : "dcp 0#",
			"limit" : [2000, 2000, 2000, 1500, 825, 475, 475, 475, 475, 475, 475]
		},
		"wcurrent_9v" : {
			"channel" : 0,
			"prefix" : "dcp 1#",
			"limit": [1400, 1200, 2000, 1500, 825, 475, 475, 475, 475, 475, 475]
		},
		"direct_charger" : {
			"channel" : 1,
			"prefix" : "lvc ",
			"limit": [4200, 3800, 3300, 2700, 1500, 1500, 1500, 1500, 1500, 1500, 1500]
		},
		"direct_charger_sc" : {
			"channel" : 0,
			"prefix" : "sc 0#",
			"limit": [5600, 5600, 3800, 3000, 2000, 2000, 2000, 2000, 2000, 2000, 2000]
		},
		"direct_charger_duo_sc" : {
			"channel" : 0,
			"prefix" : "sc 1#",
			"limit": [12000, 10000, 6000, 4000, 4000, 3000, 2000, 2000, 2000, 2000, 2000]
		},
		"wlcurrent_5v" : {
			"channel" : 0,
			"prefix" : "dcp 2#",
			"limit" : [1500, 1500, 1500, 1500, 1200, 825, 475, 475, 475, 475, 475]
		},
		"wlcurrent_9v" : {
			"channel" : 0,
			"prefix" : "dcp 3#",
			"limit" : [1500, 1500, 1500, 1500, 1200, 825, 475, 475, 475, 475, 475]
		},
		"wlcurrent_sc" : {
			"channel" : 0,
			"prefix" : "wl_sc 0#",
			"limit" : [5200, 5200, 4000, 2400, 2200, 1900, 1000, 475, 475, 475, 475]
		},
		"wlcurrent_duo_sc" : {
			"channel" : 0,
			"prefix" : "wl_sc 1#",
			"limit" : [5200, 5200, 4000, 2400, 2200, 1900, 1000, 475, 475, 475, 475]
		}
	},
	"su_version": "1.0.0",
	"su_delay" : 1,
	"su_current_limit" : {
		"comments" : "hota, normal",
		"wcurrent_5v" : {
			"channel" : 0,
			"prefix" : "dcp 0#",
			"limit" : [900, 1300]
		},
		"wcurrent_9v" : {
			"channel" : 0,
			"prefix" : "dcp 1#",
			"limit": [900, 1300]
		},
		"direct_charger" : {
			"channel" : 1,
			"prefix" : "lvc ",
			"limit": [1500, 1500]
		},
		"direct_charger_sc" : {
			"channel" : 0,
			"prefix" : "sc 0#",
			"limit": [1500, 1500]
		},
		"direct_charger_duo_sc" : {
			"channel" : 0,
			"prefix" : "sc 1#",
			"limit": [1500, 1500]
		},
		"wlcurrent_5v" : {
			"channel" : 0,
			"prefix" : "dcp 2#",
			"limit" : [900, 1300]
		},
		"wlcurrent_9v" : {
			"channel" : 0,
			"prefix" : "dcp 3#",
			"limit" : [900, 1300]
		},
		"wlcurrent_sc" : {
			"channel" : 0,
			"prefix" : "wl_sc 0#",
			"limit" : [1500, 1500]
		},
		"wlcurrent_duo_sc" : {
			"channel" : 0,
			"prefix" : "wl_sc 1#",
			"limit" : [1500, 1500]
		}
	}
}
