{
  "beat": [
    0,192,1440,1856,2144,2496,3136,3520,4416,4800,5152,5376,5824,6240,6432,6656,6848,7104,7264,7712,7872,8160,8384,8704,8928,9120,9312,9536,9728,9984,10144,10336,10624,11008,11168,11328,11552,11776,12000,12256,12416,12640,12800,13024,13216,13472,13728,13920,14336,14528,14720,14976,15136,15360,15584,15744,15904,16160,16320,16608,16768,17184,17344,17632,17792,17952,18240,18496,18656,18848,19104,19360,19616,19808,20096,20320,20480,20672,20928,21088,21280,21504,21760,21920,22112,22272,22432,22656,22976,23200,23360,23616,23840,24256,24448,24640,24896,25088,25248,25504,25728,25920,26080,26240,26464,26688,27232,27424,27584,27808,27968,28224,28384,28672,28896,29120,30038
    ],
  "beat_count": 117,
  "downbeat": [
    0,
    1856,
    3136,
    5152,
    6848,
    8384,
    9728,
    11008,
    12256,
    14336,
    15584,
    17632,
    18848,
    20096,
    20928,
    22272,
    23360,
    24256,
    25504,
    26688,
    27968,
    30038
    ],
  "downbeat_count": 22
}