{
	"type":"PauseOptimization",
	"subType":"generic",
	"params":[
		{
			"name":"advancePausePackage",
			"type":"list",
			"value":"{\"advancePausePackage\":[\"com.ss.android.ugc.aweme\",\"com.ss.android.ugc.aweme.lite\",\"com.miHoYo.Yuanshen\",\"com.tencent.tmgp.sgame\"]}"
		}
	],
	"compatibleversion":"1"
}