[
    {
        "PACKAGENAME": "com.huawei.browser"
    },
    {
        "PACKAGENAME": "com.huawei.fastapp"
    },
    {
        "PACKAGENAME": "com.huawei.appmarket"
    },
    {
        "PACKAGENAME": "com.huawei.hidisk"
    },
    {
        "PACKAGENAME": "com.huawei.gameassistant"
    },
    {
        "PACKAGENAME": "com.hihonor.findmydevice"
    },
    {
        "PACKAGENAME": "com.sohu.sohuvideo.emplayer"
    },
    {
        "PACKAGENAME": "com.hihonor.kobackup"
    },
    {
        "PACKAGENAME": "com.hihonor.android.totemweather"
    },
    {
        "PACKAGENAME": "com.huawei.android.thememanager"
    },
    {
        "PACKAGENAME": "com.huawei.hifolder"
    },
    {
        "PACKAGENAME": "com.hihonor.phoneservice"
    },
    {
        "PACKAGENAME": "com.huawei.wallet"
    },
    {
        "PACKAGENAME": "com.hihonor.stylus.mpenzone"
    },
    {
        "PACKAGENAME": "com.tencent.mm"
    },
    {
        "PACKAGENAME": "com.honor.club"
    },
    {
        "PACKAGENAME": "com.hlg.daydaytobusiness"
    },
    {
        "PACKAGENAME": "com.xingin.xhs"
    },
    {
        "PACKAGENAME": "com.hihonor.kidsmode"
    },
    {
        "PACKAGENAME": "com.baidu.searchbox"
    },
    {
        "PACKAGENAME": "com.ss.android.ugc.aweme"
    },
    {
        "PACKAGENAME": "com.qiyi.video.pad"
    },
    {
        "PACKAGENAME": "com.youku.phone"
    },
    {
        "PACKAGENAME": "com.tencent.mobileqq"
    },
    {
        "PACKAGENAME": "com.tencent.qqlive"
    },
    {
        "PACKAGENAME": "com.tencent.tmgp.sgame"
    },
    {
        "PACKAGENAME": "com.tencent.tmgp.pubgmhd"
    },
    {
        "PACKAGENAME": "com.taobao.taobao"
    },
    {
        "PACKAGENAME": "com.xunmeng.pinduoduo"
    },
    {
        "PACKAGENAME": "tv.danmaku.bili"
    },
    {
        "PACKAGENAME": "com.smile.gifmaker"
    },
    {
        "PACKAGENAME": "com.qiyi.video.lite"
    },
    {
        "PACKAGENAME": "com.quark.browser"
    },
    {
        "PACKAGENAME": "com.tencent.qqmusic"
    },
    {
        "PACKAGENAME": "com.ss.android.ugc.aweme.lite"
    },
    {
        "PACKAGENAME": "com.kiloo.subwaysurf"
    },
    {
        "PACKAGENAME": "com.kuaishou.nebula"
    },
    {
        "PACKAGENAME": "com.kugou.android"
    },
    {
        "PACKAGENAME": "com.netease.cloudmusic"
    },
    {
        "PACKAGENAME": "com.alibaba.android.rimet"
    },
    {
        "PACKAGENAME": "com.baidu.netdisk"
    },
    {
        "PACKAGENAME": "com.tencent.wemeet.app"
    },
    {
        "PACKAGENAME": "com.jingdong.app.mall"
    },
    {
        "PACKAGENAME": "com.baidu.homework"
    },
    {
        "PACKAGENAME": "com.netease.mc.huawei"
    },
    {
        "PACKAGENAME": "com.tencent.mtt"
    },
    {
        "PACKAGENAME": "com.dragon.read"
    },
    {
        "PACKAGENAME": "com.minitech.miniworld.huawei"
    },
    {
        "PACKAGENAME": "net.huanci.hsjpro"
    },
    {
        "PACKAGENAME": "com.tencent.qqmusicpad"
    },
    {
        "PACKAGENAME": "com.lemon.lv"
    },
    {
        "PACKAGENAME": "com.hunantv.imgo.activity"
    },
    {
        "PACKAGENAME": "com.eg.android.alipaygphone"
    },
    {
        "PACKAGENAME": "com.ss.android.article.news"
    },
    {
        "PACKAGENAME": "com.mihoyo.yuanshen"
    },
    {
        "PACKAGENAME": "com.taptap"
    },
    {
        "PACKAGENAME": "com.sina.weibo"
    },
    {
        "PACKAGENAME": "com.duowan.kiwi"
    },
    {
        "PACKAGENAME": "com.ss.android.article.video"
    },
    {
        "PACKAGENAME": "com.ss.android.ugc.live"
    },
    {
        "PACKAGENAME": "com.happyelements.androidanimal"
    },
    {
        "PACKAGENAME": "com.popcap.pvz2cthdhwct"
    },
    {
        "PACKAGENAME": "com.wepie.snake.huawei"
    },
    {
        "PACKAGENAME": "com.zhihu.android"
    },
    {
        "PACKAGENAME": "com.ucmobile"
    },
    {
        "PACKAGENAME": "com.baidu.searchbox.lite"
    },
    {
        "PACKAGENAME": "com.ximalaya.ting.android"
    },
    {
        "PACKAGENAME": "com.jideos.jnotes"
    },
    {
        "PACKAGENAME": "com.meta.box"
    },
    {
        "PACKAGENAME": "com.tencent.jkchess"
    },
    {
        "PACKAGENAME": "com.outfit7.talkingtomgoldrun.huawei"
    },
    {
        "PACKAGENAME": "com.shizhuang.duapp"
    },
    {
        "PACKAGENAME": "com.sankuai.meituan"
    },
    {
        "PACKAGENAME": "com.cctv.yangshipin.app.androidp"
    },
    {
        "PACKAGENAME": "com.tencent.tmgp.cod"
    },
    {
        "PACKAGENAME": "com.tencent.android.qqdownloader"
    },
    {
        "PACKAGENAME": "com.autonavi.minimap"
    },
    {
        "PACKAGENAME": "air.tv.douyu.android"
    },
    {
        "PACKAGENAME": "com.huawei.gamebox"
    },
    {
        "PACKAGENAME": "com.tencent.tmgp.speedmobile"
    },
    {
        "PACKAGENAME": "com.kuaiduizuoye.scan"
    },
    {
        "PACKAGENAME": "com.netease.sky.huawei"
    },
    {
        "PACKAGENAME": "com.le123.ysdq"
    },
    {
        "PACKAGENAME": "com.huawei.music"
    },
    {
        "PACKAGENAME": "com.tencent.androidqqmail"
    },
    {
        "PACKAGENAME": "com.mt.mtxx.mtxx"
    },
    {
        "PACKAGENAME": "com.liubowang.drawingboard"
    },
    {
        "PACKAGENAME": "com.tencent.gamehelper.pg"
    },
    {
        "PACKAGENAME": "cn.com.langeasy.langeasylexis"
    },
    {
        "PACKAGENAME": "com.xt.retouch"
    },
    {
        "PACKAGENAME": "com.baidu.baidumap"
    },
    {
        "PACKAGENAME": "com.qqgame.hlddz"
    },
    {
        "PACKAGENAME": "com.kmxs.reader"
    },
    {
        "PACKAGENAME": "com.m4399.gamecenter"
    },
    {
        "PACKAGENAME": "com.hongen.app.word"
    },
    {
        "PACKAGENAME": "com.ss.android.article.lite"
    },
    {
        "PACKAGENAME": "jp.ne.ibis.ibispaintx.app.hms"
    },
    {
        "PACKAGENAME": "com.chaoxing.mobile"
    },
    {
        "PACKAGENAME": "com.tencent.tmgp.cf"
    },
    {
        "PACKAGENAME": "com.tencent.karaoke"
    },
    {
        "PACKAGENAME": "com.xyfywdljqq.huawei"
    },
    {
        "PACKAGENAME": "com.kwai.videoeditor"
    },
    {
        "PACKAGENAME": "com.tencent.lolm"
    },
    {
        "PACKAGENAME": "tv.danmaku.bilibilihd"
    },
    {
        "PACKAGENAME": "com.tencent.weread"
    },
    {
        "PACKAGENAME": "com.baidu.haokan"
    },
    {
        "PACKAGENAME": "com.petal.litegames"
    },
    {
        "PACKAGENAME": "com.aligames.kuang.kybc.huawei"
    },
    {
        "PACKAGENAME": "com.taobao.idlefish"
    },
    {
        "PACKAGENAME": "com.mihoyo.hyperion"
    },
    {
        "PACKAGENAME": "com.youdao.dict"
    },
    {
        "PACKAGENAME": "com.sofunny.sausage"
    },
    {
        "PACKAGENAME": "com.yinxiang"
    },
    {
        "PACKAGENAME": "com.cmplay.tiles2_cn.huawei"
    },
    {
        "PACKAGENAME": "com.xmcy.hykb"
    },
    {
        "PACKAGENAME": "com.xunlei.hddownloadprovider"
    },
    {
        "PACKAGENAME": "com.sup.android.superb"
    },
    {
        "PACKAGENAME": "com.snda.lantern.wifilocating"
    },
    {
        "PACKAGENAME": "com.tencent.kihan"
    },
    {
        "PACKAGENAME": "com.kuaikan.comic"
    },
    {
        "PACKAGENAME": "com.huawei.lives"
    },
    {
        "PACKAGENAME": "com.microsoft.emmx"
    },
    {
        "PACKAGENAME": "com.snda.wifilocating"
    },
    {
        "PACKAGENAME": "com.outfit7.mytalkingtom2.huawei"
    },
    {
        "PACKAGENAME": "com.tencent.ig"
    },
    {
        "PACKAGENAME": "com.xunlei.downloadprovider"
    },
    {
        "PACKAGENAME": "com.qileyx.ddz.huawei"
    },
    {
        "PACKAGENAME": "me.ele"
    },
    {
        "PACKAGENAME": "com.njh.biubiu"
    },
    {
        "PACKAGENAME": "com.yangcong345.android.phone"
    },
    {
        "PACKAGENAME": "com.cmcm.cfwallpaper"
    },
    {
        "PACKAGENAME": "com.cmcc.cmvideo"
    },
    {
        "PACKAGENAME": "com.lion.market"
    },
    {
        "PACKAGENAME": "cn.xuexi.android"
    },
    {
        "PACKAGENAME": "com.ss.android.auto"
    },
    {
        "PACKAGENAME": "cn.ninegame.gamemanager"
    },
    {
        "PACKAGENAME": "com.huawei.health"
    },
    {
        "PACKAGENAME": "com.alicloud.databox"
    },
    {
        "PACKAGENAME": "com.sinyee.babybus.world"
    },
    {
        "PACKAGENAME": "com.fenbi.android.leo"
    },
    {
        "PACKAGENAME": "com.netease.tom.huawei"
    },
    {
        "PACKAGENAME": "com.bairimeng.dmmdzz.huawei"
    },
    {
        "PACKAGENAME": "com.nineton.shouzhang"
    },
    {
        "PACKAGENAME": "com.netease.dwrg.huawei"
    },
    {
        "PACKAGENAME": "net.huanci.hsj"
    },
    {
        "PACKAGENAME": "com.liulishuo.engzo"
    },
    {
        "PACKAGENAME": "com.gotokeep.keep"
    },
    {
        "PACKAGENAME": "com.tophatch.concepts.china"
    },
    {
        "PACKAGENAME": "com.imangi.templerun2"
    },
    {
        "PACKAGENAME": "com.baidu.appsearch"
    },
    {
        "PACKAGENAME": "ctrip.android.view"
    },
    {
        "PACKAGENAME": "com.netease.edu.ucmooc"
    },
    {
        "PACKAGENAME": "com.xs.fm"
    },
    {
        "PACKAGENAME": "com.sankuai.meituan.takeoutnew"
    },
    {
        "PACKAGENAME": "com.babycloud.hanju"
    },
    {
        "PACKAGENAME": "com.plan.kot32.tomatotime"
    },
    {
        "PACKAGENAME": "com.bb.happykids.huawei"
    },
    {
        "PACKAGENAME": "com.jiongji.andriod.card"
    },
    {
        "PACKAGENAME": "com.shusheng.jojoread"
    },
    {
        "PACKAGENAME": "com.ihuman.pinyin"
    },
    {
        "PACKAGENAME": "com.qqgame.happymj"
    },
    {
        "PACKAGENAME": "com.qihoo.appstore"
    },
    {
        "PACKAGENAME": "com.intsig.camscanner"
    },
    {
        "PACKAGENAME": "com.fenbi.android.zenglish"
    },
    {
        "PACKAGENAME": "com.achievo.vipshop"
    },
    {
        "PACKAGENAME": "com.baidu.tieba"
    },
    {
        "PACKAGENAME": "com.sohu.sohuvideo"
    },
    {
        "PACKAGENAME": "com.gh.gamecenter"
    },
    {
        "PACKAGENAME": "com.lofter.android"
    },
    {
        "PACKAGENAME": "com.qidian.qdreader"
    },
    {
        "PACKAGENAME": "com.fenbi.android.servant"
    },
    {
        "PACKAGENAME": "com.hexin.plat.android"
    },
    {
        "PACKAGENAME": "com.qiyi.video"
    },
    {
        "PACKAGENAME": "com.xiaobanlong.main"
    },
    {
        "PACKAGENAME": "com.android.vending"
    },
    {
        "PACKAGENAME": "com.taobao.litetao"
    },
    {
        "PACKAGENAME": "com.fiistudio.fiinote"
    },
    {
        "PACKAGENAME": "com.zhongduomei.rrmj.society"
    },
    {
        "PACKAGENAME": "com.youzu.bs.huawei"
    },
    {
        "PACKAGENAME": "com.kugou.android.lite"
    },
    {
        "PACKAGENAME": "com.netease.gl"
    },
    {
        "PACKAGENAME": "com.coolapk.market"
    },
    {
        "PACKAGENAME": "com.fenbi.android.solar"
    },
    {
        "PACKAGENAME": "com.huawei.smarthome"
    },
    {
        "PACKAGENAME": "net.xmind.doughnut"
    },
    {
        "PACKAGENAME": "com.ihuman.imath"
    },
    {
        "PACKAGENAME": "com.tencent.wework"
    },
    {
        "PACKAGENAME": "com.flexcil.flexcilnote"
    },
    {
        "PACKAGENAME": "com.outfit7.herodash.new.huawei"
    },
    {
        "PACKAGENAME": "com.excean.gspace"
    },
    {
        "PACKAGENAME": "com.shanbay.sentence"
    },
    {
        "PACKAGENAME": "com.yaerxing.fkst"
    },
    {
        "PACKAGENAME": "cn.cntvhd"
    },
    {
        "PACKAGENAME": "com.mobileticket"
    },
    {
        "PACKAGENAME": "com.tencent.qqgame.xq"
    },
    {
        "PACKAGENAME": "com.cubic.autohome"
    },
    {
        "PACKAGENAME": "com.microsoft.office.excel"
    },
    {
        "PACKAGENAME": "com.jojoread.huiben"
    },
    {
        "PACKAGENAME": "com.microsoft.office.word"
    },
    {
        "PACKAGENAME": "com.dianping.v1"
    },
    {
        "PACKAGENAME": "cn.kuwo.player"
    },
    {
        "PACKAGENAME": "com.netease.uu"
    },
    {
        "PACKAGENAME": "zwzt.fangqiu.edu.com.zwzt"
    },
    {
        "PACKAGENAME": "com.netease.aceracer.huawei"
    },
    {
        "PACKAGENAME": "com.sinyee.babybus.recommendapp"
    },
    {
        "PACKAGENAME": "com.mihoyo.bh3.huawei"
    },
    {
        "PACKAGENAME": "cn.zepeto.main"
    },
    {
        "PACKAGENAME": "cn.wenyu.bodian"
    },
    {
        "PACKAGENAME": "com.douban.frodo"
    },
    {
        "PACKAGENAME": "com.ihuman.english"
    },
    {
        "PACKAGENAME": "com.anjuke.android.app"
    },
    {
        "PACKAGENAME": "com.shoujiduoduo.wallpaper"
    },
    {
        "PACKAGENAME": "com.clover.daysmatter"
    },
    {
        "PACKAGENAME": "com.gamestar.perfectpiano"
    },
    {
        "PACKAGENAME": "com.jzzs.parentshelper"
    },
    {
        "PACKAGENAME": "com.yuantiku.tutor"
    },
    {
        "PACKAGENAME": "com.qihoo.browser"
    },
    {
        "PACKAGENAME": "com.outfit7.mytalkingtomfriends.huawei"
    },
    {
        "PACKAGENAME": "com.google.android.gms"
    },
    {
        "PACKAGENAME": "com.jjwxc.reader"
    },
    {
        "PACKAGENAME": "com.tencent.tmgp.supercell.clashofclans"
    },
    {
        "PACKAGENAME": "com.netease.mrzh.huawei"
    },
    {
        "PACKAGENAME": "com.android.chrome"
    },
    {
        "PACKAGENAME": "com.eastmoney.android.berlin"
    },
    {
        "PACKAGENAME": "com.tencent.gamehelper.smoba"
    },
    {
        "PACKAGENAME": "cn.soulapp.android"
    },
    {
        "PACKAGENAME": "com.bilibili.comic"
    },
    {
        "PACKAGENAME": "cn.eeo.classin"
    },
    {
        "PACKAGENAME": "com.wczj.huawei"
    },
    {
        "PACKAGENAME": "cn.dictcn.android.digitize.swg_xhzd_21003"
    },
    {
        "PACKAGENAME": "com.dianshijia.tvlive"
    },
    {
        "PACKAGENAME": "com.outfit7.mytalkingangela2.huawei"
    },
    {
        "PACKAGENAME": "com.duowan.mobile"
    },
    {
        "PACKAGENAME": "com.gkid.crazyrope"
    },
    {
        "PACKAGENAME": "com.lets.p3.huawei"
    },
    {
        "PACKAGENAME": "com.app.moontv"
    },
    {
        "PACKAGENAME": "com.upgadata.up7723"
    },
    {
        "PACKAGENAME": "com.wuba.zhuanzhuan"
    },
    {
        "PACKAGENAME": "cn.wsds.gamemaster"
    },
    {
        "PACKAGENAME": "com.maimemo.android.momo"
    },
    {
        "PACKAGENAME": "com.ledou.mhhy.huawei"
    },
    {
        "PACKAGENAME": "com.wepie.weplay"
    },
    {
        "PACKAGENAME": "com.vivo.easyshare"
    },
    {
        "PACKAGENAME": "com.mfp.jelly.huawei"
    },
    {
        "PACKAGENAME": "com.oray.sunlogin"
    },
    {
        "PACKAGENAME": "com.mubu.app"
    },
    {
        "PACKAGENAME": "com.tmri.app.main"
    },
    {
        "PACKAGENAME": "com.qq.ac.android"
    },
    {
        "PACKAGENAME": "com.wuba"
    },
    {
        "PACKAGENAME": "com.sy.dldlhsdj.huawei"
    },
    {
        "PACKAGENAME": "com.fingersoft.hcr2.cn.noncmcc.huawei"
    },
    {
        "PACKAGENAME": "com.estrongs.android.pop"
    },
    {
        "PACKAGENAME": "com.zengame.hlmjhdj.huawei"
    },
    {
        "PACKAGENAME": "com.excean.splay"
    },
    {
        "PACKAGENAME": "com.pandadastudio.ninjamustdie3.huawei"
    },
    {
        "PACKAGENAME": "com.wandoujia.phoenix2"
    },
    {
        "PACKAGENAME": "com.outfit7.mytalkingangelafree.huawei"
    },
    {
        "PACKAGENAME": "com.eusoft.ting.en"
    },
    {
        "PACKAGENAME": "com.wedobest.fivechess.huawei"
    },
    {
        "PACKAGENAME": "com.ledou.mhjy.huawei"
    },
    {
        "PACKAGENAME": "com.campmobile.snowcamera"
    },
    {
        "PACKAGENAME": "com.bilibili.studio"
    },
    {
        "PACKAGENAME": "cn.cntv"
    },
    {
        "PACKAGENAME": "com.zsfz.hlqsgdzz.huawei"
    },
    {
        "PACKAGENAME": "com.netease.pes.huawei"
    },
    {
        "PACKAGENAME": "cn.xiaochuankeji.tieba"
    },
    {
        "PACKAGENAME": "com.tal.abctimelibrary"
    },
    {
        "PACKAGENAME": "com.baidu.baidutranslate"
    },
    {
        "PACKAGENAME": "com.outfit7.talkingtom.huawei"
    },
    {
        "PACKAGENAME": "cn.kuwo.kwmusichd"
    },
    {
        "PACKAGENAME": "com.microsoft.office.officehub"
    },
    {
        "PACKAGENAME": "com.melestudio.paintd"
    },
    {
        "PACKAGENAME": "com.huluxia.gametools"
    },
    {
        "PACKAGENAME": "com.qunar"
    },
    {
        "PACKAGENAME": "com.all.video"
    },
    {
        "PACKAGENAME": "com.netease.harrypotter.huawei"
    },
    {
        "PACKAGENAME": "com.handsgo.jiakao.android"
    },
    {
        "PACKAGENAME": "org.mozilla.firefox"
    },
    {
        "PACKAGENAME": "cn.nineton.dailycheck"
    },
    {
        "PACKAGENAME": "com.microsoft.office.onenote"
    },
    {
        "PACKAGENAME": "com.peopledailychina.activity"
    },
    {
        "PACKAGENAME": "com.hicorenational.antifraud"
    },
    {
        "PACKAGENAME": "com.tmall.wireless"
    },
    {
        "PACKAGENAME": "com.gstarmc.android"
    },
    {
        "PACKAGENAME": "com.kdanmobile.android.pdfreader.google.pad"
    },
    {
        "PACKAGENAME": "com.joym.legendhero.huawei"
    },
    {
        "PACKAGENAME": "com.a17zuoye.mobile.homework"
    },
    {
        "PACKAGENAME": "com.hpplay.happycast"
    },
    {
        "PACKAGENAME": "com.tuyoo.doudizhu.android3d.huawei"
    },
    {
        "PACKAGENAME": "com.bf.sgs.hdexp.huawei"
    },
    {
        "PACKAGENAME": "com.netease.sky"
    },
    {
        "PACKAGENAME": "com.outfit7.mytalkingtomfree.huawei"
    },
    {
        "PACKAGENAME": "com.xiachufang"
    },
    {
        "PACKAGENAME": "com.turbochilli.rollingsky_cn.huawei"
    },
    {
        "PACKAGENAME": "com.youdao.course"
    },
    {
        "PACKAGENAME": "com.tencent.tmgp.qqx5"
    },
    {
        "PACKAGENAME": "cn.wps.moffice_eng"
    },
    {
        "PACKAGENAME": "com.dw.wzsjkthk.huawei"
    },
    {
        "PACKAGENAME": "com.papegames.nn4.huawei"
    },
    {
        "PACKAGENAME": "com.baidu.searchbox.tomas"
    },
    {
        "PACKAGENAME": "com.netease.newsreader.activity"
    },
    {
        "PACKAGENAME": "com.baijiahulian.maodou"
    },
    {
        "PACKAGENAME": "com.bytedance.ep.android"
    },
    {
        "PACKAGENAME": "com.duoduo.child.story"
    },
    {
        "PACKAGENAME": "cn.ccspeed"
    },
    {
        "PACKAGENAME": "com.moji.mjweather"
    },
    {
        "PACKAGENAME": "com.tencent.tmgp.lv"
    },
    {
        "PACKAGENAME": "com.rumtel.mobiletv"
    },
    {
        "PACKAGENAME": "com.aligames.sgzzlb.huawei"
    },
    {
        "PACKAGENAME": "com.tencent.fifamobile"
    },
    {
        "PACKAGENAME": "com.kwai.hisense"
    },
    {
        "PACKAGENAME": "com.netease.x19"
    },
    {
        "PACKAGENAME": "com.newskyer.draw"
    },
    {
        "PACKAGENAME": "com.jd.app.reader"
    },
    {
        "PACKAGENAME": "cn.canva.editor"
    },
    {
        "PACKAGENAME": "com.yingxiong.dfzj.huawei"
    },
    {
        "PACKAGENAME": "com.wedobest.szhrd.huawei"
    },
    {
        "PACKAGENAME": "com.playgame.havefun"
    },
    {
        "PACKAGENAME": "com.tencent.tmgp.wepop"
    },
    {
        "PACKAGENAME": "com.playrix.township.chukong.huawei"
    },
    {
        "PACKAGENAME": "com.tencent.weishi"
    },
    {
        "PACKAGENAME": "com.netease.g104.huawei"
    },
    {
        "PACKAGENAME": "com.tuyoo.fish3d.huawei"
    },
    {
        "PACKAGENAME": "com.duolingo"
    },
    {
        "PACKAGENAME": "com.youdao.translator"
    },
    {
        "PACKAGENAME": "com.picacomic.fregata"
    },
    {
        "PACKAGENAME": "com.eusoft.eudic"
    },
    {
        "PACKAGENAME": "com.qiyi.video.child"
    },
    {
        "PACKAGENAME": "com.ea.simcitymobile.huawei"
    },
    {
        "PACKAGENAME": "com.hpbr.bosszhipin"
    },
    {
        "PACKAGENAME": "com.tencent.map"
    },
    {
        "PACKAGENAME": "com.baidu.wenku"
    },
    {
        "PACKAGENAME": "com.kwai.livepartner"
    },
    {
        "PACKAGENAME": "com.jmtec.chihirotelephone"
    },
    {
        "PACKAGENAME": "com.twitter.android"
    },
    {
        "PACKAGENAME": "dopool.player"
    },
    {
        "PACKAGENAME": "com.excean.masaid"
    },
    {
        "PACKAGENAME": "com.zbx.ct.tvzhibo"
    },
    {
        "PACKAGENAME": "com.tencent.news"
    },
    {
        "PACKAGENAME": "com.wedobest.hd1010"
    },
    {
        "PACKAGENAME": "com.microsoft.office.powerpoint"
    },
    {
        "PACKAGENAME": "com.yodo1.skisafari.huawai"
    },
    {
        "PACKAGENAME": "com.sinyee.babybus.princess"
    },
    {
        "PACKAGENAME": "com.naiyoubz.main"
    },
    {
        "PACKAGENAME": "com.xiaoe.client"
    },
    {
        "PACKAGENAME": "com.netease.lrs.huawei"
    },
    {
        "PACKAGENAME": "com.foxit.mobile.pdf.lite"
    },
    {
        "PACKAGENAME": "com.sinyee.babybus.talk2kiki"
    },
    {
        "PACKAGENAME": "com.carrot.carrotfantasy"
    },
    {
        "PACKAGENAME": "com.qq.reader"
    },
    {
        "PACKAGENAME": "com.chaozh.ireaderfree"
    },
    {
        "PACKAGENAME": "com.pcncn.jj"
    },
    {
        "PACKAGENAME": "com.cctv4g.cctvmobiletv"
    },
    {
        "PACKAGENAME": "com.ishowedu.peiyin"
    },
    {
        "PACKAGENAME": "com.tencent.tmgp.jnbg2"
    },
    {
        "PACKAGENAME": "com.duoduo.child.storyhd"
    },
    {
        "PACKAGENAME": "com.sprite.foreigners"
    },
    {
        "PACKAGENAME": "com.mojang.minecraftpe"
    },
    {
        "PACKAGENAME": "com.zq.hand_drawn"
    },
    {
        "PACKAGENAME": "com.tsingzone.questionbank"
    },
    {
        "PACKAGENAME": "com.tinmanarts.jojosherlock"
    },
    {
        "PACKAGENAME": "com.zidongdianji"
    },
    {
        "PACKAGENAME": "com.lianjia.beike"
    },
    {
        "PACKAGENAME": "com.allhistory.dls.marble"
    },
    {
        "PACKAGENAME": "com.charm.clockdesktop"
    },
    {
        "PACKAGENAME": "com.hustzp.com.xichuangzhu"
    },
    {
        "PACKAGENAME": "com.google.android.apps.translate"
    },
    {
        "PACKAGENAME": "com.mywallpaper.customizechanger"
    },
    {
        "PACKAGENAME": "com.junhai.yzjq.huawei"
    },
    {
        "PACKAGENAME": "com.ifeng.news2"
    },
    {
        "PACKAGENAME": "com.netease.vopen"
    },
    {
        "PACKAGENAME": "com.zuoyebang.airclass"
    },
    {
        "PACKAGENAME": "com.iflytek.elpmobile.student"
    },
    {
        "PACKAGENAME": "com.storm.smart"
    },
    {
        "PACKAGENAME": "com.cainiao.wireless"
    },
    {
        "PACKAGENAME": "com.hupu.shihuo"
    },
    {
        "PACKAGENAME": "bin.mt.plus"
    },
    {
        "PACKAGENAME": "com.qmzg2.huawei"
    },
    {
        "PACKAGENAME": "com.xiaomi.smarthome"
    },
    {
        "PACKAGENAME": "com.taobao.live"
    },
    {
        "PACKAGENAME": "com.netease.wotb.huawei"
    },
    {
        "PACKAGENAME": "com.meetstudio.app.zither"
    },
    {
        "PACKAGENAME": "com.sevenvideo.app.android"
    },
    {
        "PACKAGENAME": "com.olimsoft.android.oplayer"
    },
    {
        "PACKAGENAME": "com.ks.kaishustory"
    },
    {
        "PACKAGENAME": "com.netease.hyxd.huawei"
    },
    {
        "PACKAGENAME": "com.seewo.en"
    },
    {
        "PACKAGENAME": "com.ztgame.bob"
    },
    {
        "PACKAGENAME": "com.stnts.iyoucloud"
    },
    {
        "PACKAGENAME": "com.wooduan.ssjj.huawei"
    },
    {
        "PACKAGENAME": "com.android.bankabc"
    },
    {
        "PACKAGENAME": "com.baidu.video"
    },
    {
        "PACKAGENAME": "com.sinyee.babybus.babyhospital"
    },
    {
        "PACKAGENAME": "com.tencent.qqsports"
    },
    {
        "PACKAGENAME": "com.greatefunhy.sdgs.huawei"
    },
    {
        "PACKAGENAME": "com.costudy.costudy"
    },
    {
        "PACKAGENAME": "com.brakefield.painter"
    },
    {
        "PACKAGENAME": "com.icbc"
    },
    {
        "PACKAGENAME": "tv.acfundanmaku.video"
    },
    {
        "PACKAGENAME": "com.fenbi.android.zhaojiao"
    },
    {
        "PACKAGENAME": "com.sinyee.babybus.homeland"
    },
    {
        "PACKAGENAME": "com.bxdyf.kuaishou.huawei"
    },
    {
        "PACKAGENAME": "com.higoplayservice.higoplay"
    },
    {
        "PACKAGENAME": "com.tvbc.maiduidui"
    },
    {
        "PACKAGENAME": "com.jinxin.namibox"
    },
    {
        "PACKAGENAME": "im.weshine.keyboard"
    },
    {
        "PACKAGENAME": "com.google.android.youtube"
    },
    {
        "PACKAGENAME": "air.com.gongfubb.wksz"
    },
    {
        "PACKAGENAME": "com.cnki.android.nlc"
    },
    {
        "PACKAGENAME": "com.wedobest.shudu"
    },
    {
        "PACKAGENAME": "com.mampod.ergedd"
    },
    {
        "PACKAGENAME": "com.yiche.autoeasy"
    },
    {
        "PACKAGENAME": "com.kunpo.myhome.jrtt.huawei"
    },
    {
        "PACKAGENAME": "com.sinyee.babybus.shopping"
    },
    {
        "PACKAGENAME": "com.jiliguala.niuwa"
    },
    {
        "PACKAGENAME": "com.alibaba.wireless"
    },
    {
        "PACKAGENAME": "com.netease.wxzc.huawei"
    },
    {
        "PACKAGENAME": "com.netease.jddsaef.huawei"
    },
    {
        "PACKAGENAME": "com.moonlight.huatu"
    },
    {
        "PACKAGENAME": "com.zhaopin.social"
    },
    {
        "PACKAGENAME": "com.luojilab.player"
    },
    {
        "PACKAGENAME": "com.huawei.fans"
    },
    {
        "PACKAGENAME": "com.banjixiaoguanjia.app"
    },
    {
        "PACKAGENAME": "com.hupu.games"
    },
    {
        "PACKAGENAME": "com.sinyee.babybus.icecream"
    },
    {
        "PACKAGENAME": "cn.jj"
    },
    {
        "PACKAGENAME": "com.t2ksports.nba2k20and"
    },
    {
        "PACKAGENAME": "com.edrawsoft.mindmaster"
    },
    {
        "PACKAGENAME": "cn.missevan"
    },
    {
        "PACKAGENAME": "cn.gov.tax.its"
    },
    {
        "PACKAGENAME": "com.mihoyo.wd.huawei"
    },
    {
        "PACKAGENAME": "com.tuyoo.gomoku.huawei"
    },
    {
        "PACKAGENAME": "com.huawei.himovie"
    },
    {
        "PACKAGENAME": "com.iyuba.tedvideo"
    },
    {
        "PACKAGENAME": "com.mistong.ewt360"
    },
    {
        "PACKAGENAME": "com.lew.game.pianoblock.huawei"
    },
    {
        "PACKAGENAME": "com.qxxy.cookingcity.huawei"
    },
    {
        "PACKAGENAME": "com.tencent.tim"
    },
    {
        "PACKAGENAME": "com.xueersi.parentsmeeting"
    },
    {
        "PACKAGENAME": "com.leandom.dice"
    },
    {
        "PACKAGENAME": "com.netease.onmyoji.huawei"
    },
    {
        "PACKAGENAME": "com.netease.avg.huawei"
    },
    {
        "PACKAGENAME": "com.cat.readall"
    },
    {
        "PACKAGENAME": "com.hermes.h1game.huawei"
    },
    {
        "PACKAGENAME": "com.tencent.tmgp.nba"
    },
    {
        "PACKAGENAME": "com.liuxinkeji.cooking.madness.huawei"
    },
    {
        "PACKAGENAME": "alook.browser"
    },
    {
        "PACKAGENAME": "com.lemon.faceu"
    },
    {
        "PACKAGENAME": "com.meishubao.artaiclass"
    },
    {
        "PACKAGENAME": "com.tencent.docs"
    },
    {
        "PACKAGENAME": "com.sinovatech.unicom.ui"
    },
    {
        "PACKAGENAME": "com.netease.mobimail"
    },
    {
        "PACKAGENAME": "com.igame.sgqql.huawei"
    },
    {
        "PACKAGENAME": "com.adsk.sketchbook"
    },
    {
        "PACKAGENAME": "com.vmall.client"
    },
    {
        "PACKAGENAME": "com.xiaomi.gamecenter.sdk.service"
    },
    {
        "PACKAGENAME": "mark.via"
    },
    {
        "PACKAGENAME": "com.yrtgame.stickvar.huawei"
    },
    {
        "PACKAGENAME": "a.baozouptu"
    },
    {
        "PACKAGENAME": "com.ludashi.benchmark"
    },
    {
        "PACKAGENAME": "com.chinamworld.bocmbci"
    },
    {
        "PACKAGENAME": "com.seewo.easicare.pro"
    },
    {
        "PACKAGENAME": "com.rtk.app"
    },
    {
        "PACKAGENAME": "com.yodo1.ctr22.huawei"
    },
    {
        "PACKAGENAME": "com.shuqi.controller"
    },
    {
        "PACKAGENAME": "com.iflytek.elpmobile.smartlearning"
    },
    {
        "PACKAGENAME": "com.sinyee.babybus.restaurant"
    },
    {
        "PACKAGENAME": "com.tc.bhrgzywz.huawei"
    },
    {
        "PACKAGENAME": "com.theone.aipeilian"
    },
    {
        "PACKAGENAME": "com.sinyee.babybus.career"
    },
    {
        "PACKAGENAME": "com.tianyi.cjjs.game.huawei"
    },
    {
        "PACKAGENAME": "com.duitang.main"
    },
    {
        "PACKAGENAME": "com.glodon.drawingexplorer"
    },
    {
        "PACKAGENAME": "cn.etouch.ecalendar"
    },
    {
        "PACKAGENAME": "com.mxtech.videoplayer.ad"
    },
    {
        "PACKAGENAME": "com.rockets.chang"
    },
    {
        "PACKAGENAME": "com.chinamworld.main"
    },
    {
        "PACKAGENAME": "com.fy.qxds.huawei"
    },
    {
        "PACKAGENAME": "com.sinyee.babybus.drawingii"
    },
    {
        "PACKAGENAME": "com.sinyee.babybus.drinks"
    },
    {
        "PACKAGENAME": "com.shanbay.news"
    },
    {
        "PACKAGENAME": "com.byfen.market"
    },
    {
        "PACKAGENAME": "com.ihuman.book"
    },
    {
        "PACKAGENAME": "com.jincheng.supercaculator"
    },
    {
        "PACKAGENAME": "com.hp.printercontrol"
    },
    {
        "PACKAGENAME": "com.taobao.trip"
    },
    {
        "PACKAGENAME": "com.supercell.clashroyale.huawei"
    },
    {
        "PACKAGENAME": "com.sinyee.babybus.food"
    },
    {
        "PACKAGENAME": "cn.readpad.whiteboard"
    },
    {
        "PACKAGENAME": "cn.com.langeasy.easylisten"
    },
    {
        "PACKAGENAME": "cn.vcinema.cinema"
    },
    {
        "PACKAGENAME": "com.qihoo.contents"
    },
    {
        "PACKAGENAME": "com.weico.international"
    },
    {
        "PACKAGENAME": "com.yingxiong.dftk.huawei"
    },
    {
        "PACKAGENAME": "com.jbdfw.huawei"
    },
    {
        "PACKAGENAME": "com.huawei.mycenter"
    },
    {
        "PACKAGENAME": "com.tencent.qt.qtl"
    },
    {
        "PACKAGENAME": "com.cjtec.uncompress"
    },
    {
        "PACKAGENAME": "com.sinyee.babybus.tailor"
    },
    {
        "PACKAGENAME": "com.fy.ylzz.huawei"
    },
    {
        "PACKAGENAME": "com.example.xuhongxiang.andriodpiano"
    },
    {
        "PACKAGENAME": "com.tencent.transfer"
    },
    {
        "PACKAGENAME": "com.dw.hcdj.huawei"
    },
    {
        "PACKAGENAME": "com.pep.diandu"
    },
    {
        "PACKAGENAME": "com.video.lizhi"
    },
    {
        "PACKAGENAME": "com.example.chinesechess.huawei"
    },
    {
        "PACKAGENAME": "com.skyplatanus.crucio"
    },
    {
        "PACKAGENAME": "com.ss.android.lark"
    },
    {
        "PACKAGENAME": "com.jym.mall"
    },
    {
        "PACKAGENAME": "weicom.yi.wallpaper"
    },
    {
        "PACKAGENAME": "com.dmzj.manhua"
    },
    {
        "PACKAGENAME": "com.aiwu.market"
    },
    {
        "PACKAGENAME": "com.baidu.video.pad"
    },
    {
        "PACKAGENAME": "com.zuoyebang.knowledge"
    },
    {
        "PACKAGENAME": "com.valvesoftware.android.steam.community"
    },
    {
        "PACKAGENAME": "com.erciyuanpaint"
    },
    {
        "PACKAGENAME": "com.yodo1.rodeo.huawei"
    },
    {
        "PACKAGENAME": "sogou.mobile.explorer"
    },
    {
        "PACKAGENAME": "com.theotino.chinadaily"
    },
    {
        "PACKAGENAME": "com.fileunzip.zxwknight"
    },
    {
        "PACKAGENAME": "com.jojoread.jojocalculate"
    },
    {
        "PACKAGENAME": "com.igame.nldbp.huawei"
    },
    {
        "PACKAGENAME": "com.hujiang.cctalk"
    },
    {
        "PACKAGENAME": "com.huawei.welink"
    },
    {
        "PACKAGENAME": "com.tal.imonkey.chinese"
    },
    {
        "PACKAGENAME": "com.youban.projectmath"
    },
    {
        "PACKAGENAME": "com.wb.gc.ttxfk.huawei"
    },
    {
        "PACKAGENAME": "com.smzdm.client.android"
    },
    {
        "PACKAGENAME": "com.youdao.note"
    },
    {
        "PACKAGENAME": "com.shoujiduoduo.ringtone"
    },
    {
        "PACKAGENAME": "com.sohu.tv"
    },
    {
        "PACKAGENAME": "com.qq.qcloud"
    },
    {
        "PACKAGENAME": "com.netease.my.huawei"
    },
    {
        "PACKAGENAME": "io.dushu.fandengreader"
    },
    {
        "PACKAGENAME": "com.ets100.secondary"
    },
    {
        "PACKAGENAME": "com.dw.wxpk.huawei"
    },
    {
        "PACKAGENAME": "com.zsyj.handaccount"
    },
    {
        "PACKAGENAME": "com.hihonor.vmall"
    },
    {
        "PACKAGENAME": "com.k7k7.goujihd.huawei"
    },
    {
        "PACKAGENAME": "com.huatu.handheld_huatu"
    },
    {
        "PACKAGENAME": "com.tencent.lovechoice"
    },
    {
        "PACKAGENAME": "net.csdn.csdnplus"
    },
    {
        "PACKAGENAME": "fm.qingting.qtradio"
    },
    {
        "PACKAGENAME": "com.dewmobile.kuaiya.play"
    },
    {
        "PACKAGENAME": "com.mihoyo.desktopportal"
    },
    {
        "PACKAGENAME": "com.ubestkid.beilehu.android"
    },
    {
        "PACKAGENAME": "com.hnty.tfjy.huawei"
    },
    {
        "PACKAGENAME": "cmccwm.mobilemusic"
    },
    {
        "PACKAGENAME": "com.sinyee.babybus.snacks"
    },
    {
        "PACKAGENAME": "com.netease.moba.huawei"
    },
    {
        "PACKAGENAME": "com.jxedt"
    },
    {
        "PACKAGENAME": "com.fengguo.wpjz.huawei"
    },
    {
        "PACKAGENAME": "com.duwo.reading"
    },
    {
        "PACKAGENAME": "com.dofun.zhw.pro"
    },
    {
        "PACKAGENAME": "com.yek.android.kfc.activitys"
    },
    {
        "PACKAGENAME": "com.yingxiong.hero.huawei"
    },
    {
        "PACKAGENAME": "com.zdtx.slmnyzsmn.yy"
    },
    {
        "PACKAGENAME": "tech.caicheng.judourili"
    },
    {
        "PACKAGENAME": "com.letv.android.client"
    },
    {
        "PACKAGENAME": "com.sinyee.babybus.diner"
    },
    {
        "PACKAGENAME": "com.earth.bdspace"
    },
    {
        "PACKAGENAME": "com.able.wisdomtree"
    },
    {
        "PACKAGENAME": "com.netease.mail"
    },
    {
        "PACKAGENAME": "com.bestv.app"
    },
    {
        "PACKAGENAME": "com.tianyancha.skyeye"
    },
    {
        "PACKAGENAME": "com.greenpoint.android.mc10086.activity"
    },
    {
        "PACKAGENAME": "com.tencent.tmgp.wuxia"
    },
    {
        "PACKAGENAME": "com.ivydad.readtool"
    },
    {
        "PACKAGENAME": "cn.fjnu.edu.paint"
    },
    {
        "PACKAGENAME": "com.shinyv.cnr"
    },
    {
        "PACKAGENAME": "cc.forestapp"
    },
    {
        "PACKAGENAME": "com.microsoft.appmanager"
    },
    {
        "PACKAGENAME": "com.tencent.tmgp.djsy"
    },
    {
        "PACKAGENAME": "com.kurogame.haru.huawei"
    },
    {
        "PACKAGENAME": "com.jd.game.onetpet.huawei"
    },
    {
        "PACKAGENAME": "com.fy.wdxd.new.huawei"
    },
    {
        "PACKAGENAME": "com.offcn.android.offcn"
    },
    {
        "PACKAGENAME": "com.ihuman.recite"
    },
    {
        "PACKAGENAME": "com.m1905.mobilefree"
    },
    {
        "PACKAGENAME": "android.zhibo8"
    },
    {
        "PACKAGENAME": "air.com.gongfubb.wkpy"
    },
    {
        "PACKAGENAME": "cn.sousui.word"
    },
    {
        "PACKAGENAME": "com.instagram.android"
    },
    {
        "PACKAGENAME": "com.zhiliaoapp.musically"
    },
    {
        "PACKAGENAME": "com.baidu.duer.superapp"
    },
    {
        "PACKAGENAME": "com.shoujiduoduo.wpplugin"
    },
    {
        "PACKAGENAME": "com.qidian.dldl.huawei"
    },
    {
        "PACKAGENAME": "cmb.pb"
    },
    {
        "PACKAGENAME": "com.zdtx.yhxynswyrzyx.huawei"
    },
    {
        "PACKAGENAME": "com.tdx.androidnew"
    },
    {
        "PACKAGENAME": "com.sinyee.babybus.toilet"
    },
    {
        "PACKAGENAME": "com.duole.chinachess.huawei"
    },
    {
        "PACKAGENAME": "com.feiyu.carrot3.huawei"
    },
    {
        "PACKAGENAME": "com.gaea.aotu.huawei"
    },
    {
        "PACKAGENAME": "com.game.universeatm.huawei"
    },
    {
        "PACKAGENAME": "com.sinyee.babybus.chants"
    },
    {
        "PACKAGENAME": "com.sinyee.babybus.policemen"
    },
    {
        "PACKAGENAME": "com.changba"
    },
    {
        "PACKAGENAME": "com.cmcm.arrowio_cn.huawei"
    },
    {
        "PACKAGENAME": "com.tencent.start"
    },
    {
        "PACKAGENAME": "com.m37.dldl.huawei"
    },
    {
        "PACKAGENAME": "com.tencent.pao"
    },
    {
        "PACKAGENAME": "com.cliff"
    },
    {
        "PACKAGENAME": "com.newbee.npuzzle"
    },
    {
        "PACKAGENAME": "com.fluidtouch.noteshelf2"
    },
    {
        "PACKAGENAME": "com.video.zs"
    },
    {
        "PACKAGENAME": "us.zoom.videomeetings"
    },
    {
        "PACKAGENAME": "com.sinyee.babybus.chants.pad"
    },
    {
        "PACKAGENAME": "com.drpanda.chineseacademy.huawei"
    },
    {
        "PACKAGENAME": "com.novakids.busylifeworld"
    },
    {
        "PACKAGENAME": "youqu.android.todesk"
    },
    {
        "PACKAGENAME": "com.unionpay"
    },
    {
        "PACKAGENAME": "com.sangfor.vpn.client.phone"
    },
    {
        "PACKAGENAME": "com.huabenapp"
    },
    {
        "PACKAGENAME": "com.mallestudio.gugu.app"
    },
    {
        "PACKAGENAME": "com.wedobest.piano"
    },
    {
        "PACKAGENAME": "bubei.tingshu"
    },
    {
        "PACKAGENAME": "com.roblox.client"
    },
    {
        "PACKAGENAME": "com.duorong.smarttool"
    },
    {
        "PACKAGENAME": "com.huati"
    },
    {
        "PACKAGENAME": "com.koudai.weidian.buyer"
    },
    {
        "PACKAGENAME": "com.dw.btime"
    },
    {
        "PACKAGENAME": "com.microsoft.skydrive"
    },
    {
        "PACKAGENAME": "com.immomo.momo"
    },
    {
        "PACKAGENAME": "org.gushiwen.gushiwen"
    },
    {
        "PACKAGENAME": "com.maidu.gkld"
    },
    {
        "PACKAGENAME": "com.dw.xprqj.huawei"
    },
    {
        "PACKAGENAME": "com.baidu.ybb"
    },
    {
        "PACKAGENAME": "com.ucmobile.lite"
    },
    {
        "PACKAGENAME": "com.yipeinet.excelzl"
    },
    {
        "PACKAGENAME": "com.kingsoft"
    },
    {
        "PACKAGENAME": "com.baidu.youavideo"
    },
    {
        "PACKAGENAME": "cn.ticktick.task"
    },
    {
        "PACKAGENAME": "com.android.incallui"
    },
    {
        "PACKAGENAME": "com.sinyee.babybus.market"
    },
    {
        "PACKAGENAME": "com.kk.xx.newplayer"
    },
    {
        "PACKAGENAME": "com.xuexiaoyi.xxy"
    },
    {
        "PACKAGENAME": "com.wemomo.tietie"
    },
    {
        "PACKAGENAME": "com.huawei.hwvplayer.youku"
    },
    {
        "PACKAGENAME": "com.studiowildcard.wardrumstudios.ark"
    },
    {
        "PACKAGENAME": "com.zengame.zrttddz.huawei"
    },
    {
        "PACKAGENAME": "com.youloft.icloser"
    },
    {
        "PACKAGENAME": "com.fatcat.myprincessroomdesign.huawei"
    },
    {
        "PACKAGENAME": "com.guandan.huawei"
    },
    {
        "PACKAGENAME": "com.zzol.huawei"
    },
    {
        "PACKAGENAME": "com.cmge.dz.xhlmj.huawei"
    },
    {
        "PACKAGENAME": "com.vipkid.studypad"
    },
    {
        "PACKAGENAME": "com.sohu.newsclient"
    },
    {
        "PACKAGENAME": "cn.wps.yun"
    },
    {
        "PACKAGENAME": "com.xiaomi.shop"
    },
    {
        "PACKAGENAME": "com.sinyee.babybus.cat"
    },
    {
        "PACKAGENAME": "com.hygame.fzgd.ssfh.huawei"
    },
    {
        "PACKAGENAME": "com.metek.ultraman.huawei"
    },
    {
        "PACKAGENAME": "com.yusi.chongchong"
    },
    {
        "PACKAGENAME": "air.com.gongfubb.wk123"
    },
    {
        "PACKAGENAME": "com.yiqi.onetoone"
    },
    {
        "PACKAGENAME": "com.homelink.android"
    },
    {
        "PACKAGENAME": "com.cnki.android.cnkimobile"
    },
    {
        "PACKAGENAME": "com.ymtx.snyx.huawei"
    },
    {
        "PACKAGENAME": "com.tencent.peng"
    },
    {
        "PACKAGENAME": "com.yiyou.ga"
    },
    {
        "PACKAGENAME": "onyuan.weiqi.huawei"
    },
    {
        "PACKAGENAME": "com.cmplay.dancingline.huawei"
    },
    {
        "PACKAGENAME": "com.haojiazhang.activity"
    },
    {
        "PACKAGENAME": "com.uxin.kilaaudio"
    },
    {
        "PACKAGENAME": "com.carrot.iceworld"
    },
    {
        "PACKAGENAME": "com.banciyuan.bcywebview"
    },
    {
        "PACKAGENAME": "com.tencent.edu"
    },
    {
        "PACKAGENAME": "com.ltzk.mbsf"
    },
    {
        "PACKAGENAME": "com.my.cooking.chef.kitchen.craze.fever.huawei"
    },
    {
        "PACKAGENAME": "cn.flytalk.tetris.huawei"
    },
    {
        "PACKAGENAME": "com.daofeng.zuhaowan"
    },
    {
        "PACKAGENAME": "com.sinyee.babybus.garden"
    },
    {
        "PACKAGENAME": "com.gamestar.pianoperfect"
    },
    {
        "PACKAGENAME": "com.hd.bwty.huawei"
    },
    {
        "PACKAGENAME": "tian.han.tian"
    },
    {
        "PACKAGENAME": "com.jd.game.onetfruit"
    },
    {
        "PACKAGENAME": "com.tencent.shootgame"
    },
    {
        "PACKAGENAME": "com.brianbaek.popstar"
    },
    {
        "PACKAGENAME": "com.miga.mytown.c.huawei"
    },
    {
        "PACKAGENAME": "com.fnny.tttfk.huawei"
    },
    {
        "PACKAGENAME": "com.doudoubird.alarmcolck"
    },
    {
        "PACKAGENAME": "com.netease.stzb.huawei"
    },
    {
        "PACKAGENAME": "com.youjing.beisudianxue"
    },
    {
        "PACKAGENAME": "com.sinyee.babybus.delicacy"
    },
    {
        "PACKAGENAME": "com.igame.pskj.tgkxcq.huawei"
    },
    {
        "PACKAGENAME": "com.dalongtech.cloud"
    },
    {
        "PACKAGENAME": "com.kugou.android.ringtone"
    },
    {
        "PACKAGENAME": "com.gaotu100.superclass"
    },
    {
        "PACKAGENAME": "com.mad.zenflipclock"
    },
    {
        "PACKAGENAME": "com.zmzx.college.search"
    },
    {
        "PACKAGENAME": "com.amfe.mrjh.huawei"
    },
    {
        "PACKAGENAME": "cn.cntvnews"
    },
    {
        "PACKAGENAME": "jp.pxv.android"
    },
    {
        "PACKAGENAME": "com.youban.xblpy"
    },
    {
        "PACKAGENAME": "com.uusense.speed"
    },
    {
        "PACKAGENAME": "com.moji.pad"
    },
    {
        "PACKAGENAME": "cn.ultralisk.gameapp.game37.huawei"
    },
    {
        "PACKAGENAME": "com.p1.mobile.putong"
    },
    {
        "PACKAGENAME": "com.joym.xiongdakuaipao.huawei"
    },
    {
        "PACKAGENAME": "com.one.woodenletter"
    },
    {
        "PACKAGENAME": "com.igame.yxwg.jzdxdw.huawei"
    },
    {
        "PACKAGENAME": "com.sqw.jwdzg.huawei"
    },
    {
        "PACKAGENAME": "com.dianyun.pcgo"
    },
    {
        "PACKAGENAME": "org.telegram.messenger"
    },
    {
        "PACKAGENAME": "tuoyan.com.xinghuo_daying"
    },
    {
        "PACKAGENAME": "com.ovital.ovitalmap"
    },
    {
        "PACKAGENAME": "com.tencent.minihd.qq"
    },
    {
        "PACKAGENAME": "com.videocutting.editor"
    },
    {
        "PACKAGENAME": "com.youban.xblertongpbhw"
    },
    {
        "PACKAGENAME": "com.jd.jdlite"
    },
    {
        "PACKAGENAME": "com.touchtech.tangshi"
    },
    {
        "PACKAGENAME": "com.wedobest.llk.huawei"
    },
    {
        "PACKAGENAME": "com.lanjiyin.lanjiyin"
    },
    {
        "PACKAGENAME": "me.yoopu.app.songbook"
    },
    {
        "PACKAGENAME": "com.jsdw.cnsc.huawei"
    },
    {
        "PACKAGENAME": "com.zdtx.gxyhwyzd.huawei"
    },
    {
        "PACKAGENAME": "com.example.administrator.searchpicturetool"
    },
    {
        "PACKAGENAME": "com.lingan.seeyou"
    },
    {
        "PACKAGENAME": "com.youqi.miaomiao"
    },
    {
        "PACKAGENAME": "com.sy.mtdl.huawei"
    },
    {
        "PACKAGENAME": "com.huawei.mirror"
    },
    {
        "PACKAGENAME": "app.weile.jiaxiangmjmj.huawei"
    },
    {
        "PACKAGENAME": "com.sinyee.babybus.adventure"
    },
    {
        "PACKAGENAME": "com.dedao.juvenile"
    },
    {
        "PACKAGENAME": "com.mfw.roadbook"
    },
    {
        "PACKAGENAME": "com.wordscon.axe"
    },
    {
        "PACKAGENAME": "com.alibaba.ailabs.tg"
    },
    {
        "PACKAGENAME": "com.xiaomi.gamecenter"
    },
    {
        "PACKAGENAME": "com.market2345"
    },
    {
        "PACKAGENAME": "com.ido.screen.record"
    },
    {
        "PACKAGENAME": "com.qingqi.dianbo"
    },
    {
        "PACKAGENAME": "com.hhdd.kada"
    },
    {
        "PACKAGENAME": "com.ola100.app"
    },
    {
        "PACKAGENAME": "com.sinyee.babybus.factory"
    },
    {
        "PACKAGENAME": "com.cnki.client"
    },
    {
        "PACKAGENAME": "com.soulgame.slithersg.huawei"
    },
    {
        "PACKAGENAME": "org.tinghood.tpsformobile.huawei"
    },
    {
        "PACKAGENAME": "com.kugou.android.ktvapp"
    },
    {
        "PACKAGENAME": "com.outfit7.mytalkinghank.huawei"
    },
    {
        "PACKAGENAME": "com.sinyee.babybus.privacy"
    },
    {
        "PACKAGENAME": "com.tongcheng.android"
    },
    {
        "PACKAGENAME": "com.caonigame.kzbbt.huawei"
    },
    {
        "PACKAGENAME": "com.huawei.genexcloud.speedtest"
    },
    {
        "PACKAGENAME": "com.excean.na"
    },
    {
        "PACKAGENAME": "com.cxy61.openkidsmath"
    },
    {
        "PACKAGENAME": "com.happyteam.dubbingshow"
    },
    {
        "PACKAGENAME": "com.dy.qmqsdj.huawei"
    },
    {
        "PACKAGENAME": "com.mymoney"
    },
    {
        "PACKAGENAME": "com.tocaboca.tocalifeworld"
    },
    {
        "PACKAGENAME": "com.vcinema.cinema.pad"
    },
    {
        "PACKAGENAME": "com.c2vl.kgamebox"
    },
    {
        "PACKAGENAME": "com.rockstargames.gtasa"
    },
    {
        "PACKAGENAME": "com.orangego.lcdclock"
    },
    {
        "PACKAGENAME": "com.arivoc.ky"
    },
    {
        "PACKAGENAME": "com.sinyee.babybus.cake"
    },
    {
        "PACKAGENAME": "com.dw.tyqs.huawei"
    },
    {
        "PACKAGENAME": "com.jucai.happygo"
    },
    {
        "PACKAGENAME": "com.max.xiaoheihe"
    },
    {
        "PACKAGENAME": "cn.ecooktwo"
    },
    {
        "PACKAGENAME": "com.netease.edu.study"
    },
    {
        "PACKAGENAME": "com.xueqiu.android"
    },
    {
        "PACKAGENAME": "com.sinyee.babybus.amusement"
    },
    {
        "PACKAGENAME": "com.android.abustory"
    },
    {
        "PACKAGENAME": "com.zhangpei.pinyindazi"
    },
    {
        "PACKAGENAME": "com.xkw.client"
    },
    {
        "PACKAGENAME": "com.hello.mynewbornbirthiamgoingtobeamother.huawei"
    },
    {
        "PACKAGENAME": "com.hihonor.videoeditor"
    },
    {
        "PACKAGENAME": "com.youloft.calendar"
    },
    {
        "PACKAGENAME": "com.net.zdsoft.netstudy.netstudy_v5_mobile_app"
    },
    {
        "PACKAGENAME": "com.ukids.client.phone"
    },
    {
        "PACKAGENAME": "com.lixiangdong.mediaplayer"
    },
    {
        "PACKAGENAME": "com.midu.magic.huahua"
    },
    {
        "PACKAGENAME": "com.qihoo360.mobilesafe"
    },
    {
        "PACKAGENAME": "com.kingwin.piano"
    },
    {
        "PACKAGENAME": "com.hp.android.printservice"
    },
    {
        "PACKAGENAME": "com.maj3d.qmmj.huawei"
    },
    {
        "PACKAGENAME": "net.cpwxw.cpfiction"
    },
    {
        "PACKAGENAME": "com.lutongnet.brainadventure.plugin"
    },
    {
        "PACKAGENAME": "com.qingot.realtime"
    },
    {
        "PACKAGENAME": "cn.xdf.roombox.app"
    },
    {
        "PACKAGENAME": "cn.huohua.edustudent"
    },
    {
        "PACKAGENAME": "com.fgol.huawei"
    },
    {
        "PACKAGENAME": "com.bilibili.deadcells.mobile.huawei"
    },
    {
        "PACKAGENAME": "com.zybang.parent"
    },
    {
        "PACKAGENAME": "com.fgol.hsw.huawei"
    },
    {
        "PACKAGENAME": "net.whty.app.eyu"
    },
    {
        "PACKAGENAME": "com.yyxx.study"
    },
    {
        "PACKAGENAME": "com.sinyee.babybus.shopkeeper"
    },
    {
        "PACKAGENAME": "com.aligames.lxqw.huawei"
    },
    {
        "PACKAGENAME": "com.lmiot.xyclick"
    },
    {
        "PACKAGENAME": "com.google.android.play.games"
    },
    {
        "PACKAGENAME": "org.fungo.fungolive"
    },
    {
        "PACKAGENAME": "com.joym.combatman.huawei"
    },
    {
        "PACKAGENAME": "cn.fzhuayantcoltd.huayaapp"
    },
    {
        "PACKAGENAME": "com.tan8"
    },
    {
        "PACKAGENAME": "com.eykid.android.ey"
    },
    {
        "PACKAGENAME": "net.afdian.afdian"
    },
    {
        "PACKAGENAME": "com.zjzy.calendartime"
    },
    {
        "PACKAGENAME": "cn.com.chsi.chsiapp"
    },
    {
        "PACKAGENAME": "com.idianvideo.app.android"
    },
    {
        "PACKAGENAME": "com.qqgame.mic"
    },
    {
        "PACKAGENAME": "com.sinyee.babybus.taxi"
    },
    {
        "PACKAGENAME": "com.sinyee.babybus.designer"
    },
    {
        "PACKAGENAME": "cn.com.bookan"
    },
    {
        "PACKAGENAME": "com.ttule.picture"
    },
    {
        "PACKAGENAME": "yyc.xk"
    },
    {
        "PACKAGENAME": "com.location.appyincang64"
    },
    {
        "PACKAGENAME": "com.supercell.clashofclans.huawei"
    },
    {
        "PACKAGENAME": "com.yizhilu.qh"
    },
    {
        "PACKAGENAME": "com.hero.sm.huawei"
    },
    {
        "PACKAGENAME": "com.medibang.android.paint.tablet"
    },
    {
        "PACKAGENAME": "com.dailyyoga.cn"
    },
    {
        "PACKAGENAME": "com.pfu.xcxxl.huawei"
    },
    {
        "PACKAGENAME": "com.youban.xblliteracy"
    },
    {
        "PACKAGENAME": "com.fenbi.android.kyzz"
    },
    {
        "PACKAGENAME": "com.netease.skzdhlr.huawei"
    },
    {
        "PACKAGENAME": "com.leiting.daluandou.huawei"
    },
    {
        "PACKAGENAME": "com.fenbi.android.aries"
    },
    {
        "PACKAGENAME": "com.cn21.ecloud"
    },
    {
        "PACKAGENAME": "com.haotubang.h3dbodyfree"
    },
    {
        "PACKAGENAME": "com.yingyonghui.market"
    },
    {
        "PACKAGENAME": "com.tanwan.yscqlyzf.huawei"
    },
    {
        "PACKAGENAME": "com.yikaobang.yixue"
    },
    {
        "PACKAGENAME": "com.happyelements.tsumtsumandroid.huawei"
    },
    {
        "PACKAGENAME": "com.dinoenglish.yyb"
    },
    {
        "PACKAGENAME": "com.sy.ysczglyqh.huawei"
    },
    {
        "PACKAGENAME": "com.xxf.hcrsjzz.huawei"
    },
    {
        "PACKAGENAME": "com.outfit7.mytalkingtomcandyrun.new.huawei"
    },
    {
        "PACKAGENAME": "com.tencent.portfolio"
    },
    {
        "PACKAGENAME": "com.yiqizuoye.jzt"
    },
    {
        "PACKAGENAME": "com.outfit7.talkingtom2free.huawei"
    },
    {
        "PACKAGENAME": "com.wecut.ouo"
    },
    {
        "PACKAGENAME": "com.dangdang.buy2"
    },
    {
        "PACKAGENAME": "com.lu.ashionweather"
    },
    {
        "PACKAGENAME": "com.master.onelockscreen"
    },
    {
        "PACKAGENAME": "com.tencent.tmgp.hjol"
    },
    {
        "PACKAGENAME": "com.netease.l10.huawei"
    },
    {
        "PACKAGENAME": "com.wedobest.puzzlebubble"
    },
    {
        "PACKAGENAME": "com.netease.tank.huawei"
    },
    {
        "PACKAGENAME": "com.haowan.huabar"
    },
    {
        "PACKAGENAME": "czh.mindnode"
    },
    {
        "PACKAGENAME": "com.shanbay.listen"
    },
    {
        "PACKAGENAME": "com.sinyee.babybus.care"
    },
    {
        "PACKAGENAME": "com.wondertek.paper"
    },
    {
        "PACKAGENAME": "com.leniu.jlsy.huawei"
    },
    {
        "PACKAGENAME": "com.blizzard.wtcg.hearthstone"
    },
    {
        "PACKAGENAME": "com.offcn.mini.teacher"
    },
    {
        "PACKAGENAME": "com.popcap.pvz"
    },
    {
        "PACKAGENAME": "com.tencent.forest"
    },
    {
        "PACKAGENAME": "com.wedobest.xiangqi.huawei"
    },
    {
        "PACKAGENAME": "com.chaozh.ireader.dj"
    },
    {
        "PACKAGENAME": "com.xiaoji.emulator"
    },
    {
        "PACKAGENAME": "com.qcplay.snail.huawei"
    },
    {
        "PACKAGENAME": "com.melestudio.coloringbook.huawei"
    },
    {
        "PACKAGENAME": "com.taobao.qianniu"
    },
    {
        "PACKAGENAME": "com.yunbu.royalwedding.huawei"
    },
    {
        "PACKAGENAME": "com.shark.jizhang"
    },
    {
        "PACKAGENAME": "ai.qianmo.huajiapp"
    },
    {
        "PACKAGENAME": "com.tencent.swy"
    },
    {
        "PACKAGENAME": "com.dj.sevenread"
    },
    {
        "PACKAGENAME": "com.i61.dengta"
    },
    {
        "PACKAGENAME": "com.netease.snailread"
    },
    {
        "PACKAGENAME": "com.ihuman.ibaike"
    },
    {
        "PACKAGENAME": "com.yunbu.cookingchef.huawei"
    },
    {
        "PACKAGENAME": "com.flickering.mathufo"
    },
    {
        "PACKAGENAME": "com.fenbi.android.yingyu"
    },
    {
        "PACKAGENAME": "com.bokecc.dance"
    },
    {
        "PACKAGENAME": "com.wedobest.hdxy.huawei"
    },
    {
        "PACKAGENAME": "com.android.icredit"
    },
    {
        "PACKAGENAME": "com.huoshe.mndwdzz.dzz.huawei"
    },
    {
        "PACKAGENAME": "com.tencent.tgclub"
    },
    {
        "PACKAGENAME": "com.huodao.hdphone"
    },
    {
        "PACKAGENAME": "com.huawei.educenter"
    },
    {
        "PACKAGENAME": "com.dyedu.hxedu"
    },
    {
        "PACKAGENAME": "com.seetong.app.seetong"
    },
    {
        "PACKAGENAME": "com.xiaoyu.yingyu"
    },
    {
        "PACKAGENAME": "com.ss.android.homed"
    },
    {
        "PACKAGENAME": "cn.com.sina.finance"
    },
    {
        "PACKAGENAME": "com.wander.android.wallpaper"
    },
    {
        "PACKAGENAME": "com.outfit7.talkingginger.huawei"
    },
    {
        "PACKAGENAME": "com.suda.yzune.wakeupschedule"
    },
    {
        "PACKAGENAME": "com.amaze.hidebox"
    },
    {
        "PACKAGENAME": "com.gsx.tiku"
    },
    {
        "PACKAGENAME": "com.minitech.miniaixue"
    },
    {
        "PACKAGENAME": "com.wedobest.cyjl.huawei"
    },
    {
        "PACKAGENAME": "com.miga.myapartment.c.huawei"
    },
    {
        "PACKAGENAME": "com.ea.game.pvzfree_row"
    },
    {
        "PACKAGENAME": "com.ekwing.students"
    },
    {
        "PACKAGENAME": "com.lietou.mishu"
    },
    {
        "PACKAGENAME": "ru.zdevs.zarchiver"
    },
    {
        "PACKAGENAME": "com.yipiao"
    },
    {
        "PACKAGENAME": "com.bytxmt.banyuetan"
    },
    {
        "PACKAGENAME": "com.xiaomi.xiaoailite"
    },
    {
        "PACKAGENAME": "com.hihonor.magichome"
    },
    {
        "PACKAGENAME": "com.tencent.qqgame"
    },
    {
        "PACKAGENAME": "com.syzongyi.doudizhu.huawei"
    },
    {
        "PACKAGENAME": "com.excelliance.dualaid"
    },
    {
        "PACKAGENAME": "com.lansi.reading"
    },
    {
        "PACKAGENAME": "com.tencent.af"
    },
    {
        "PACKAGENAME": "com.outfit7.talkingtomjetski2.huawei"
    },
    {
        "PACKAGENAME": "com.ximalaya.ting.kid"
    },
    {
        "PACKAGENAME": "jp.co.canon.bsd.ad.pixmaprint"
    },
    {
        "PACKAGENAME": "com.knew.webbrowser"
    },
    {
        "PACKAGENAME": "com.xiaomi.mico"
    },
    {
        "PACKAGENAME": "com.ct.client"
    },
    {
        "PACKAGENAME": "com.microsoft.math"
    },
    {
        "PACKAGENAME": "com.tencent.cmocmna"
    },
    {
        "PACKAGENAME": "com.ifreetalk.ftalk"
    },
    {
        "PACKAGENAME": "com.hmz.koudaiwriting"
    },
    {
        "PACKAGENAME": "com.faloo.bookreader4android"
    },
    {
        "PACKAGENAME": "com.leleketang.schoolfantasy"
    },
    {
        "PACKAGENAME": "com.jsdw.huochaizzxx.huawei"
    },
    {
        "PACKAGENAME": "com.hegsyz.qqyx.huawei"
    },
    {
        "PACKAGENAME": "com.fingertip.saolei.huawei"
    },
    {
        "PACKAGENAME": "com.yueme.itv"
    },
    {
        "PACKAGENAME": "com.sinyee.babybus.village"
    },
    {
        "PACKAGENAME": "com.ximalaya.ting.lite"
    },
    {
        "PACKAGENAME": "com.vmos.pro"
    },
    {
        "PACKAGENAME": "com.sinyee.babybus.magichouse"
    },
    {
        "PACKAGENAME": "com.xtc.watch"
    },
    {
        "PACKAGENAME": "com.sinyee.babybus.foodstreet"
    },
    {
        "PACKAGENAME": "com.vivo.space"
    },
    {
        "PACKAGENAME": "com.igame.yxwg.lbbwz3.huawei"
    },
    {
        "PACKAGENAME": "com.ailiyong.jojo.chants"
    },
    {
        "PACKAGENAME": "com.suirui.zhumu"
    },
    {
        "PACKAGENAME": "com.bytedance.writer_assistant_flutter"
    },
    {
        "PACKAGENAME": "com.alightcreative.motion"
    },
    {
        "PACKAGENAME": "com.xuexue.ai.english.android.huawei"
    },
    {
        "PACKAGENAME": "com.fenbi.android.gaozhong"
    },
    {
        "PACKAGENAME": "com.sinyee.babybus.dentistii"
    },
    {
        "PACKAGENAME": "com.libii.furrypethospital.game.huawei"
    },
    {
        "PACKAGENAME": "com.tplink.ipc"
    },
    {
        "PACKAGENAME": "com.qzone"
    },
    {
        "PACKAGENAME": "com.vivo.game"
    },
    {
        "PACKAGENAME": "com.sankuai.movie"
    },
    {
        "PACKAGENAME": "com.jd.jrapp"
    },
    {
        "PACKAGENAME": "com.jd.pingou"
    },
    {
        "PACKAGENAME": "com.netease.pm02.nearme.huawei"
    },
    {
        "PACKAGENAME": "com.pokemon.awakening.huawei"
    },
    {
        "PACKAGENAME": "com.ylmf.androidclient"
    },
    {
        "PACKAGENAME": "com.yunxiao.haofenshu"
    },
    {
        "PACKAGENAME": "com.yodo1.sniper3dv2.huawei"
    },
    {
        "PACKAGENAME": "com.jdd.motorfans"
    },
    {
        "PACKAGENAME": "chuxin.shimo.shimowendang"
    },
    {
        "PACKAGENAME": "com.ganji.android.haoche_c"
    },
    {
        "PACKAGENAME": "com.ihuman.story"
    },
    {
        "PACKAGENAME": "com.hihonor.health"
    },
    {
        "PACKAGENAME": "com.wedobest.spiderette.huawei"
    },
    {
        "PACKAGENAME": "com.bf.sgs.hdexp"
    },
    {
        "PACKAGENAME": "com.netease.lztg.huawei"
    },
    {
        "PACKAGENAME": "com.mxtech.videoplayer.pro"
    },
    {
        "PACKAGENAME": "com.youdao.yread"
    },
    {
        "PACKAGENAME": "com.tencent.tmgp.sgamece"
    },
    {
        "PACKAGENAME": "com.sinyee.babybus.dinosauriii"
    },
    {
        "PACKAGENAME": "com.lanjingren.ivwen"
    },
    {
        "PACKAGENAME": "com.jycx.jssc.huawei"
    },
    {
        "PACKAGENAME": "com.ilongyuan.deemo.paid.huawei"
    },
    {
        "PACKAGENAME": "com.ultron.crimaster"
    },
    {
        "PACKAGENAME": "com.lucidagames.kreator.huawei"
    }
]