{
  "dataVersion": "1.1.202406191117",
  "whiteListDomestic": {
    "com.bjbyhd.screenreader_hihonor": "8E7F4143A3065E1A7712E5057B5125EB52BE42BB2DE0AE5AA7004E8EC8F2E1C1",
    "com.hihonor.HnMultiScreenShot": "483013CE65E1B0E10AD76A2EB80409A2A2B8B35EBE81A33B1F6EDD7FACBD64DC",
    "com.hihonor.auto": "483013CE65E1B0E10AD76A2EB80409A2A2B8B35EBE81A33B1F6EDD7FACBD64DC",
    "com.hihonor.awareness": "483013CE65E1B0E10AD76A2EB80409A2A2B8B35EBE81A33B1F6EDD7FACBD64DC",
    "com.hihonor.magicvoice": "483013CE65E1B0E10AD76A2EB80409A2A2B8B35EBE81A33B1F6EDD7FACBD64DC",
    "com.hihonor.collect": "483013CE65E1B0E10AD76A2EB80409A2A2B8B35EBE81A33B1F6EDD7FACBD64DC",
    "com.baidu.input_hihonor": "A6EF817BFD6C083442A149856E51036F6912C2DB6B6009DB8127CDD641E295A9",
    "com.microsoft.appmanager": "E843EE3DA1195D6AFB89CAA3CE7427B08FC01FD878A24FA56E962C35C71D5E70",
    "com.android.tback": "44D7A47A0C51277A5CD25A040B6BFF8A55307913A90F422325F3153D778F34B9",
    "com.bjbyhd.voiceback": "688E27E4ACB7584251FB8E13371F8518E18C63D154CC63E8DA4EC176BF1296F8",
    "com.dianming.phoneapp": "107650B13308E8CBC725A08873AE59EDF7923908BEA3380856A9269465FD5732",
    "com.aaa.xzhd.xzreader.voiceback": "66C88215D3C43867865EE0D1EDFC547207D666A245A6D8F7E84F4A8A998BA369"
  },
  "whiteListOversea": {
    "com.bjbyhd.screenreader_hihonor": "8E7F4143A3065E1A7712E5057B5125EB52BE42BB2DE0AE5AA7004E8EC8F2E1C1",
    "com.hihonor.HnMultiScreenShot": "483013CE65E1B0E10AD76A2EB80409A2A2B8B35EBE81A33B1F6EDD7FACBD64DC",
    "com.google.android.marvin.talkback": "7B5AD55180A48A1F30F35377C0F9E5F911BF942FB4CF83EBA255A0EBF580BEEF",
    "com.microsoft.appmanager": "E843EE3DA1195D6AFB89CAA3CE7427B08FC01FD878A24FA56E962C35C71D5E70",
    "com.google.android.apps.accessibility.voiceaccess": "7A425040828738D0FC0B93C16F3E4E4AC2AA49026100B2D01AEBBC0B557D356E"
  },
  "accessControlOversea": {
    "readData": {
      "id.dana": "9409B0613417FB140F71A5DD8B66EB1A417C946C38BF17601AD33980C23C71E4",
      "com.globe.gcash.android": "07C7869624CE58097F5DF86B7205E90845A099CCFF52A637D2950B62B9146968",
      "my.com.tngdigital.ewallet": "3B041BD01537A9E441151EE47019CF895E4C60D9D563F685F18E94B98C747F01",
      "hk.alipay.wallet": "DFEB190BBCA87EF9EC8D6AD8FF17592F6617B48B6C3BA49A14F7E79D09885AB3"
    },
    "writeData": {
      "com.lazada.android": "F3F30DEC6078B5B92515694B23039778BAE2E159247F456F8AFFC5FEF9BF4DD5"
    }
  }
}