{
    "id": "hntemplate_Dynamic",
    "version": 100000,
    "name": "动感",
    "duration": 13000,
    "timeCreated": 1587956099851,
    "timeModified": 1588045904884,
    "preview": "preview/preview.jpg",
    "previewVideo": "preview/previewVideo.mp4",
    "canvas_config": {
        "ratio": "16:9",
        "width": 1920,
        "height": 1080
    },
    "editTracks": [
        {
            "id": "1vt",
            "type": "video",
            "editSegments": [
                {
                    "id": "1vt1vs",
                    "timeRangeInSource": {
                        "start": 0,
                        "duration": 3200
                    },
                    "timeRangeInTarget": {
                        "start": 0,
                        "duration": 3200
                    },
                    "playSpeed": 1.0,
                    "mirror": false,
                    "reverse": false,
                    "volume": 0,
                    "sizeCut": {
                        "scale": {
                            "x": 1,
                            "y": 1
                        },
                        "rotation": 0,
                        "transform": {
                            "x": 0,
                            "y": 0
                        },
                        "flip": {
                            "horizontal": false,
                            "vertical": false
                        },
                        "alpha": 1
                    },
                    "mainMaterialId": "1v_material_id",
                    "attachedExtraMaterialRefs": ["1trs_material_id"],
                    "render_index": 1,
                    "attachInfo": {
                        "videoId": "",
                        "offset": 0
                    }
                },
                {
                    "id": "1vt2vs",
                    "timeRangeInSource": {
                        "start": 0,
                        "duration": 3300
                    },
                    "timeRangeInTarget": {
                        "start": 3200,
                        "duration": 3300
                    },
                    "playSpeed": 1.0,
                    "mirror": false,
                    "reverse": false,
                    "volume": 0,
                    "sizeCut": {
                        "scale": {
                            "x": 1,
                            "y": 1
                        },
                        "rotation": 0,
                        "transform": {
                            "x": 0,
                            "y": 0
                        },
                        "flip": {
                            "horizontal": false,
                            "vertical": false
                        },
                        "alpha": 1
                    },
                    "mainMaterialId": "2v_material_id",
                    "attachedExtraMaterialRefs": ["1trs_material_id"],
                    "render_index": 1,
                    "attachInfo": {
                        "videoId": "",
                        "offset": 0
                    }
                },
                {
                    "id": "1vt3vs",
                    "timeRangeInSource": {
                        "start": 0,
                        "duration": 3400
                    },
                    "timeRangeInTarget": {
                        "start": 6500,
                        "duration": 3400
                    },
                    "playSpeed": 1.0,
                    "mirror": false,
                    "reverse": false,
                    "volume": 0,
                    "sizeCut": {
                        "scale": {
                            "x": 1,
                            "y": 1
                        },
                        "rotation": 0,
                        "transform": {
                            "x": 0,
                            "y": 0
                        },
                        "flip": {
                            "horizontal": false,
                            "vertical": false
                        },
                        "alpha": 1
                    },
                    "mainMaterialId": "3v_material_id",
                    "attachedExtraMaterialRefs": ["2trs_material_id"],
                    "render_index": 1,
                    "attachInfo": {
                        "videoId": "",
                        "offset": 0
                    }
                },
                {
                    "id": "1vt4vs",
                    "timeRangeInSource": {
                        "start": 0,
                        "duration": 3500
                    },
                    "timeRangeInTarget": {
                        "start": 9500,
                        "duration": 3500
                    },
                    "playSpeed": 1.0,
                    "mirror": false,
                    "reverse": false,
                    "volume": 0,
                    "sizeCut": {
                        "scale": {
                            "x": 1,
                            "y": 1
                        },
                        "rotation": 0,
                        "transform": {
                            "x": 0,
                            "y": 0
                        },
                        "flip": {
                            "horizontal": false,
                            "vertical": false
                        },
                        "alpha": 1
                    },
                    "mainMaterialId": "4v_material_id",
                    "attachedExtraMaterialRefs": [],
                    "render_index": 1,
                    "attachInfo": {
                        "videoId": "",
                        "offset": 0
                    }
                }
            ],
            "flag": 0
        },
        {
            "id": "1at",
            "type": "audio",
            "editSegments": [
                {
                    "id": "1at1as",
                    "timeRangeInSource": {
                        "start": 0,
                        "duration": 13000
                    },
                    "timeRangeInTarget": {
                        "start": 0,
                        "duration": 13000
                    },
                    "playSpeed": 1.0,
                    "mirror": false,
                    "reverse": false,
                    "volume": 1,
                    "sizeCut": {
                        "scale": {
                            "x": 1,
                            "y": 1
                        },
                        "rotation": 0,
                        "transform": {
                            "x": 0,
                            "y": 0
                        },
                        "flip": {
                            "horizontal": false,
                            "vertical": false
                        },
                        "alpha": 1
                    },
                    "mainMaterialId": "1a_material_id",
                    "attachedExtraMaterialRefs": [],
                    "render_index": 1,
                    "attachInfo": {
                        "videoId": "",
                        "offset": 0
                    }
                }
            ],
            "flag": 0
        },
        {
            "id": "1ft",
            "type": "filter",
            "editSegments": [
                {
                    "id": "1ft1fs",
                    "timeRangeInSource": {
                        "start": 0,
                        "duration": 13000
                    },
                    "timeRangeInTarget": {
                        "start": 0,
                        "duration": 13000
                    },
                    "playSpeed": 1.0,
                    "mirror": false,
                    "reverse": false,
                    "volume": 0,
                    "sizeCut": {
                        "scale": {
                            "x": 1,
                            "y": 1
                        },
                        "rotation": 0,
                        "transform": {
                            "x": 0,
                            "y": 0
                        },
                        "flip": {
                            "horizontal": false,
                            "vertical": false
                        },
                        "alpha": 1
                    },
                    "mainMaterialId": "1f_material_id",
                    "attachedExtraMaterialRefs": [],
                    "render_index": 1,
                    "attachInfo": {
                        "videoId": "1v",
                        "offset": 0
                    }
                }
            ],
            "flag": 0
        }
    ],
    "editMaterials": {
        "videos": [
            {
                "id": "1v_material_id",
                "type": "video",
                "duration": 0,
                "path": null,
                "width": 0,
                "height": 0,
                "category_name": null,
                "rotation": 0.0
            },
            {
                "id": "2v_material_id",
                "type": "video",
                "duration": 0,
                "path": null,
                "width": 0,
                "height": 0,
                "category_name": null,
                "rotation": 0.0
            },
            {
                "id": "3v_material_id",
                "type": "video",
                "duration": 0,
                "path": null,
                "width": 0,
                "height": 0,
                "category_name": null,
                "rotation": 0.0
            },
            {
                "id": "4v_material_id",
                "type": "video",
                "duration": 0,
                "path": null,
                "width": 0,
                "height": 0,
                "category_name": null,
                "rotation": 0.0
            }
        ],
        "audios": [
            {
                "id": "1a_material_id",
                "type": "music",
                "duration": 13000,
                "path": "com.hihonor.movietemplate/Resource/music/out.aac",
                "name": "music_name"
            }
        ],
        "effects": [
            {
                "id": "1f_material_id",
                "type": "filter",
                "effect_id": "filter_res_15",
                "name": "milktea",
                "path": "/filters/15/15.jpg",
                "value": 1,
                "category_name": ""
            }
        ],
        "tail_leaders": [
            {
                "id": "1tl_material_id",
                "type": "tail_leader",
                "text": "",
                "index": 0,
                "start": 13000,
                "duration": 1000
            }
        ],
        "transitions": [
            {
                "id": "1trs_material_id",
                "type": "transition",
                "name": "放大",
                "path": "/thepath",
                "duration": 400,
                "is_overlap": false,
                "resource_id": "transition_res_honor_local_zoom_in",
                "category_id": "2001"
            },
            {
                "id": "2trs_material_id",
                "type": "transition",
                "name": "左移",
                "path": "/thepath",
                "duration": 400,
                "is_overlap": true,
                "resource_id": "transition_res_honor_local_move_left",
                "category_id": "2001"
            }
        ]
    }
}