{
  "beat": [
    0,256,448,640,832,992,1216,1472,1664,1824,1984,2144,2336,2784,3040,3200,3488,3680,3904,4384,4576,4832,4992,5152,5312,5632,6016,6304,6464,6784,6944,7264,7616,7776,8064,8384,8544,8800,8992,9184,9344,9504,9664,9952,10272,10624,10784,11008,11264,11712,12416,13184,13408,13600,13792,13952,14144,14368,14560,14752,15040,15200,15392,15616,16032,16288,16608,16800,16992,17152,17408,17632,17792,18016,18176,18400,18560,18720,19008,19232,19392,19552,19872,20064,20288,20736,20896,21056,21248,21440,21600,21792,21952,22144,22432,22624,22816,23008,23200,23456,23616,23840,24064,24320,24512,24704,24864,25088,25248,25472,25792,25984,26208,26400,26592,26752,26944,27104,27392,30038
    ],
  "beat_count": 120,
  "downbeat": [
    0,
    256,
    1472,
    2784,
    4832,
    6464,
    8384,
    9952,
    11712,
    13184,
    14752,
    16032,
    18016,
    19392,
    21056,
    22816,
    24320,
    25792,
    26944,
    28448,
    29952,
    30038
    ],
  "downbeat_count": 22
}