{
  "templateId": "local_frame_wm",
  "categoryId": "honor_classic",
  "titleId": "frame_watermark",
  "templateDescId": "frame_wm_description",
  "templateType": 2,
  "baseOnValue": 6144,
  "borderHeight": 688,
  "thumbnailPath": "/thumbnail.webp",
  "previewPath": "/preview.webp",
  "isEditable": true,
  "status": "local",
  "order":2,
  "foregroundElements": [
    {
      "elementId": "device",
      "isGrouped": false,
      "groupId": -1,
      "order": 1,
      "elementType": "picture",
      "isEditable": false,
      "isEditableForPhoto": true,
      "uiDefaultValue": "on",
      "location": {
        "width": "wrap_content",
        "height": "416",
        "margin": [192, 0, 0, 136],
        "layout_gravity": "left|bottom"
      }
    },
    {
      "elementId": "logo",
      "isGrouped": true,
      "groupId": 0,
      "order": 2,
      "elementType": "picture",
      "isEditable": true,
      "isEditableForPhoto": true,
      "uiDefaultValue": "on",
      "values": [
        {
          "content": "/logo.png"
        }
      ]
    },
    {
      "elementId": "lens",
      "isGrouped": true,
      "groupId": 0,
      "order": 3,
      "defaultValue": "27mm  f/1.9  1/100s  ISO1600",
      "elementType": "text",
      "isEditable": false,
      "isEditableForPhoto": false,
      "uiDefaultValue": "on"
    },
    {
      "elementId": "time",
      "isGrouped": true,
      "groupId": 0,
      "order": 4,
      "defaultValue": "2024/06/01 08:00 GMT+08:00",
      "elementType": "text",
      "isEditable": true,
      "isEditableForPhoto": true,
      "uiDefaultValue": "on"
    },
    {
      "elementId": "location",
      "isGrouped": true,
      "groupId": 0,
      "order": 5,
      "defaultValue": "北京市海淀区",
      "elementType": "text",
      "isEditable": true,
      "isEditableForPhoto": true,
      "uiDefaultValue": "on"
    }
  ],
  "backgroundElements": [
    {
      "elementId": "white_bottom_border",
      "elementType": "type_solid_color",
      "order": 1,
      "isEnable": true,
      "location": {
        "width": "match_parent",
        "height": "688"
      },
      "paintAttr": {
        "color": "#FFFFFF",
        "alpha": 1
      }
    }
  ],
  "regionalGroups": [
    {
      "regionalId": "logo,lens,time,location",
      "widthRange": {
        "id": "device",
        "range": [0, 2680]
      },
      "layoutGroups": [
        {
          "elementId": "logo,lens,time,location",
          "orientation": "horizontal",
          "location": {
            "width": "wrap_content",
            "height": "688",
            "margin": [0, 0, 192, 0],
            "layout_gravity": "right|bottom"
          },
          "elements": [
            {
              "elementId": "logo",
              "location": {
                "width": "wrap_content",
                "height": "388",
                "margin": [0, 0, 0, 0],
                "layout_gravity": "center"
              }
            },
            {
              "elementId": "lens,time,location",
              "orientation": "vertical",
              "location": {
                "width": "wrap_content",
                "height": "wrap_content",
                "margin": [88, 0, 0, 0]
              },
              "elements": [
                {
                  "elementId": "lens",
                  "location": {
                    "width": "wrap_content",
                    "height": "159",
                    "margin": [0, 201, 0, 0]
                  },
                  "paintAttr": {
                    "color": "#000000",
                    "font": "/system/fonts/HONORSansVFCN.ttf",
                    "fontVariationSettings": "'wght' 400",
                    "baseline": 126,
                    "size": 136
                  }
                },
                {
                  "elementId": "time,location",
                  "orientation": "horizontal",
                  "location": {
                    "width": "wrap_content",
                    "height": "wrap_content",
                    "margin": [0, 4, 0, 0],
                    "maxWidth":2344
                  },
                  "elements": [
                    {
                      "elementId": "time",
                      "location": {
                        "width": "wrap_content",
                        "height": "145",
                        "margin": [0, 0, 0, 0]
                      },
                      "paintAttr": {
                        "color": "#999999",
                        "font": "/system/fonts/HONORSansVFCN.ttf",
                        "fontVariationSettings": "'wght' 300",
                        "baseline": 110,
                        "size": 104
                      }
                    },
                    {
                      "elementId": "location",
                      "location": {
                        "width": "wrap_content",
                        "height": "145",
                        "margin": [46, 0, 0, 0]
                      },
                      "paintAttr": {
                        "color": "#999999",
                        "font": "/system/fonts/HONORSansVFCN.ttf",
                        "fontVariationSettings": "'wght' 300",
                        "baseline": 110,
                        "size": 104
                      }
                    }
                  ]
                }
              ]
            }
          ]
        },
        {
          "elementId": "logo,lens,time",
          "orientation": "horizontal",
          "location": {
            "width": "wrap_content",
            "height": "688",
            "margin": [0, 0, 192, 0],
            "layout_gravity": "right|bottom"
          },
          "elements": [
            {
              "elementId": "logo",
              "location": {
                "width": "wrap_content",
                "height": "388",
                "margin": [0, 0, 0, 0],
                "layout_gravity": "center"
              }
            },
            {
              "elementId": "lens,time",
              "orientation": "vertical",
              "location": {
                "width": "wrap_content",
                "height": "wrap_content",
                "margin": [88, 0, 0, 0]
              },
              "elements": [
                {
                  "elementId": "lens",
                  "location": {
                    "width": "wrap_content",
                    "height": "159",
                    "margin": [0, 201, 0, 0]
                  },
                  "paintAttr": {
                    "color": "#000000",
                    "font": "/system/fonts/HONORSansVFCN.ttf",
                    "fontVariationSettings": "'wght' 400",
                    "baseline": 126,
                    "size": 136
                  }
                },
                {
                  "elementId": "time",
                  "location": {
                    "width": "wrap_content",
                    "height": "145",
                    "margin": [0, 4, 0, 0]
                  },
                  "paintAttr": {
                    "color": "#999999",
                    "font": "/system/fonts/HONORSansVFCN.ttf",
                    "fontVariationSettings": "'wght' 300",
                    "baseline": 110,
                    "size": 104
                  }
                }
              ]
            }
          ]
        },
        {
          "elementId": "logo,lens,location",
          "orientation": "horizontal",
          "location": {
            "width": "wrap_content",
            "height": "688",
            "margin": [0, 0, 192, 0],
            "layout_gravity": "right|bottom"
          },
          "elements": [
            {
              "elementId": "logo",
              "location": {
                "width": "wrap_content",
                "height": "388",
                "margin": [0, 0, 0, 0],
                "layout_gravity": "center"
              }
            },
            {
              "elementId": "lens,location",
              "orientation": "vertical",
              "location": {
                "width": "wrap_content",
                "height": "wrap_content",
                "margin": [88, 0, 0, 0]
              },
              "elements": [
                {
                  "elementId": "lens",
                  "location": {
                    "width": "wrap_content",
                    "height": "159",
                    "margin": [0, 201, 0, 0]
                  },
                  "paintAttr": {
                    "color": "#000000",
                    "font": "/system/fonts/HONORSansVFCN.ttf",
                    "fontVariationSettings": "'wght' 400",
                    "baseline": 126,
                    "size": 136
                  }
                },
                {
                  "elementId": "location",
                  "location": {
                    "width": "wrap_content",
                    "height": "145",
                    "margin": [0, 4, 0, 0],
                    "maxWidth":2344
                  },
                  "paintAttr": {
                    "color": "#999999",
                    "font": "/system/fonts/HONORSansVFCN.ttf",
                    "fontVariationSettings": "'wght' 300",
                    "baseline": 110,
                    "size": 104
                  }
                }
              ]
            }
          ]
        },
        {
          "elementId": "logo,lens",
          "orientation": "horizontal",
          "location": {
            "width": "wrap_content",
            "height": "688",
            "margin": [0, 0, 192, 0],
            "layout_gravity": "right|bottom"
          },
          "elements": [
            {
              "elementId": "logo",
              "location": {
                "width": "wrap_content",
                "height": "388",
                "margin": [0, 0, 0, 0],
                "layout_gravity": "center"
              }
            },
            {
              "elementId": "lens",
              "location": {
                "width": "wrap_content",
                "height": "210",
                "margin": [88, 239, 0, 0]
              },
              "paintAttr": {
                "color": "#000000",
                "font": "/system/fonts/HONORSansVFCN.ttf",
                "fontVariationSettings": "'wght' 400",
                "baseline": 159,
                "size": 150
              }
            }
          ]
        },
        {
          "elementId": "lens,time,location",
          "orientation": "vertical",
          "location": {
            "width": "wrap_content",
            "height": "wrap_content",
            "margin": [0, 0, 192, 184],
            "layout_gravity": "right|bottom"
          },
          "elements": [
            {
              "elementId": "lens",
              "location": {
                "width": "wrap_content",
                "height": "159",
                "margin": [0, 0, 0, 0],
                "layout_gravity": "right"
              },
              "paintAttr": {
                "color": "#000000",
                "font": "/system/fonts/HONORSansVFCN.ttf",
                "fontVariationSettings": "'wght' 400",
                "baseline": 126,
                "size": 136
              }
            },
            {
              "elementId": "time,location",
              "orientation": "horizontal",
              "location": {
                "width": "wrap_content",
                "height": "wrap_content",
                "margin": [0, 4, 0, 0],
                "layout_gravity": "right",
                "maxWidth":2344
              },
              "elements": [
                {
                  "elementId": "time",
                  "location": {
                    "width": "wrap_content",
                    "height": "145",
                    "margin": [0, 0, 0, 0]
                  },
                  "paintAttr": {
                    "color": "#999999",
                    "font": "/system/fonts/HONORSansVFCN.ttf",
                    "fontVariationSettings": "'wght' 300",
                    "baseline": 110,
                    "size": 104
                  }
                },
                {
                  "elementId": "location",
                  "location": {
                    "width": "wrap_content",
                    "height": "145",
                    "margin": [46, 0, 0, 0]
                  },
                  "paintAttr": {
                    "color": "#999999",
                    "font": "/system/fonts/HONORSansVFCN.ttf",
                    "fontVariationSettings": "'wght' 300",
                    "baseline": 110,
                    "size": 104
                  }
                }
              ]
            }
          ]
        },
        {
          "elementId": "lens,time",
          "orientation": "vertical",
          "location": {
            "width": "wrap_content",
            "height": "wrap_content",
            "margin": [0, 0, 192, 184],
            "layout_gravity": "right|bottom"
          },
          "elements": [
            {
              "elementId": "lens",
              "location": {
                "width": "wrap_content",
                "height": "159",
                "margin": [0, 0, 0, 0],
                "layout_gravity": "right"
              },
              "paintAttr": {
                "color": "#000000",
                "font": "/system/fonts/HONORSansVFCN.ttf",
                "fontVariationSettings": "'wght' 400",
                "baseline": 126,
                "size": 136
              }
            },
            {
              "elementId": "time",
              "location": {
                "width": "wrap_content",
                "height": "145",
                "margin": [0, 4, 0, 0],
                "layout_gravity": "right"
              },
              "paintAttr": {
                "color": "#999999",
                "font": "/system/fonts/HONORSansVFCN.ttf",
                "fontVariationSettings": "'wght' 300",
                "baseline": 110,
                "size": 104
              }
            }
          ]
        },
        {
          "elementId": "lens,location",
          "orientation": "vertical",
          "location": {
            "width": "wrap_content",
            "height": "wrap_content",
            "margin": [0, 0, 192, 184],
            "layout_gravity": "right|bottom"
          },
          "elements": [
            {
              "elementId": "lens",
              "location": {
                "width": "wrap_content",
                "height": "159",
                "margin": [0, 0, 0, 0],
                "layout_gravity": "right"
              },
              "paintAttr": {
                "color": "#000000",
                "font": "/system/fonts/HONORSansVFCN.ttf",
                "fontVariationSettings": "'wght' 400",
                "baseline": 126,
                "size": 136
              }
            },
            {
              "elementId": "location",
              "location": {
                "width": "wrap_content",
                "height": "145",
                "margin": [0, 4, 0, 0],
                "layout_gravity": "right",
                "maxWidth":2344
              },
              "paintAttr": {
                "color": "#999999",
                "font": "/system/fonts/HONORSansVFCN.ttf",
                "fontVariationSettings": "'wght' 300",
                "baseline": 110,
                "size": 104
              }
            }
          ]
        },
        {
          "elementId": "lens",
          "location": {
            "width": "wrap_content",
            "height": "210",
            "margin": [0, 0, 192, 239],
            "layout_gravity": "right|bottom"
          },
          "paintAttr": {
            "color": "#000000",
            "font": "/system/fonts/HONORSansVFCN.ttf",
            "fontVariationSettings": "'wght' 400",
            "baseline": 159,
            "size": 150
          }
        }
      ]
    },
    {
      "regionalId": "logo,lens,time,location",
      "widthRange": {
        "id": "device",
        "range": [2680, 6144]
      },
      "layoutGroups": [
        {
          "elementId": "logo,lens,time,location",
          "orientation": "horizontal",
          "location": {
            "width": "wrap_content",
            "height": "688",
            "margin": [0, 0, 192, 0],
            "layout_gravity": "right|bottom"
          },
          "elements": [
            {
              "elementId": "logo",
              "location": {
                "width": "wrap_content",
                "height": "388",
                "margin": [0, 0, 0, 0],
                "layout_gravity": "center"
              }
            },
            {
              "elementId": "lens,time,location",
              "orientation": "vertical",
              "location": {
                "width": "wrap_content",
                "height": "wrap_content",
                "margin": [88, 0, 0, 0]
              },
              "elements": [
                {
                  "elementId": "lens",
                  "location": {
                    "width": "wrap_content",
                    "height": "140",
                    "margin": [0, 192, 0, 0]
                  },
                  "paintAttr": {
                    "color": "#000000",
                    "font": "/system/fonts/HONORSansVFCN.ttf",
                    "fontVariationSettings": "'wght' 400",
                    "baseline": 126,
                    "size": 120
                  }
                },
                {
                  "elementId": "time,location",
                  "orientation": "horizontal",
                  "location": {
                    "width": "wrap_content",
                    "height": "wrap_content",
                    "margin": [0, 24, 0, 0],
                    "maxWidth": 2100
                  },
                  "elements": [
                    {
                      "elementId": "time",
                      "location": {
                        "width": "wrap_content",
                        "height": "112",
                        "margin": [0, 0, 0, 0]
                      },
                      "paintAttr": {
                        "color": "#999999",
                        "font": "/system/fonts/HONORSansVFCN.ttf",
                        "fontVariationSettings": "'wght' 300",
                        "baseline": 110,
                        "size": 93
                      }
                    },
                    {
                      "elementId": "location",
                      "location": {
                        "width": "wrap_content",
                        "height": "112",
                        "margin": [46, 0, 0, 0]
                      },
                      "paintAttr": {
                        "color": "#999999",
                        "font": "/system/fonts/HONORSansVFCN.ttf",
                        "fontVariationSettings": "'wght' 300",
                        "baseline": 110,
                        "size": 93
                      }
                    }
                  ]
                }
              ]
            }
          ]
        },
        {
          "elementId": "logo,lens,time",
          "orientation": "horizontal",
          "location": {
            "width": "wrap_content",
            "height": "688",
            "margin": [0, 0, 192, 0],
            "layout_gravity": "right|bottom"
          },
          "elements": [
            {
              "elementId": "logo",
              "location": {
                "width": "wrap_content",
                "height": "388",
                "margin": [0, 0, 0, 0],
                "layout_gravity": "center"
              }
            },
            {
              "elementId": "lens,time",
              "orientation": "vertical",
              "location": {
                "width": "wrap_content",
                "height": "wrap_content",
                "margin": [88, 0, 0, 0]
              },
              "elements": [
                {
                  "elementId": "lens",
                  "location": {
                    "width": "wrap_content",
                    "height": "140",
                    "margin": [0, 192, 0, 0]
                  },
                  "paintAttr": {
                    "color": "#000000",
                    "font": "/system/fonts/HONORSansVFCN.ttf",
                    "fontVariationSettings": "'wght' 400",
                    "baseline": 126,
                    "size": 120
                  }
                },
                {
                  "elementId": "time",
                  "location": {
                    "width": "wrap_content",
                    "height": "112",
                    "margin": [0, 24, 0, 0]
                  },
                  "paintAttr": {
                    "color": "#999999",
                    "font": "/system/fonts/HONORSansVFCN.ttf",
                    "fontVariationSettings": "'wght' 300",
                    "baseline": 110,
                    "size": 93
                  }
                }
              ]
            }
          ]
        },
        {
          "elementId": "logo,lens,location",
          "orientation": "horizontal",
          "location": {
            "width": "wrap_content",
            "height": "688",
            "margin": [0, 0, 192, 0],
            "layout_gravity": "right|bottom"
          },
          "elements": [
            {
              "elementId": "logo",
              "location": {
                "width": "wrap_content",
                "height": "388",
                "margin": [ 0, 0, 0, 0],
                "layout_gravity": "center"
              }
            },
            {
              "elementId": "lens,location",
              "orientation": "vertical",
              "location": {
                "width": "wrap_content",
                "height": "wrap_content",
                "margin": [88, 0, 0, 0]
              },
              "elements": [
                {
                  "elementId": "lens",
                  "location": {
                    "width": "wrap_content",
                    "height": "140",
                    "margin": [0, 192, 0, 0]
                  },
                  "paintAttr": {
                    "color": "#000000",
                    "font": "/system/fonts/HONORSansVFCN.ttf",
                    "fontVariationSettings": "'wght' 400",
                    "baseline": 126,
                    "size": 120
                  }
                },
                {
                  "elementId": "location",
                  "location": {
                    "width": "wrap_content",
                    "height": "112",
                    "margin": [0, 24, 0, 0],
                    "maxWidth": 2100
                  },
                  "paintAttr": {
                    "color": "#999999",
                    "font": "/system/fonts/HONORSansVFCN.ttf",
                    "fontVariationSettings": "'wght' 300",
                    "baseline": 110,
                    "size": 93
                  }
                }
              ]
            }
          ]
        },
        {
          "elementId": "logo,lens",
          "orientation": "horizontal",
          "location": {
            "width": "wrap_content",
            "height": "688",
            "margin": [0, 0, 192, 0],
            "layout_gravity": "right|bottom"
          },
          "elements": [
            {
              "elementId": "logo",
              "location": {
                "width": "wrap_content",
                "height": "388",
                "margin": [0, 0, 0, 0],
                "layout_gravity": "center"
              }
            },
            {
              "elementId": "lens",
              "location": {
                "width": "wrap_content",
                "height": "162",
                "margin": [88, 263, 0, 0]
              },
              "paintAttr": {
                "color": "#000000",
                "font": "/system/fonts/HONORSansVFCN.ttf",
                "fontVariationSettings": "'wght' 400",
                "baseline": 123,
                "size": 116
              }
            }
          ]
        },
        {
          "elementId": "lens,time,location",
          "orientation": "vertical",
          "location": {
            "width": "wrap_content",
            "height": "wrap_content",
            "margin": [0, 0, 192, 220],
            "layout_gravity": "right|bottom"
          },
          "elements": [
            {
              "elementId": "lens",
              "location": {
                "width": "wrap_content",
                "height": "140",
                "margin": [0, 0, 0, 0],
                "layout_gravity": "right"
              },
              "paintAttr": {
                "color": "#000000",
                "font": "/system/fonts/HONORSansVFCN.ttf",
                "fontVariationSettings": "'wght' 400",
                "baseline": 126,
                "size": 120
              }
            },
            {
              "elementId": "time,location",
              "orientation": "horizontal",
              "location": {
                "width": "wrap_content",
                "height": "wrap_content",
                "margin": [0, 24, 0, 0],
                "layout_gravity": "right",
                "maxWidth": 2100
              },
              "elements": [
                {
                  "elementId": "time",
                  "location": {
                    "width": "wrap_content",
                    "height": "112",
                    "margin": [0, 0, 0, 0]
                  },
                  "paintAttr": {
                    "color": "#999999",
                    "font": "/system/fonts/HONORSansVFCN.ttf",
                    "fontVariationSettings": "'wght' 300",
                    "baseline": 110,
                    "size": 93
                  }
                },
                {
                  "elementId": "location",
                  "location": {
                    "width": "wrap_content",
                    "height": "112",
                    "margin": [46, 0, 0, 0]
                  },
                  "paintAttr": {
                    "color": "#999999",
                    "font": "/system/fonts/HONORSansVFCN.ttf",
                    "fontVariationSettings": "'wght' 300",
                    "baseline": 110,
                    "size": 93
                  }
                }
              ]
            }
          ]
        },
        {
          "elementId": "lens,time",
          "orientation": "vertical",
          "location": {
            "width": "wrap_content",
            "height": "wrap_content",
            "margin": [0, 0, 192, 220],
            "layout_gravity": "right|bottom"
          },
          "elements": [
            {
              "elementId": "lens",
              "location": {
                "width": "wrap_content",
                "height": "140",
                "margin": [0, 0, 0, 0],
                "layout_gravity": "right"
              },
              "paintAttr": {
                "color": "#000000",
                "font": "/system/fonts/HONORSansVFCN.ttf",
                "fontVariationSettings": "'wght' 400",
                "baseline": 126,
                "size": 120
              }
            },
            {
              "elementId": "time",
              "location": {
                "width": "wrap_content",
                "height": "112",
                "margin": [0, 24, 0, 0],
                "layout_gravity": "right"
              },
              "paintAttr": {
                "color": "#999999",
                "font": "/system/fonts/HONORSansVFCN.ttf",
                "fontVariationSettings": "'wght' 300",
                "baseline": 110,
                "size": 93
              }
            }
          ]
        },
        {
          "elementId": "lens,location",
          "orientation": "vertical",
          "location": {
            "width": "wrap_content",
            "height": "wrap_content",
            "margin": [0, 0, 192, 220],
            "layout_gravity": "right|bottom"
          },
          "elements": [
            {
              "elementId": "lens",
              "location": {
                "width": "wrap_content",
                "height": "140",
                "margin": [0, 0, 0, 0],
                "layout_gravity": "right"
              },
              "paintAttr": {
                "color": "#000000",
                "font": "/system/fonts/HONORSansVFCN.ttf",
                "fontVariationSettings": "'wght' 400",
                "baseline": 126,
                "size": 120
              }
            },
            {
              "elementId": "location",
              "location": {
                "width": "wrap_content",
                "height": "112",
                "margin": [0, 24, 0, 0],
                "layout_gravity": "right",
                "maxWidth": 2100
              },
              "paintAttr": {
                "color": "#999999",
                "font": "/system/fonts/HONORSansVFCN.ttf",
                "fontVariationSettings": "'wght' 300",
                "baseline": 110,
                "size": 93
              }
            }
          ]
        },
        {
          "elementId": "lens",
          "location": {
            "width": "wrap_content",
            "height": "162",
            "margin": [0, 0, 192, 263],
            "layout_gravity": "right|bottom"
          },
          "paintAttr": {
            "color": "#000000",
            "font": "/system/fonts/HONORSansVFCN.ttf",
            "fontVariationSettings": "'wght' 400",
            "baseline": 123,
            "size": 116
          }
        }
      ]
    }
  ]
}
