{
	"type":"DynamicCapsule",
	"subType":"ELP-AN00",
	"params":[
		{
			"name":"capsuleduration",
			"type":"list",
			"value":"{\"capsuleduration\":[{\"name\":\"capsule_extreme_tolerance_control\",\"value\":\"true\"},{\"name\":\"capsule_extreme_tolerance_time\",\"value\":\"3600000\"}]}"
		}
	],
	"compatibleversion":"1"
}