{
	"type":"SmartVideoCreation",
	"subType":"FCP-AN10",
	"params":[
		{
			"name":"kill_memory_threshold",
			"type":"list",
			"value":"{\"kill_memory_threshold\":[\"1634\"]}"
		},
		{
			"name":"smart_video_creation",
			"type":"bool",
			"value":"false"
		}
	],
	"compatibleversion":"1"
}