{
  "beat": [
    0,192,352,512,672,1056,1312,1472,1696,1888,2048,2240,2496,2784,2944,3136,3360,3584,3936,4256,4608,4928,5152,5376,5536,5696,5888,6144,6304,6464,6784,7168,7328,7552,7808,8031,8192,8512,8672,8864,9056,9280,9472,9664,10048,10208,10400,10592,10752,10976,11168,11456,11616,11808,11968,12160,12320,12544,12736,12960,13248,13472,13632,13792,13984,14144,14304,14496,14656,14848,15072,15328,15488,15744,15904,16160,16320,16480,16640,16832,17056,17216,17440,17600,17760,17920,18080,18240,18400,18560,18784,19040,19328,19552,19712,19936,20128,20320,20480,20640,20832,21024,21216,21504,21760,21984,22240,22560,22720,22880,23040,23264,23424,23680,23936,24096,24288,24544,24704,24896,25056,25216,25376,25600,25824,25984,26144,26336,26528,26720,26912,27072,27232,27456,27616,27808,28000,28192,28352,28512,28704,29152,30038
    ],
  "beat_count": 143,
  "downbeat": [
    0,
    2784,
    4256,
    5696,
    7168,
    8960,
    10752,
    13632,
    15488,
    17216,
    18784,
    21504,
    23264,
    25056,
    27072,
    30038
    ],
  "downbeat_count": 16
}