{
  "templateId": "local_default_wm",
  "categoryId": "honor_classic",
  "titleId": "text_watermark",
  "templateDescId": "text_wm_description",
  "templateType": 1,
  "baseOnValue": 6144,
  "thumbnailPath": "/thumbnail.webp",
  "previewPath": "/preview.webp",
  "isEditable": true,
  "status": "local",
  "order":1,
  "foregroundElements": [
    {
      "elementId": "device",
      "order": 0,
      "isGrouped": false,
      "groupId": -1,
      "elementType": "picture",
      "isEditable": true,
      "isEditableForPhoto": true,
      "uiDefaultValue": "on",
      "location": {
        "width": "wrap_content",
        "height": "464",
        "margin": [304, 0, 0, 176],
        "layout_gravity": "left|bottom"
      }
    },
    {
      "elementId": "time",
      "order": 1,
      "defaultValue": "2024/06/01 08:00 GMT+08:00",
      "isGrouped": true,
      "groupId": 0,
      "elementType": "text",
      "isEditable": true,
      "isEditableForPhoto": true,
      "uiDefaultValue": "off"
    },
    {
      "elementId": "location",
      "order": 2,
      "defaultValue": "北京市海淀区",
      "isGrouped": true,
      "groupId": 0,
      "elementType": "text",
      "isEditable": true,
      "isEditableForPhoto": true,
      "uiDefaultValue": "off"
    }
  ],
  "regionalGroups": [
    {
      "regionalId": "time,location",
      "widthRange": {
        "id": "device",
        "range": [0, 3072]
      },
      "layoutGroups": [
        {
          "elementId": "time,location",
          "orientation": "vertical",
          "location": {
            "width": "wrap_content",
            "height": "wrap_content",
            "margin": [0, 0, 304, 112],
            "layout_gravity": "right|bottom"
          },
          "elements": [
            {
              "elementId": "time",
              "location": {
                "width": "wrap_content",
                "height": "197",
                "margin": [0, 0, 0, 0],
                "layout_gravity": "right"
              },
              "paintAttr": {
                "color": "#FFFFFF",
                "font": "/system/fonts/HONORSansVFCN.ttf",
                "fontVariationSettings": "'wght' 300",
                "baseline": 156,
                "size": 168
              }
            },
            {
              "elementId": "location",
              "location": {
                "width": "wrap_content",
                "height": "213",
                "margin": [0, -21, 0, 0],
                "layout_gravity": "right",
                "maxWidth":2616
              },
              "paintAttr": {
                "color": "#FFFFFF",
                "font": "/system/fonts/HONORSansVFCN.ttf",
                "fontVariationSettings": "'wght' 300",
                "baseline": 161,
                "size": 152
              }
            }
          ]
        },
        {
          "elementId": "time",
          "location": {
            "width": "wrap_content",
            "height": "216",
            "margin": [0, 0, 304, 192],
            "layout_gravity": "right|bottom"
          },
          "paintAttr": {
            "color": "#FFFFFF",
            "font": "/system/fonts/HONORSansVFCN.ttf",
            "fontVariationSettings": "'wght' 300",
            "baseline": 171,
            "size": 184
          }
        },
        {
          "elementId": "location",
          "location": {
            "width": "wrap_content",
            "height": "258",
            "margin": [0, 0, 304, 192],
            "layout_gravity": "right|bottom",
            "maxWidth":2616
          },
          "paintAttr": {
            "color": "#FFFFFF",
            "font": "/system/fonts/HONORSansVFCN.ttf",
            "fontVariationSettings": "'wght' 300",
            "baseline": 195,
            "size": 184
          }
        }
      ]
    },
    {
      "regionalId": "time,location",
      "widthRange": {
        "id": "device",
        "range": [3072, 6144]
      },
      "layoutGroups": [
        {
          "elementId": "time,location",
          "orientation": "vertical",
          "location": {
            "width": "wrap_content",
            "height": "wrap_content",
            "margin": [0, 0, 304, 152],
            "layout_gravity": "right|bottom"
          },
          "elements": [
            {
              "elementId": "time",
              "location": {
                "width": "wrap_content",
                "height": "169",
                "margin": [0, 0, 0, 0],
                "layout_gravity": "right"
              },
              "paintAttr": {
                "color": "#FFFFFF",
                "font": "/system/fonts/HONORSansVFCN.ttf",
                "fontVariationSettings": "'wght' 300",
                "baseline": 134,
                "size": 144
              }
            },
            {
              "elementId": "location",
              "location": {
                "width": "wrap_content",
                "height": "180",
                "margin": [0, -4, 0, 0],
                "layout_gravity": "right",
                "maxWidth":1996
              },
              "paintAttr": {
                "color": "#FFFFFF",
                "font": "/system/fonts/HONORSansVFCN.ttf",
                "fontVariationSettings": "'wght' 300",
                "baseline": 136,
                "size": 128
              }
            }
          ]
        },
        {
          "elementId": "time",
          "location": {
            "width": "wrap_content",
            "height": "169",
            "margin": [0, 0, 304, 232],
            "layout_gravity": "right|bottom"
          },
          "paintAttr": {
            "color": "#FFFFFF",
            "font": "/system/fonts/HONORSansVFCN.ttf",
            "fontVariationSettings": "'wght' 300",
            "baseline": 134,
            "size": 144
          }
        },
        {
          "elementId": "location",
          "location": {
            "width": "wrap_content",
            "height": "202",
            "margin": [0, 0, 304, 216],
            "layout_gravity": "right|bottom",
            "maxWidth":1996
          },
          "paintAttr": {
            "color": "#FFFFFF",
            "font": "/system/fonts/HONORSansVFCN.ttf",
            "fontVariationSettings": "'wght' 300",
            "baseline": 153,
            "size": 140
          }
        }
      ]
    }
  ]
}
