{
  "noticePolicy": {
    "dialogWarning":{
      "rules": ["middle", "high"],
      "app": []
    },
    "relativeNotice": {
      "rules": ["high"],
      "app": []
    }
  },
  "products": {
    "phone": ["WDY", "REA", "REP", "CRT", "ALI", "VER", "VES", "YOR", "ANN", "AGT", "ANP", "ANB", "MGI", "LGE", "PGT", "FRI", "TNA", "NTH", "ELZ", "ADT", "RMO", "MAA", "BVL", "JLH", "GIA", "DIO", "BRP", "LYN", "BRC", 
      "ELI", "ELP", "LLY", "LRA", "FLC", "FCP", "PTP"],
    "version": ["ALL"]
  },
  "interval": 3600,
  "honorNumber": { 
    "interceptLevel": ["high"],
    "markCount": {
      "high": 50,
      "mid": 0,
      "low": 0
    }
  },
  "psiSetting": {
    "enable": false,
    "bitLength":16
  },
  "reportPolicy": {
    "delayDay": 3,
    "category": [2, 3, 4, 5, 6, 8, 9, 11, 12, 13, 14, 16, 17, 21, 22 ,23, 24, 26, 27, 50, 100, 101, 102, 200, 201, 202, 203, 204, 205, 206, 300]
  },
  "smsProducts": { 
    "phone": ["ALL"],
    "version": ["8.0", "8.0.1", "9.0"]
  },
  "smsCloudQuery": ["(((\\+86)|(86))?[1][3-9]\\d{9})"]
}