a69abd226b0d49442c8de200e0900fad3bb036692b0e82905a121930f7e4fa0e vendor.honor.hardware.activity_recognition@1.0::types
cce757f96fa286a352cbed37eaf36d8c23621785368481d3153cfa382eefc2df vendor.honor.hardware.activity_recognition@1.0::IActivityChangedCallback
99419e4117796604f31391d46f8ded4a3db4a59081c156207514990a20c03f31 vendor.honor.hardware.activity_recognition@1.0::IActivityInterface
368e901afdc76b05a25295431929d75dbb116f3652e7a898fd0c5cd56bd2e046 vendor.honor.hardware.activity_recognition@1.0::IActivityRecognition
fb9e2681393028c639c6d96b106e2af481ece4a1aa44cc1c4d641f53f7ecf2b3 vendor.honor.hardware.activity_recognition@1.0::IEnvironmentChangedCallback
78d46e9ab00890d1203d2de06537e55e1a1d5196f736f42e29e2c5f27e7b38d5 vendor.honor.hardware.activity_recognition@1.0::IEnvironmentInterface
82951589263b8c89e712130b4b3963e4d2b1e4b0e4778258bc435463c1b7598d vendor.honor.hardware.activity_recognition@1.1::types
138de943d288c66ca8beafd02844db2f155c3ba9a65fcb0b02fdcda3268a3ac8 vendor.honor.hardware.activity_recognition@1.1::IActivityChangedCallback
b4e6dcf368f6bb224a3e026c9f2d901165509a98cb4ad9cf3f0e9ef69316bf6f vendor.honor.hardware.activity_recognition@1.1::IActivityInterface
6db2d42256ed60061a6f0ade1e489adc4af61e643fd2a9edb96f6716e554acd9 vendor.honor.hardware.activity_recognition@1.1::IActivityRecognition
44aee77bd48631885d29c96c351f340350f939e4eef121c2b453a57c4ef35b7f vendor.honor.hardware.activity_recognition@1.1::IEnvironmentChangedCallback
f5441017179c6a79319727f3e644f28291a5605359d318789a8793ad421b0a7b vendor.honor.hardware.activity_recognition@1.1::IEnvironmentInterface
8c1d2cb3e6ea7d05ec203dd6a35af6b1aa15fe5bb0d4246bcdd63d39ec3342ac vendor.honor.hardware.aiservice@1.0::types
bcfae5f9a53a1d34ce12148c25ce6c08bc5a288fa2130069ef1006a199baf722 vendor.honor.hardware.aiservice@1.0::IAiService
cd403d6058085b03829448f7ecac616b9c1c3f2e36a7cac32933f201d543fdd7 vendor.honor.hardware.aiservice@1.0::IAiServiceListener
855da091795745c09e65b598027459ca63f048ea6f451035894434c99f2742f3 vendor.honor.hardware.aoservice@1.0::types
6968d16bf9efa1ace0047aea4a3f88f7f73996827ae6686b6ab3c86d789a31a7 vendor.honor.hardware.aoservice@1.0::IAOService
c5eef70474fc7da6e3011ce87ec897c9d231aef4c1bf31e0c5554fb1f070e18c vendor.honor.hardware.aoservice@1.0::IAOServiceListener
640c97fb010a3b492c9d137f0f4de2b99cfff23531c972467b3bf2ac076db5e9 vendor.honor.hardware.audioremote@1.0::types
38489427f57f5c6f6d6ca2823583ea89d2f1a3fd0ca516732408d8835ea69911 vendor.honor.hardware.audioremote@1.0::IAudioRemoteConnect
2a0ca8b874b903276ccedb7d1435c2ea733fb95fa42d718a8f27fa1f4a12d877 vendor.honor.hardware.audioremote@1.0::IAudioRemoteConnectCallback
791bdef953a1afe0b0d28840668c9488393a89d8de699339ccdf321698e0d917 vendor.honor.hardware.audioremote@1.1::types
83d0f289d12efbd12d905ef35f76b4e1569932681ec0f31094fef6266c4f3541 vendor.honor.hardware.audioremote@1.1::IAudioRemoteConnect
7b1d06b4c85f0163b862f0d78868efd0eb1aa9447f08bbe70e2a5fb63dc9c521 vendor.honor.hardware.audioremote@1.1::IAudioRemoteConnectCallback
95f48195b12169ca8c5df04d496abd707c18b34b152c815fed679619c0b20567 vendor.honor.hardware.audioremote@1.2::types
301129a7b388bc324428b1b041749635692a67d472d3a7a4ae7ea6a78430ba7f vendor.honor.hardware.audioremote@1.2::IAudioRemoteConnect
ececa5ff1c8d181ed82cd98dd3e7123cb20f64d362fa4b46fddb635c0e3c9cb5 vendor.honor.hardware.audioremote@1.2::IAudioRemoteConnectCallback
3ca58c66bd8c893b36fd53737f93e7539e9ea4d92f2c7f06d860853866d4d3bf vendor.honor.hardware.biometrics.fingerprint@2.1::IExtBiometricsFingerprint
8ffd5fc3e2c01aeee30c944df7b070c76862152ab707f6cd52d305befafb44b4 vendor.honor.hardware.biometrics.fingerprint@2.1::IFidoAuthenticationCallback
697666e6879d17cdc714f7a5d85541e9ae820fe833c51153d991a06a6844a325 vendor.honor.hardware.biometrics.fingerprint@2.2::IExtBiometricsFingerprint
2adbb44fd30f971c2b4c55194c962468a8334c9678509be648eee49a6dee22c9 vendor.honor.hardware.biometrics.fingerprint@2.2::IFidoAuthenticationCallback
2cb0de92eef2e614f479f16444ad52cbaa2df490550179f32d4f75e91e25585d vendor.honor.hardware.biometrics.hwfacerecognize@1.0::types
8370b13f3601bb0d3bee89cf0375114a81d948c96edced434cfa585e5039f2bc vendor.honor.hardware.biometrics.hwfacerecognize@1.0::IBiometricsFaceRecognize
cc4bdeeaebd841550b6c667bd9465cbc0b239bd354f85d604f0ea57b4c4916ab vendor.honor.hardware.biometrics.hwfacerecognize@1.0::IBiometricsFaceRecognizeClientCallback
5896b243ef4fa1cae5a56baa9f6d88d92b69aecfd5c05f373492337821fcb912 vendor.honor.hardware.biometrics.hwfacerecognize@1.1::types
259b6a9e95a5fd7e6423559b5dc8a5a23831f3dbf2aa4baa7e9acf769474d642 vendor.honor.hardware.biometrics.hwfacerecognize@1.1::IBiometricsFaceRecognize
a6341ba6929be0f559dbd1aa220cfa1160a3d058a3938dbd572724267cb8b4f7 vendor.honor.hardware.biometrics.hwfacerecognize@1.1::IBiometricsFaceRecognizeClientCallback
35e15985ac5fbba77e0f412aa22ffac675b0c6d288649212ed9ce1bbb25231a7 vendor.honor.hardware.biometrics.hwfacerecognize@1.2::types
6ffcb71a0ef4d271d03e56e8e7e5990ca3dcb820ea5e71275020e1f64bd92829 vendor.honor.hardware.biometrics.hwfacerecognize@1.2::IBiometricsFaceRecognize
40909f9a2d7a4cbc5989f583dbdad594c20bab4271f5a10809bcd6301c22d13a vendor.honor.hardware.biometrics.hwfacerecognize@1.2::IBiometricsFaceRecognizeClientCallback
916ff369ce9f9db3ae6134987804bf2e42bfe9f5a73877a9261e668245d4a82e vendor.honor.hardware.biometrics.hwfacerecognize@1.3::types
86fc86ec70c80f114d55e550e150788857c1a0495081771d48d759b4ac8079a2 vendor.honor.hardware.biometrics.hwfacerecognize@1.3::IBiometricsFaceRecognize
36ce775f2a3a8cc2ab518a28a3b19b08b97f6e8dc859a5c11b050754c7eff45c vendor.honor.hardware.biometrics.hwfacerecognize@1.3::IBiometricsFaceRecognizeClientCallback
83d5d261a4aeb33bafa79bd4c413e55e56961d3296cb3b6bebab28fe499222b8 vendor.honor.hardware.biometrics.hwfacerecognize@1.3::IBiometricsFaceRecognizeDataCallback
e43eb6e564f76942cb248aec3145257b5bfc6dc0e8569241c0e5f0b9d4ac7564 vendor.honor.hardware.biometrics.hwfacerecognize@2.0::types
05bb9b27bdb09daabcad6d0e73f8ec55001e243be723a02e383d4d38b5adabbe vendor.honor.hardware.biometrics.hwfacerecognize@2.0::IBiometricsFaceRecognize
be9bbaa67ea430f4a880e6f8f0279a1813cad05e7db5f493812bcc4e76c55243 vendor.honor.hardware.biometrics.hwfacerecognize@2.0::IBiometricsFaceRecognizeClientCallback
d28243e890c8c759a56094f021055cc7e8c65d301583fbe94c7b6b699e13f307 vendor.honor.hardware.biometrics.hwfacerecognize@2.0::IBiometricsFaceRecognizeDataCallback
7e02e5001530f0c07b32c052d05491746e1c573958e3ec60ea69c077dbce9eb7 vendor.honor.hardware.biometrics.hwvoiceid@1.0::types
bb287c545069a6df511a2e0bf5b9c75f8c21a2fc9d3bd7993fb3fc009f7f51f8 vendor.honor.hardware.biometrics.hwvoiceid@1.0::IBiometricsVoiceId
a3a5f4dd75b085926bbe28254b5d19fccf4d0a95c2fb3fefc90eb873e94a8bef vendor.honor.hardware.biometrics.hwvoiceid@1.0::IBiometricsVoiceIdClientCallback
809c80c3e3e89b9182c04fbce7ec9f1a4265e259114bd5976433742321c822f9 vendor.honor.hardware.biometrics.hwvoiceid@1.1::types
252aecf832a06832be4b074d1c236d0e3cf19f4434312c36caafec72cd9752be vendor.honor.hardware.biometrics.hwvoiceid@1.1::IBiometricsVoiceId
0ba179cf673b883871dc8b385fc499997d8472b53b459b2a1bac070635595c33 vendor.honor.hardware.biometrics.hwvoiceid@1.1::IBiometricsVoiceIdClientCallback
50ee7cc747b6124f8053bb5d92c4bed10ff37f57b5841dede9adc2cc14e878d5 vendor.honor.hardware.biometrics.hwvoiceid@1.2::types
406de73f8e7e2301f9087ae067fb63cce4bcc3ccf529ddf8c335a858b3eeeb08 vendor.honor.hardware.biometrics.hwvoiceid@1.2::IBiometricsVoiceId
8f923a831dcae7e17e092e6f4df7f2606c0843676d6129b5620374300471d081 vendor.honor.hardware.biometrics.hwvoiceid@1.2::IBiometricsVoiceIdClientCallback
b3ca3cb5955d2811ad680a7fed3e03f5cd08cb5ccb7868a3d9828aacf18f6bd9 vendor.honor.hardware.biometrics.hwvoiceid@2.0::types
a7986718f4087fd6e8267fda490d6d4ca4a7d8e3aea72ace30ec69d96399617d vendor.honor.hardware.biometrics.hwvoiceid@2.0::IBiometricsVoiceId
57ecf5a9d167b4705390278b3782f07269e25652d40d5ba057cfdf6419049846 vendor.honor.hardware.biometrics.hwvoiceid@2.0::IBiometricsVoiceIdClientCallback
754d73fea846964dcb940027d7da7c2d12e930c270daf9b4f722c49d39b15d6f vendor.honor.hardware.biometrics.hwvoiceid@2.1::types
73cb0803aa19503efca648e6c852c8359b9c784c906dc3aa75e90b74fbdea14e vendor.honor.hardware.biometrics.hwvoiceid@2.1::IBiometricsVoiceId
1c312415ed1fbc566a98f1db9797ba11c35e1267e50f97b4e3db5bb89e2b16ee vendor.honor.hardware.biometrics.hwvoiceid@2.1::IBiometricsVoiceIdClientCallback
ae9b55061aa5b5b50c1a960601e8c8ddca22cedb5c939a758ba1c7d57663dd88 vendor.honor.hardware.bluetooth@1.0::types
229f777af58856c67e5603cd315da479493fef6403f8613d5219c9ccfe3394dc vendor.honor.hardware.bluetooth@1.0::IHwBluetoothHciExt
a190a921812a613a9eb2bcb2f704a79b4a1d462bb48add7142526ade59a1fc33 vendor.honor.hardware.bluetooth@1.1::IHwBluetoothHciCallbacksExt
489fa372aadd607757977bd7d8c7b5bb7677a6459d31452ee69e594b038b7e37 vendor.honor.hardware.bluetooth@1.1::IHwBluetoothHciExt
e23d0556d49f89021fc72390673ab0c1faa3f2d9e38a2ccd09499b15ead8b60a vendor.honor.hardware.camera.camResource@1.0::types
433f8550310dc4fc94760a11cdcffa9cb7d0aadf382837085c1ff0a550b28986 vendor.honor.hardware.camera.camResource@1.0::IHwCameraResourceService
3d32060f92576ff235f9e9cdfc08641b20db6d3ef779625ef6c4f972bbdccea0 vendor.honor.hardware.camera.camResource@1.1::IHwCameraResourceService
932f6b2e80b87e2906bd01cf03cc91dcd0bd943d0834232a3ab2cadbb8cd116d vendor.honor.hardware.camera.camResource@1.2::types
775809f7f9a93a1f9f991ef6a5279cc52673e1543c72b48858618a059fb1bb17 vendor.honor.hardware.camera.camResource@1.2::IHwCameraResourceService
32949541f860e2c6c44c0005ac8ab83a2921cffbd2adfe66c0061d90e14044a4 vendor.honor.hardware.camera.camResource@1.3::IHwCameraResourceService
9187606c6d9c531ae79d0dc1b4f5c9ee610584300703c4f7b0d5bf54e64ecbeb vendor.honor.hardware.camera.camResource@1.4::IHwCameraResourceService
74f79817135f7a4e978a2775538349411da3fa97b15bfd8f28bcbe99e88da278 vendor.honor.hardware.camera.camResource@1.5::IHwCameraResourceService
0d70d75727e90a024495e77ad6f3496883c7d58216f51dd604ccba8dcdbad25c vendor.honor.hardware.camera.camResource@1.6::IHwCameraResourceService
5b4b25358fca38424785f45eb571b7b55793d1a3a742aee86854cbdd16fd787e vendor.honor.hardware.camera.camResource@1.7::types
f929b5a1e3eca8f60c61bd1b76f0ccfb73491f9cdb0d677175d652fb709a3ac5 vendor.honor.hardware.camera.camResource@1.7::IHwCamResourceListener
f9362bed9428a9b4645dac245e7d8948cda35482182489ff9d7185f24cd9896c vendor.honor.hardware.camera.camResource@1.7::IHwCameraResourceService
db441e0f2b90cbc7ec87b1f939254630f7812eae095bedc071d1caf1aaa4a901 vendor.honor.hardware.camera.camResource@1.8::types
4979b7684b2a879c7d149940fcb1864c13fe58299492e8300647f9289ee687dd vendor.honor.hardware.camera.camResource@1.8::IHwCameraResourceService
198015ca0ae978520fb7fe1ead63def0a11cfabc848119b2c10d8fb39659d64b vendor.honor.hardware.camera.camResource@1.9::types
6ba9eff09f05b5997bbd9d8bf08939da6d612e52ee64cdb3dd5bad858bf3bf2a vendor.honor.hardware.camera.camResource@1.9::IHwCameraResourceService
b98a99317ba5b55b95890b0073c16f9b962e4333df61460897e6a4b797b35ef3 vendor.honor.hardware.camera.camResource.algoService@1.0::types
66b53a6f5f1f5550b7a2c3b63dd9f4a4b12fa76905a864e581962c76bb8540bb vendor.honor.hardware.camera.camResource.algoService@1.0::IAlgoService
6a6138a0e9abc867177122fa49dbd5bf160ce0f38f9f1b54d57f85557fed17d7 vendor.honor.hardware.camera.camResource.algoService@1.0::IAlgoServiceCallback
009c6bdb73861b9d0571146f5563cacd72ad98d8e7890ac731f20dd2d6c65d73 vendor.honor.hardware.camera.camResource.dceService@1.0::types
57952850aa976610887fc2ea4a08f5eb5518e394a2123007594437fbf2631bde vendor.honor.hardware.camera.camResource.dceService@1.0::IHwDceService
7759cbbac9014689a7a869809618fcf884e343bd9ab3bcbb3202ae54dd486868 vendor.honor.hardware.camera.camResource.dceService@1.0::IHwDceServiceCallback
224986b2215e985a5af0b9abb0d12a06a1d35572f38fdfb80585350c798df18b vendor.honor.hardware.camera.camResource.matcherService@1.0::types
97c0ec00a2122b2adb84d0e455f6f2a9ad1d2efa0ad7893561843e84eea7fcd8 vendor.honor.hardware.camera.camResource.matcherService@1.0::IHwMatcherService
c8297560a96e7de75a0e9704062122606fcd301222bc66967ae809f1e1076c54 vendor.honor.hardware.camera.camResource.matcherService@1.0::IHwMatcherServiceCallback
b0579f0864588f69c378e004acae12d654a1868362a615b7b61b991bec0e39ab vendor.honor.hardware.camera.camResource.orbService@1.0::types
2e7009bd7eef3becc13fc673e2f659746a3516ee346c7aa44c08954c0b44c75e vendor.honor.hardware.camera.camResource.orbService@1.0::IHwORBService
2fc59651418c3d4faf0c64be02d9a8e41b2e03c1e2ec0e043ef6b4912c99c869 vendor.honor.hardware.camera.camResource.orbService@1.0::IHwORBServiceCallback
32bbda76e2f141292d6f8c913f398fb201e7e33b4b02175090d9d18ce05c44dd vendor.honor.hardware.camera.cfgsvr@1.0::types
36e6281ecf12cd134a91ff322f794bc541edefbd5709e78ae4fc87fe49004fd7 vendor.honor.hardware.camera.cfgsvr@1.0::IHwCamCfgSvr
f34e1d50e34abd77dc083ca7462879bc2037896f854b8f874f2269df40e49f43 vendor.honor.hardware.camera.cfgsvr@1.0::IHwCamCfgSvrListener
0a861f5c4b74a29a73a3e106c210963e5780580acc5a866bf62a6f3077e7d2ad vendor.honor.hardware.camera.cfgsvr@1.1::types
3d511913fa48750935151a8863ab4e353ee13c755b0eb748b3ae8f29c299e815 vendor.honor.hardware.camera.cfgsvr@1.1::IHwCamCfgSvr
48c012ac6adbe98a9b18709e604b1c5d9cdeec7a4709f0bac03ea1e56d8eb2d4 vendor.honor.hardware.camera.cfgsvr@1.1::IHwCamCfgSvrListener
08f30be1ec8ffd769beddd2654b5f3f67ac7d576b3c791f83fe4965516969fd8 vendor.honor.hardware.camera.cfgsvr@1.2::types
a8b2f127f0a2de42c846024d94b51352ce8a67fadbbcaf793c4acf587c6ce5c4 vendor.honor.hardware.camera.cfgsvr@1.2::IHwCamCfgSvr
4f753c63b396b388e571d494174326352aa9d91d7d4be5b507632044a80f53a4 vendor.honor.hardware.camera.cfgsvr@1.3::types
dfb990ead16432b8d0340032767fc62cd7b4e41ac0a6bb152c06fc2b5acb6113 vendor.honor.hardware.camera.cfgsvr@1.3::IHwCamCfgSvr
9744959a0bc7de975549649ce42e10122e066295155383fd886227a530752be0 vendor.honor.hardware.camera.cfgsvr@1.3::IHwCamCfgSvrListener
b9a25a093770391ec3151b932639cb757f2f86b5dc381c6a0fbf69f240c4e33c vendor.honor.hardware.camera.cfgsvr@1.4::types
2670cccf86fce88c09a6808caf9528879923cbc557795bea2d3780a30d3002db vendor.honor.hardware.camera.cfgsvr@1.4::IHwCamCfgSvr
9af7b3af48f101bcc09529e46d171a079f8bcd8eb451aadddd6d3f22ba3ea499 vendor.honor.hardware.camera.cfgsvr@1.4::IRegistryBannerListener
c05884f3592d4cf422b2140f419b462750e423246eef8aeacda5f733fe92948a vendor.honor.hardware.camera.cfgsvr@1.5::types
561396b4a433ec9f762b21d3c50f31195a41adf245331e1b42f236d9132cda4a vendor.honor.hardware.camera.cfgsvr@1.5::IHwCamCfgSvr
fa42f6452f5850040a49e2d1b08fcf62323f80a86c587608ca7d54a59cf239ba vendor.honor.hardware.camera.cfgsvr@1.5::IHwCamCfgSvrListener
5c9967bbd582b95cedd3c6a06e10c7f4bfc93822a51defc55394d03577c28c09 vendor.honor.hardware.camera.factory@1.0::ICameraFactory
a028aedcf763f691713c72c92fb80d7238a72809963899bd9e2c516ad4ab0285 vendor.honor.hardware.camera.factory@1.1::ICameraFactory
65f36b56c095486245de73e45943bcf87ec92afd90566c052f5d703e90643c02 vendor.honor.hardware.camera.haon@1.0::types
10fc1c60b992614a885af8e73ef87664d33aa48619a348232420b2e13a880132 vendor.honor.hardware.camera.haon@1.0::IHAONService
8f890ee4a85a102b092300dba6dad3767c171e6a1f5d3465b3d008920a025bcf vendor.honor.hardware.camera.hiaon@1.0::types
abe4cf173f06eb29ff1a873c0124a498298f6f1bc58c21158e34b0f974325903 vendor.honor.hardware.camera.hiaon@1.0::IHIAONService
39dd6ad516577c27a679a35671da97693e7cf735784ec0a507adce015ffce843 vendor.honor.hardware.camera.hiaon@1.0::IHIAONServiceCallBack
8bfc30609850c0ab22b4a8d09f8173f20a22875921c6d6572b66112885b8ba77 vendor.honor.hardware.camera.secure@1.0::types
7e284916b6542ac69e2310757c321aa2b770e0700ddc75c1d5a7695039127f36 vendor.honor.hardware.camera.secure@1.0::IHwCameraSecureService
3dd099e6db4d7ec99a1160184857585b8b1afb24f86c7db934ee23ca01e13d3e vendor.honor.hardware.camera.secure@1.0::IHwCameraSecureServiceListener
ec17cc0e542112add25d710c346a228ee0e9ff73fbc4be7cc29ceb080e1fc74a vendor.honor.hardware.camera.vircamera@1.0::types
b5ddbb77c274a47158fb4a5047c6c4d294beeb2d7a68aacd64fd374223029a0d vendor.honor.hardware.camera.vircamera@1.0::IVirCameraChannel
20b99d4e0c7cfb086facc04a3158054792fe542fe16d04743413c1a176d07536 vendor.honor.hardware.camera.vircamera@1.0::IVirCameraChannelCallback
ae4031f63b4374a83563115e2ab3c7b53a194a0b0118a5602c235f2ab2b60803 vendor.honor.hardware.camera.vircamera@1.0::IVirCameraSwitchCallback
4760b0fa5fdc96dbff17dd6f19f78f120c2a9f1565a20d6c56c1abd31b8a5e34 vendor.honor.hardware.camera.vircamera@1.0::IVirCameraTranslator
66638ddd80b221cfce3f9145d6adecb5dd970e13d7077e3fa7a8034385b70c85 vendor.honor.hardware.camera.vircamera@1.0::IVirCameraTranslatorCallback
e0588473219372c6147efda766beace11a4664246f9eb23a22d9177bd2c51e12 vendor.honor.hardware.camera.cameraassistant@1.0::ICameraAssistant
185cfcf174806c934dd622ba93ebc6e54da7b06436c81df855a1ba2f9e828fea vendor.honor.hardware.dolby.dms@1.0::types
7769779c9be6e2657c4b3679fdbbfa753456bc6b4d473ebdb203addd9355cd56 vendor.honor.hardware.dolby.dms@1.0::IDms
1bfd97966124a93361e9259846907f7781e0a70d826fba434f5f291fb55e0eaf vendor.honor.hardware.dolby.dms@1.0::IDmsCallbacks
1f8c596d86e9e922edb863fcc8a64e0aaf00310f13608935228d98ed805befb4 vendor.honor.hardware.eid@1.0::types
8a49152f61e899fd3c34fabd1bd0d69289eaf25c7f9564bde67e16abbb0bb021 vendor.honor.hardware.eid@1.0::IEid
2e87cdc17730faa0d381e15af81350baae2d38400472d4d8eccf0522e85e0118 vendor.honor.hardware.eid@1.1::types
fd12201363953a4816b1e8c2df8b62be8bdbc45fb19d08c2cff07b282ca3c0b5 vendor.honor.hardware.eid@1.1::IEid
29329b52d9c576e00b08d7163805fb20a7950ee55d0d878de4669ce39a1c5d7b vendor.honor.hardware.fusd@1.0::types
339e15f4e7c7e4546a0854978e35fc69617a2c2eee998d2480d64fb2eaf306d7 vendor.honor.hardware.fusd@1.0::IFusdLbs
b2c73b0eb5816f326b95e666df05f7fc7a5be3e2b6d6f6c36212bdd395b3f17f vendor.honor.hardware.fusd@1.0::IFusdLbsCallback
561ed3646bfb5c4e6cc4a14fe5200b4a65e1b82c032e764a8a91fe4c70dedd12 vendor.honor.hardware.fusd@1.1::types
7c8c5bce9a832fd9bde993f8d172768846ec4a280efa7e2f35dbcb5079cdd1ed vendor.honor.hardware.fusd@1.1::ICellFenceCallback
13753f7b2bd9b95565be5b9e5324422dcbee790a20af82f217320979269c9264 vendor.honor.hardware.fusd@1.1::ICellFenceInterface
6c5496202c4073912bc1658de0c44f3c42dcc0982f092c2d551eabbb9f225ab5 vendor.honor.hardware.fusd@1.1::IFusdLbs
f15f3327e77f1e9fccc18def378ea3e26a61ded3c528e2f8efa4b6e400959b67 vendor.honor.hardware.fusd@1.1::IFusdLbsCallback
098f7ecc01ac167338d01fd848a2f42b0212993111073dfb008afead02728a64 vendor.honor.hardware.fusd@1.1::IGeofenceCallback
af5a564d30335bcc12b7ef04cafb37445651652e179f59b4390595878de18b06 vendor.honor.hardware.fusd@1.1::IGeofenceInterface
10254df5903b5e17236723d0f70031bb1d9f614946f251e351088d712f082259 vendor.honor.hardware.fusd@1.1::IGnssBatchingInterface
7870e96e6eef6d4bca9472cc5275aceded5e0f337579375d0fdcfeab3093ab31 vendor.honor.hardware.fusd@1.2::types
babccdc378241563c5c982ab0b088d8ebf04ecf5dca830e4d64b7e62d055c8e0 vendor.honor.hardware.fusd@1.2::ICellFenceInterface
0a6845b3b38978af558a43cbf041eb16dadc002e28d6c4012cc77ea1161f2879 vendor.honor.hardware.fusd@1.2::IFusdGeofenceCallback
4743a3a4d991061f799706e4356226ec2e41be1b6a807a2fd41c5ebfeffff8c8 vendor.honor.hardware.fusd@1.2::IFusdGeofenceInterface
88ca483850b4297f2e74096c428423f56e73209497f652a401f448153fd9d603 vendor.honor.hardware.fusd@1.2::IFusdGnssCallback
f69094b3c458a3b28e957888d6ababc8a129ac2b6750ac0a4f1f47fe4b8fb1b3 vendor.honor.hardware.fusd@1.2::IFusdGnssInterface
a47227ac3ac6e71a86f8b4a2d5a8eaff87eb6fc22c828fa95be3a8589d5ea31b vendor.honor.hardware.fusd@1.2::IFusdLbs
e0f546e3d66d18dc1268f3de4566cce7bf89600170be2dc0f1b8820943fa30a7 vendor.honor.hardware.fusd@1.2::IMMCallback
0dc67672465545d8c4dc4a0bc3a8e7e51b4e7c7d1966140bfa0b943f1de0d7bc vendor.honor.hardware.fusd@1.2::IMMInterface
803668596cbcc2e0bd6b01953eea9aaf17f7043debd44138a4f340a18af41b27 vendor.honor.hardware.fusd@1.2::IOfflineDbCallback
b87cc63dd24d524aa986ea5eadb171ab44dc8fe01ba5257dcac6b00fb6c03edd vendor.honor.hardware.fusd@1.2::IOfflineDbInterface
a3389236797d9557c8a63883c4e6eca1b7191c4323145691d3124d20ef46166c vendor.honor.hardware.fusd@1.2::IWififenceCallback
0a2cc1198f1e5dbba35806773f074642db5121e8b93a78b0b1e61c135bcb42cf vendor.honor.hardware.fusd@1.2::IWififenceInterface
b3005ac026fb539887b7b498a9cae7afb1050b1bc2f64d5eb772f5df2d4c7253 vendor.honor.hardware.fusd@1.3::types
826aae5606b65bdb1b9daeba6cf5dae3252d462622468b7c2f8a6a606fcb1552 vendor.honor.hardware.fusd@1.3::ICellBatchingCallback
6705453d0b4bd7740b15553fe71e76a1bb5feb9d97dd4d881ecf9c4a1464e0fe vendor.honor.hardware.fusd@1.3::ICellBatchingInterface
d81153b3dd1bfff543348634281f022da4fe07484ac790209db63c0d4195fa57 vendor.honor.hardware.fusd@1.3::IDiagnosticCallback
da6b38b627c6196cb037ba12840d892f81c350878ef17b92d9acd256465f44ad vendor.honor.hardware.fusd@1.3::IDiagnosticInterface
f8bde07888e2266fd9a951e48753d59473820202aa6841aa72a22df870e4816d vendor.honor.hardware.fusd@1.3::IFusdLbs
2d15ab69ee43b4670651e0a717a82e062804c2eb89d84dbe73f891fd6e95e1ed vendor.honor.hardware.fusd@1.4::types
4e70c3575c90f25130702bc0bc777d361e5f853b17f617532297767d94d1e48b vendor.honor.hardware.fusd@1.4::IFlpLocationBatchingCallback
e7f665362b0a015aeb830b79de77e654260e1ac1c1e65a7e54235138d0e68d27 vendor.honor.hardware.fusd@1.4::IFlpLocationBatchingInterface
1cf773bfa23fade6164c64d25d961bb111ee80b77498dbc6f8755cc5b4c6e11a vendor.honor.hardware.fusd@1.4::IFusdLbs
15e5c2a12bafb48744032c91c9859cc29b879843ee42988ba5cdd62c2da62874 vendor.honor.hardware.fusd@1.4::IGnssEEData
2be5fd9e5c08bd26bdb31f5c39bd1b1883463415b995c191ac7031a1e4d3ffab vendor.honor.hardware.fusd@1.4::IGnssEEDataCallback
8eb2a342cb1d3aa7a364a5b07dfb85b39ba4fc47e8881096e2699a3aff40fb61 vendor.honor.hardware.fusd@1.4::IInterferenceWeakCallback
97167ccadb2b7ad7e72ff5791e39551acafcc00836d9b6e760cca430ecd40a5e vendor.honor.hardware.fusd@1.4::IInterferenceWeakInterface
0d96207027b237e86ed52b2767d1854fae3597602fbed1159e39adc96c979e79 vendor.honor.hardware.fusd@1.4::IMMCallback
7feb0a9d4324cdc6346d58d200c1f1fdf8cb12f1be1121699181d9f0bde46d48 vendor.honor.hardware.fusd@1.4::IMMInterface
054e5ce90200359abda3fd3b129aec6a47984585055f9272236aa5e592ad018d vendor.honor.hardware.fusd@1.4::IPDRCallback
c98d1c6080129f12c29acb1dc06b4a5afbf0fe567399b53910b1d4f0a88f2885 vendor.honor.hardware.fusd@1.4::IPDRInterface
9179adf90bffcad19d0cfd8661cafde8975bf5ab60c400d77d9ef1d499ac7a55 vendor.honor.hardware.fusd@1.4::IRemoteVehicleCallback
ce2d708b2bee87694023cea6bd9096a2e7a5da75f4d815f6c399c98ed9d3bca3 vendor.honor.hardware.fusd@1.4::IRemoteVehicleInterface
0e9e145019ec97024a91cb8f7989252b324ec98348d5420fe75783f9a1a51833 vendor.honor.hardware.fusd@1.4::ISDMCallback
e88e60777d38ad83f7e12bfcb292c55b88ecda15334c443fc6ce78d2e5083b4c vendor.honor.hardware.fusd@1.4::ISDMInterface
5b0a7b1ce9e087dccb9ea53123a1b070f3e3339a274eff1d2b4239f6ab4c62c7 vendor.honor.hardware.fusd@1.5::IFusdLbs
42bbc496db5fa025253432b5085de323e26de32222ffd5756753550a8554af7f vendor.honor.hardware.fusd@1.6::types
0e229d05cea136913008b0a0585f5f7c5f981aab5969bad2ace0baea1a33c31b vendor.honor.hardware.fusd@1.6::ICellFenceCallback
94379cd50d6f6cd9d3b46a6a214614505b79b037dfb71a954504125055ab05ae vendor.honor.hardware.fusd@1.6::ICellFenceInterface
4d13918c1557f2c3a9d6d410af7ec7c7bae1818617ee941bb2b4f99071b443e2 vendor.honor.hardware.fusd@1.6::IFusdGeofenceCallback
dc8913b746bbed476eef6f19401c456cb17182de604d2e74b4214895e5691811 vendor.honor.hardware.fusd@1.6::IFusdGeofenceInterface
df23b15b1fba0d1586dbebeddc74b40636cb78ca7416e521cc7d9c0907808c2f vendor.honor.hardware.fusd@1.6::IFusdLbs
7bed621186e9b813e2461a0923cc9bc8e53e546752b9f6c6ce70a2bb0700242c vendor.honor.hardware.fusd@1.6::IWififenceCallback
ca378fe294e86a3a0af9cc95907b4cd5493c3cc0472901554d922acdfc5605b7 vendor.honor.hardware.fusd@1.6::IWififenceInterface
8a0ed7da4f84dc0656fa339b3a0023fcf87e5fdbc342404a499ae27dbc160531 vendor.honor.hardware.fusd@1.7::types
56523f4c7b9e642e7944a3baffbc17581671b5c8110a374d543839b92f14e200 vendor.honor.hardware.fusd@1.7::IFusdGeofenceCallback
301073a6d2eab994c5578ef50f50d5e12d7b7430100d4b7c9783d9c72ebc83e0 vendor.honor.hardware.fusd@1.7::IFusdGeofenceInterface
682320da90e3813d30d43f90f53c17c89a7644e8a61f50a8441cf21a8d1d9f1e vendor.honor.hardware.fusd@1.7::IFusdLbs
680b797efe0be28dbe19579fc0095a2d649fd5eaf9900546c429fe8bbf1c9205 vendor.honor.hardware.gnss@1.0::IHWAGnssRil
0247adba8d4e059f324c9f332fb39533d9502c4cb84e2f57d25c69bfb54b1fae vendor.honor.hardware.gnss@1.0::IHWAGpsSuplFqdn
13ce7c7637f0397d19dff8da200af07940180f00b8910a9f89ba8aef169b5c62 vendor.honor.hardware.gnss@1.0::IHWAGpsSuplFqdnCallback
c79269ae45a78d2e42552e87663321ce2857d6cae7c10484e363857a14135e2d vendor.honor.hardware.gnss@1.0::IHWGnss
696e139679d4d93446cd87e159a5aaa0316df88bb3e66d616f97953b70822813 vendor.honor.hardware.gnss@2.0::IHWAGnssRil
43b61b35f76e641abf35f8e78b000d63513da48683282cfe1ef1a78474465424 vendor.honor.hardware.gnss@2.0::IHWGnss
1bf593133839fdff3f2d6f5594e35b66aa420745780573f22b29084631d31fbc vendor.honor.hardware.graphics.displayeffect@1.0::types
3ef65f62563006210859f78234cf69165bb4da67c9dcb31affb3756d8b2c351e vendor.honor.hardware.graphics.displayeffect@1.0::IDisplayEffectCallback
33c208f73dbb51726741b36f67158e734979c0cfa0730f1b9d84f20f4d1d06a8 vendor.honor.hardware.graphics.displayeffect@1.0::IDisplayEffectClient
d3b86335cef3392e4126ae5c1fb85d355a7d5f95a5b6fb53b2df6b2e7a4eea5c vendor.honor.hardware.graphics.displayeffect@1.0::IEffect
3d7c74f1ff3303f18c77b0e97eca2766f79ecfd2f9e23a57997c3171d3885252 vendor.honor.hardware.graphics.displayeffect@1.1::IDisplayEffectCallback
a79669fdd59b0326a60c3830a43e497ab1f848ea4f7884a52f1ec99934599c15 vendor.honor.hardware.graphics.displayeffect@1.1::IDisplayEffectClient
c99cb6a9f8aa384e587fa602bc8c1a8752910233cf006a60012778a4731a0fd4 vendor.honor.hardware.graphics.displayeffect@1.1::IEffect
a158cf38f560836fe412113aebf309f3d374e8fb6e08a2d4f66001a146601023 vendor.honor.hardware.graphics.displayeffect@1.2::types
c58aef4abbbaa1c06130c87ded9ff778338c498b5b1bc1406460180b802548c3 vendor.honor.hardware.graphics.displayeffect@1.2::IDisplayEffectCallback
a7ca02d3549ceb0da1e170cc3b05164bcf6433e7171644de78f8ae76dd5eab1e vendor.honor.hardware.graphics.displayeffect@1.2::IDisplayEffectClient
dd27ad265df8c370345c461a6460b457df18b80aaac2a6f0bfd989ad6bba83e2 vendor.honor.hardware.graphics.displayeffect@1.2::IEffect
3d5be62cd2327f8ee0917c6ca5e44ef0073645e282bca4c86041f7b5d620ede8 vendor.honor.hardware.graphics.gpucommon@1.0::types
41ab43176206ce2f0327088ecee81b025520c1a056ebfa3cacfc0d0b5f32c5c9 vendor.honor.hardware.graphics.gpucommon@1.0::IGpuCommon
9457af29b17ffba6a0d13ecfbf09b0e615ed3f14d05b2979ece8c94f42eafbf4 vendor.honor.hardware.graphics.hwcinterface@1.0::types
2f4b571724b553173da33849cc027a044a9ceecf926dcc4971160426b56add00 vendor.honor.hardware.graphics.hwcinterface@1.0::IHwcInterface
132f32a80304ed1fc9ac87a80e3c8ce8443cac207129b89d5ea5157f25955ac6 vendor.honor.hardware.graphics.hwcinterface@1.0::IHwcInterfaceCallback
3245005f09bb5bc06944e2afa4c5e290be23ff1021eeff59e2ca8d70f11d4a5c vendor.honor.hardware.graphics.hwcinterface@1.1::types
421aed23b1171f0720d9440a28b403f9964677cf8ce7ab85c4b5342c7697056e vendor.honor.hardware.graphics.hwcinterface@1.1::IHwcInterface
d61baa360d992a7e7d48b70554aaecd47c7e3fe4975e44e81f68de8635bcd1f0 vendor.honor.hardware.graphics.hwcinterface@1.1::IHwcInterfaceCallback
8120138aac1c11ace7583c36676d78c5e5ebda98fd06bca95515b04a0204d4cf vendor.honor.hardware.graphics.mdfx@1.0::types
6b8074c50b1176d75773a18c7f745f85eded442a2f56618fff0f19aeaec7dd62 vendor.honor.hardware.graphics.mdfx@1.0::IMdfx
5d6205ad295e1830c40cc44f4e3dcd7ff6dca3dc2c9ce50a54a730cdf2ea0615 vendor.honor.hardware.graphics.mdfx@1.0::IMdfxCallback
50d2fc1ca555448e95b781064b6ef065791f3c673fba58dedd92c8e5a4dc818e vendor.honor.hardware.graphics.mediacomm@2.0::types
2d00d084daa86bd8b74ecca064f9547298b0a90ddc88feb1987645dee6b15e5b vendor.honor.hardware.graphics.mediacomm@2.0::IMediaComm
8fc84f65b3af87bfc035c36f867b76ce48454396e6ed6aecf6d4ac73981fd8fb vendor.honor.hardware.graphics.mediacomm@2.1::types
76089f8efd822e9576541c567d662e2d98ef357dacd1aa9a95cb07843e06a38c vendor.honor.hardware.graphics.mediacomm@2.1::IMediaComm
3c47b1663134a67dc0cac3c71ce9df2d298492013894a34b72fbbbd52af5171c vendor.honor.hardware.hinetmanager@1.0::IHinetmanagerDevice
90ead3e0b27284a4f4d474aa77a758ab817ff78e318dbec0763e888200172761 vendor.honor.hardware.hinetmanager@1.0::IHinetmanagerResponse
0b1a07930eddfd9c740def263ee279f1533c0c1298fac20b03ac6b921b6d6379 vendor.honor.hardware.hnchipsrv@1.0::types
1aade9cbfb8597a5d72c9e1b7db2f58e7808e429fa857e7613e0a64441bf1357 vendor.honor.hardware.hnchipsrv@1.0::IHnChipSrvInterface
5439709cc93ad967aace0eeeee7b35d63a70077e2ce84eb2bff8e11d65749e0a vendor.honor.hardware.hnradio@1.0::types
1cbd4a7ee706e67e35339b15c4f04b6cd8d9d3c407c0d0a1ca9c4eac7eb29483 vendor.honor.hardware.hnradio@1.0::IRadio
771326d49cebb51e97555304f252b1b5935df852ed91f0aa762be839df4fe187 vendor.honor.hardware.hnradio@1.0::IRadioIndication
6b622c8c612b472dee85ecaf6f42a78994f77ceee9dcb7e39d6ca34cf7174552 vendor.honor.hardware.hnradio@1.0::IRadioResponse
c34818166f74726cf078b4ecb7dd1397076bd423e07c59977c61bcf18b8a4ca9 vendor.honor.hardware.honorantitheft@1.0::types
606f9cb21bd4efc4c4c172a7179cc1e93177280bdd36bff2c289ff9c46164e64 vendor.honor.hardware.honorantitheft@1.0::IHonorAntiTheft
74fd04e6ef0d6a8d3eba96e145dd4bb67c3cf7fe7ebfcd625113903bcdf270b4 vendor.honor.hardware.honorsigntool@1.0::types
70ecff5cd7e0d8b666ae1c6f7de4bc135e3008cc5da596a657bd7f6fee26442a vendor.honor.hardware.honorsigntool@1.0::ISignTool
bf6dc6a54f2dd7ee04291411651bd665bc8ba50c0a1e4097222391742ef7168e vendor.honor.hardware.hwdisplay@1.0::types
21de19bde90a84a394fb6a2688a052620a1a996a13b320cf07c73c633af7c04c vendor.honor.hardware.hwdisplay@1.0::IDisplay
7c71c72b67d4057590a3087c2c25834dba1a8387e43858a8766e4f637068a866 vendor.honor.hardware.hwdisplay@1.1::IDisplay
d2ce78af06b3c2f47fb0714137b53edd42d4b07770684eb9418f7d1524781c56 vendor.honor.hardware.hwdisplay@1.2::IDisplay
ba6e2654b74e254a8869fa3f165518007982e2413fdf315719741609beac08b3 vendor.honor.hardware.hwdisplay@1.3::IDisplay
e832e72d33a342c9d240ad887578861b9f0cd7c9bb1578effb325ee599585c9e vendor.honor.hardware.hwdisplay@1.4::IDisplay
f2f868f24f4e623329774529d5ed88eb92e94873aecd833f57ed41bcee498bcc vendor.honor.hardware.hwdisplay@1.5::IDisplay
45b3fe330d7be045f0d32378ee3a6f9ad0579abf4093e7a3e7786bb8d21e10c4 vendor.honor.hardware.hwdisplay@1.5::types
7c083555ac018f16892089a9faa7c5bdb93a2d80fe53963d1887a22000eb8547 vendor.honor.hardware.hwdisplay.displayengine@1.0::types
7be82607a538d26aaa24990dde476a36e81533f9ad1209d654087b2b57c97ce0 vendor.honor.hardware.hwdisplay.displayengine@1.0::IDisplayEngineWrapper
feab6f87b9a4e7d721cac720f40302c68487fb8f68a39adf616a2bc25ec86675 vendor.honor.hardware.hwdisplay.displayengine@1.1::types
89e5ab50d696c63bcf9e4845ab6f15d6ddd51cdc8781857f3ed4267c6852aca2 vendor.honor.hardware.hwdisplay.displayengine@1.1::IDisplayEngineCallback
0612de3db2d73affc4cab7257b7103c7bccbb940c9e38c82e4446d6486877916 vendor.honor.hardware.hwdisplay.displayengine@1.1::IDisplayEngineWrapper
567d1b25eb03b737969733bb14125c72f6354d7200bf3a0c5c100eb291b5da18 vendor.honor.hardware.hwdisplay.displayengine@1.2::types
c7356276e6b8a339ce6f70aaac44cc35e21b641c2450ea31245ae781dd1ef161 vendor.honor.hardware.hwdisplay.displayengine@1.2::IDisplayEngineWrapper
5d07221ecdd9f84f70a5ef41252e15e22592f9de8529b8990c740936b66ff99c vendor.honor.hardware.hwdisplay.displayfactory@1.0::types
6f429f5582cfafbdbce2cbbdbfcfbc41e64652d9e3e4c8a50a2576a9e47761d2 vendor.honor.hardware.hwdisplay.displayfactory@1.0::IDisplayFactory
6ec38d42e1f29b9f987d34e72bf9ec1941a40649f80a454166508b86238d5441 vendor.honor.hardware.hwdisplay.displayfactory@1.1::IDisplayFactory
3e2f0cafb0c8337169f2bd188fc92089cd0dbc9a96a13ba95ef50920b99ac88b vendor.honor.hardware.hwfactoryinterface@1.0::types
661d5c7d1525849127c35fb2d3428a387a9b3dd58029e62e27cf91066614ca89 vendor.honor.hardware.hwfactoryinterface@1.0::IHwFactoryInterface
96aea4798992f2e4c9f72aae52a173c270b180cab8eb33985f26b7df2f154043 vendor.honor.hardware.hwfactoryinterface@1.1::types
e229d6544c5cf185fdfd95bc1068c7dfb6dc9874527957d51e5777a62bc41e04 vendor.honor.hardware.hwfactoryinterface@1.1::IHwFactoryInterface
4e8357eeb4b794659e00e471bb66e19431b63bd4b7831664263793f4b80ab6d6 vendor.honor.hardware.hwfs@1.0::types
86eee01ce5a2c8648b781ebccd760cf7f3c85ef6e3a886c773c2377a44cf2c86 vendor.honor.hardware.hwfs@1.0::IHwfs
39294f44f8b03f8c5954d9907aa53042c92c9c21d08659ceea846e123e53658f vendor.honor.hardware.hwhiview@1.0::IHwHiviewInterface
e97ca2317e2a82a15cb02814c2ec336fe746d5a5a7e3a38fd8bf96abd9cf6e56 vendor.honor.hardware.hwhiview@1.0::IInotifyCallback
7ed1e9b74c2f1b991f343f7050aa7cffa53cbb4d9a0ccbd491e1098ca0a50184 vendor.honor.hardware.hwhiview@1.1::types
c7fb49b9a5130f21df980336b5519c36829ad6d0058d5283833ed7b9e4ffe8c0 vendor.honor.hardware.hwhiview@1.1::IDubaiCallback
6cd03bb623bf19d89c7beccd6e2c4f38ab49c77ecf15e5daa3ca858a31f240e6 vendor.honor.hardware.hwhiview@1.1::IHwHiviewInterface
56cb2238d7f40e09183f48f6949bac3821ff2bb6a0c986962857b7d75fd1b0b8 vendor.honor.hardware.hwpuremanufacture@1.0::types
957393cd9ad10a0785112665be90c56652e7f164aaf2e225f4a590ad9a3f402a vendor.honor.hardware.hwpuremanufacture@1.0::IHwPureManufacture
f4ef1a54f2a2359a553265a4fb81ffa8fa1b1c6adb3bf06385536e8856f33f60 vendor.honor.hardware.hwsched@1.0::types
6fa39f3372a66dd2c1ba477bf2ba5f10d498cfb6fa8e0e8cf4bd9df7206ac316 vendor.honor.hardware.hwsched@1.0::ISched
38f2ea86ab6fa2cfc00f6cf2caf039ee12cea1946555a64d87c2126bf889861c vendor.honor.hardware.hwstp@1.0::types
fdf2e0316c6c0d2f89afc56cc50c09276d8ea09bf5f2bff549d595719355633b vendor.honor.hardware.hwstp@1.0::IHwStp
2cf12b648c0a98490ca04839add8cd8679307261a65c38ec37f56b1d65fe9a8f vendor.honor.hardware.hwstp@1.1::IHwStp
fbb7eeb355ec94523db8c19f57783eff05d2dec87e047b3252382d77be634b43 vendor.honor.hardware.hwstp@1.1::IHwStpKernelDetectionCallback
4d028ff0062e7336c9a1792533c95c51165ad3d5a16df3461e5ea1ce5e051b0e vendor.honor.hardware.hwupdate@1.0::types
2b58f36a319664b5db6db6bc492d64c39c87f065d0eaf79c3d87f43c7c82e2f1 vendor.honor.hardware.hwupdate@1.0::IHwUpdate
aff744b03d482d2c9c33ac3c93015b44537779dc84f830ef4965a29b0bcbaba5 vendor.honor.hardware.hwvibrator@1.0::types
d1b7c2e69eacd9e453e5c9151bb6306dff25d7b377abc16a9ea9c33127e38099 vendor.honor.hardware.hwvibrator@1.0::IHWVibrator
0573e4ad81876624854d78d9b1ece5664a3d59f161ad68a7662357fb4d9f86ec vendor.honor.hardware.hwvibrator@1.1::types
f804a9a8198112859677bf33a731213f7b83c013d9c2f5fcc3999be681581308 vendor.honor.hardware.hwvibrator@1.1::IHWVibrator
f8c40bb3ac22a5a9ee7db085e6e3a1da04d0302ea465ee6f23fd4309b3e430b7 vendor.honor.hardware.hyperhold@1.0::IPersistingData
21b541f19570982cd84372cc8038221a5a3ba7b7a52d822abe2340b510ea9b84 vendor.honor.hardware.iawareperf@1.0::IUniPerf
f9a5912bf18bdd3a7fe0e6836fd8fa6027d8e2a519eb27ce3ca70a6d0e3e99c9 vendor.honor.hardware.iawareperfpolicy@1.0::IPerfPolicy
b296f086176f9454b7efc3f20d2663298989cc4ad9e90eda75b01fe5ba21c579 vendor.honor.hardware.irsl@1.0::types
7e9a47155c875999076395cae859c23307f6e3bf87b6527701587030761d0dc7 vendor.honor.hardware.irsl@1.0::IIrselflearning
b758691e8060418e277074070c04c67c6c6b085bca8513d0c5eaeccd6bfe96ae vendor.honor.hardware.isf@1.0::types
a82cf239140be631c7b21d8ec6624ba161f5650acac894d3b964943fe3b7dc0c vendor.honor.hardware.isf@1.0::IISF
462a2fd55e3204e07f9b63ad77f36ad69d8432c2ffda2b3e52a7bcca5134312f vendor.honor.hardware.isf@1.0::IISFCallback
58aac3814961da15a298fbc78dd47d674275c8039844e8011435d2e0258a2b7f vendor.honor.hardware.jpegdec@1.0::types
1ac59f5deba05635bac7aaba22b97fe09bc9f7ad44c5bd48cafcafcf007c96a6 vendor.honor.hardware.jpegdec@1.0::IJpegDecode
4997d3915ab404a80ad8e286d3b71bfe2a79201a173aae6d7cae038206453d31 vendor.honor.hardware.kds@1.0::types
48db2818551bf8ab5261b80869f20b535ecf9fc35790c3b1f7a061b179ab43db vendor.honor.hardware.kds@1.0::IKds
5d64ed718aac841e7f2c474757d2b8d542f7cd150c71ba8dcb510067789f9f05 vendor.honor.hardware.kds@1.1::types
9ec11f6322afe79be19fd1b40626374a6ef990cdc15ccc54662178194e3a0b45 vendor.honor.hardware.kds@1.1::IKds
af55885610b62d990ed46540d57f315f7f191d2ae22c3796a7d5da3194006dd3 vendor.honor.hardware.libteec@2.0::types
1fb8715112e6181541587f0e19a6af07c4ebad9006378af66da828d9d57eebe7 vendor.honor.hardware.libteec@2.0::ILibteecGlobal
68e64a1f764de119690a1d2a580e5ab13b23b1b7c68f0bf70639b8f188e9b6a9 vendor.honor.hardware.libteec@2.0::ILibteecGlobalNotify
ecb6e83e53c4b1172f1d04f2769f9f1a866063d891be993a519855e7f74f3ee0 vendor.honor.hardware.libteec@3.0::types
6dffefdedcd52bb1352cd52e3fa286e7e9aef9a5e92e6da3263102afd541bcb6 vendor.honor.hardware.libteec@3.0::ILibteecGlobal
3792d991292e60d99e436761285d985eb51aca5beda27dcfd76d7cba9f22e4c4 vendor.honor.hardware.libteec@3.0::ILibteecGlobalNotify
e3328d3474510d5399aaa575f894eb5f1e2aaba15c4d58ebbf88cc176c6c9c44 vendor.honor.hardware.light@2.0::types
d734e0852693fde953857f84e264e9c2c35f116c5143d369cbaabdac9434d1c1 vendor.honor.hardware.light@2.0::ILight
a9c223f041936ab96388b3ad4926e6feac4773a03d2fc5b2985eff08809ac506 vendor.honor.hardware.mdlogservice@1.0::IMdLogService
1e846c5a83687a6e9313e4f813d43cccb086e0c61e4452d3541797e5d6f36061 vendor.honor.hardware.mdlogservice@1.1::IMdLogService
6da5d709c0b68bd64c4233a8f3db6de49f6ba2901290b3f08cb914d9893a0947 vendor.honor.hardware.modemchr@1.0::types
8231121ddfb3211b1983a4155bcd2a50237b48dc91080a43ac665fd6b8291e43 vendor.honor.hardware.modemchr@1.0::IModemchrDevice
03f2538c418b81f73096cb7ab3f3d4a821eb8d92d90707f82d1fd677a4a91a41 vendor.honor.hardware.modemchr@1.0::IModemchrResponse
5b70000d81bcc1aff433a1696a85cb36bb80077ad9be18530c2bbe66506b4ae9 vendor.honor.hardware.modemlogcat@1.0::IModemlogcat
c15f7d28ba89ff136adbd8390ca07cc7330d3d70b24fb23139353ad3d287ca65 vendor.honor.hardware.modemlogcat@1.0::IMsgCallback
130bc9ebbde7217e928224343eaafcdcb9b7640c288c947ecdbd15347ecd0df7 vendor.honor.hardware.modemlogcat@1.1::types
b6c2121c560a5ac6b2e95785b97233d276896af43e218fc102533f122a9f0d62 vendor.honor.hardware.modemlogcat@1.1::IModemlogResponse
d052dc01d1e4005c3a43cc277e3a6f96eeda26eeaedc2d8460498803ff36ecae vendor.honor.hardware.modemlogcat@1.1::IModemlogResponseEx
c546571484609bd2d949f61809e4f52c714cdc3beaf6b8af458fa5be117af650 vendor.honor.hardware.modemlogcat@1.1::IModemlogcat
39c36b55698a66a178ebb16c7fcacb132f6a6a8fe6127611a7196c3c171d5813 vendor.honor.hardware.motion@1.0::types
cbca7dc2d7d0856baf5b318d8385db9435ca0b3502b4744e76816f76cf235c50 vendor.honor.hardware.motion@1.0::IMotion
cf99dc506bce9c38679173c57a2445db7085f2abb43a7404bf220ebfd5ec7cbe vendor.honor.hardware.motion@1.0::IMotionCallback
fcaad3a407541695172d7ca546990d39ef4848e29dd90d3aa3a7c00d7a4f8d56 vendor.honor.hardware.nfc@1.0::types
51a9a3a18f9b27564f1696570813172f381e5fe551c63d397335156dc765484a vendor.honor.hardware.nfc@1.0::IHWNfc
b31dc5fbe3c86b1f4ab8ea853bb2ff96868e7858e11702f71583f6841d5b227a vendor.honor.hardware.nfc@1.0::IHWNfcClientCallback
5c3a8f15ba733a414bdfbaf17ff85f92220bdddef8471a9bb74c57a7544dfaec vendor.honor.hardware.nxpese@1.0::types
941973cf12c2ad0f5ee14c6acefb42583f30577992843504e78ceb9b97585e4f vendor.honor.hardware.nxpese@1.0::INxpEse
a57398ec51eb6ce3f67209d68fe8f433e237f99fec48013927de09eb59b8307f vendor.honor.hardware.nxpnfc@1.0::types
66eb267a50489b20e1469dc7dc59ef2d050721a59973c93930877bd3e331eb49 vendor.honor.hardware.nxpnfc@1.0::INxpNfc
7c3e099ad49ed4eda81a177d14d477c478a23d1838a36955327a094df3676f52 vendor.honor.hardware.nxpnfc@2.0::types
16f9520b6bdeea0655b6ca1ae828ff12eaa0ab1b68bd67b2b59584e005f1118c vendor.honor.hardware.nxpnfc@2.0::INxpNfc
35b0a858a3f10e493685d174e70184911eac0fe88505b78c064565eb1a955aac vendor.honor.hardware.otasimlock@1.0::IHwotasimlock
ff05232287560367299ad1dc774a9b92fe9373ace39ca59bc9059d56aeb388c4 vendor.honor.hardware.otasimlock@1.1::types
87b6baa82b410faa6e6f5df7cdd3a6e2fa40b21d80921812ada7e48d6e577a7d vendor.honor.hardware.otasimlock@1.1::IHwotasimlock
b88121f45370dcae7d0a32ec3ad323ce9dd21304ee62ad8c90c7dbe2aac147d5 vendor.honor.hardware.power@1.0::types
ca43dedb4e135c8563554bbfaea2f1e46505581642a29d0c19c55d3aa981a767 vendor.honor.hardware.power@1.0::IHWPower
bb704f11e4c9803323c8353b3a7c4e2fba6d4c5820cd8897451c4b23b84fef6f vendor.honor.hardware.radioenhance@1.0::types
d3c7462340d71f53b2af5a085bae1a25905e25957808cdd5f88c4a7818ec12d4 vendor.honor.hardware.radioenhance@1.0::IRadioenhance
1de4a481c944ee1da7588f3644da193824b2c7e966b9ea8024011f10d8f3a335 vendor.honor.hardware.radio_radar@1.0::types
9a1b4f0a6e73c92dcf13c4fcbe4c0cc9e2a12492653aa8a3bd7f08fdbc3fd7db vendor.honor.hardware.radio_radar@1.0::IRadioIndicationRadar
63711f665f35ab368bec1a807f59f148d3ec02c3db8ecdd44dce397200233d1d vendor.honor.hardware.radio_radar@1.0::IRadioRadar
7cd16d65418dfb7d8351e4daf638bc8de873e5797f670bab7f3eba583044180d vendor.honor.hardware.radio_radar@1.0::IRadioResponseRadar
4e57b5b6c068ac6573f594d0851b1b9de9fffe6e5c03e003b9e388ef86aff1cf vendor.honor.hardware.sensors@1.0::types
f5198f4a15ab5909859a65f113fabffaef244bc219a1bd0e07867c8a719ee847 vendor.honor.hardware.sensors@1.0::ISensors
067b5fa386ea3083d2179e7d113b69c7859f2601c02cf3bd1aabe1471ca65a4d vendor.honor.hardware.sensors@1.1::types
5f0c65044b195a7358eac5f8b5e950fa0f2551ba1283764644becf896c64e9d1 vendor.honor.hardware.sensors@1.1::ISensors
9aa27d0dbac05c88048ad8e98a942c29bb2c82ec5e5ab1b621fb1f45705a1cfa vendor.honor.hardware.sensors@1.2::types
90b6f49b653ea2f84f6c0fea54aff1c8f758996946fe0a4dba507a366718b3e8 vendor.honor.hardware.sensors@1.2::IReportDataCallback
d9d4bd21c98df32c8ff6883482657f0a082f3feedfb95976ea615e4cc2ce94b2 vendor.honor.hardware.sensors@1.2::ISensors
9da9977281b6c0ce352886334f4d1df3063158deacfc4e14c6c37bcc641cbca4 vendor.honor.hardware.sensors@2.0::types
8fdc95d100f3c34cf10009f7e8aeea1417c6bc13af678885f6444fe106d5bafb vendor.honor.hardware.sensors@2.0::ISensors
74cfba4a4a87cc22f3816c145f9948784e0581492d471933b92fc87454bda045 vendor.honor.hardware.sensors@2.0::ISensorsCallback
06e7c2c1be15859473fe61d3a0580882c0c8ec6e00ff7fdaa7b032fec2bade56 vendor.honor.hardware.sensors.extshb@1.0::types
478375bb2d0e5a171dbb91a3721837912b936c2a64a10c15e3d3eceda309e5cc vendor.honor.hardware.sensors.extshb@1.0::IExtShb
baf32ace571b10cd0744e931e0abba34b576575f39d3255b9eebb9e2c11c39dd vendor.honor.hardware.sensors.extshb@1.0::IExtShbCallback
0ee7ae0a3cc73a6362dd8ebe19f2e617327fd61782f426ae7a408ce10b32bfd8 vendor.honor.hardware.sensors.extshb@1.0::IExtShbLogCallback
f25a44a8f17ca9a54bf261ab23ae9857fe7d56174d971f13c440d06706f6007d vendor.honor.hardware.snpelaunch@1.0::types
5bc3122589f1a5ebe93b5a3ba1beee1cb317b250cab023b287d5c8889623941a vendor.honor.hardware.snpelaunch@1.0::ISnpelaunch
e1867845434ca7faf5c8ac98163c2376f1057697fe2dd6c673b4ab0bb10c8c5d vendor.honor.hardware.tp@1.0::types
ab53fbe20ffc1dfa91400b7d07412623b307f8989072020dd3df8f9c8b304c14 vendor.honor.hardware.tp@1.0::ITPCallback
893e18ec2d36874926f40e736171fa04dff6dd1f68a3f3da474c4ed98e995951 vendor.honor.hardware.tp@1.0::ITouchscreen
c3ae031e9452dc05f60c6e3539571ed50691908d80869bcaa4f425515b91183d vendor.honor.hardware.tp@1.1::types
0bfed29aec6c079757a2cc31fdf70a15f669f41dfd70b9f6736c9b8343cfd5c2 vendor.honor.hardware.tp@1.1::ITPCallback
2d184481086ab447201ba2dd382c39f62d79448d5a9bfca1907813a980eccf28 vendor.honor.hardware.tp@1.1::ITouchscreen
9641489363c22aaa54e92c4b8a61b4adcb341578fb570d23fb38b1e9cd2cd8c5 vendor.honor.hardware.vpeer.p2ptransport@1.0::IP2pTransport
da115fed7259a9199af0250390c68116057ffc8e9189b02d4d3500addabb035a vendor.honor.hardware.vpeer.p2ptransport@1.0::IP2pTransportAdapter
be6ffbb5057d67e9170fa3704b2d0ff3b2d77022d8e56a89d4766ab24e56a44b vendor.honor.hardware.vpeer.vpeerfusion@1.0::IVpeerFusion
3a49d714a7130cbd7574921783fb83461cb0a90388ac4980492c091a4fe1bba7 vendor.honor.hardware.vpeer.vpeerfusion@1.0::IVpeerFusionCallback
6e081ddd1beb46af79eedd4bd039c912068c63a2a21973e6a5f54bcc3dbf2452 vendor.honor.hardware.weaver@1.0::types
f6ad362fb933018752a694b3f433b6a4bae5af419f7bcd8806a30328b194ee81 vendor.honor.hardware.weaver@1.0::IWeaver
f53ec10eaa2066cc22b471db1dcfff0f6e03ee46075d7d6483f0c368d3521ab1 vendor.honor.hardware.weaver@1.1::types
1768513386ae5224a415ecfd66dea60ad4a1a517d6e87e7f1d88e5240bb2e03e vendor.honor.hardware.weaver@1.1::IWeaver
3cea2e4daa9889cb1c060463384a92f595a66d461f7041c76becbfa49db3beeb vendor.honor.hardware.wifi@1.0::types
59424d93c4e03ca312e4658b751351a0ca357b267237b5b3c2a5f435e9bbad16 vendor.honor.hardware.wifi@1.0::IHwWifiExt
7ea701c4447064f4731e5ce8c93a574c1bdbe1181358cecf240ca978bc6db60c vendor.honor.hardware.wifi@1.1::types
f59af556fcc8a6f3874e4d44132b3e6fec19df5b461caea02151c8cf2444323a vendor.honor.hardware.wifi@1.1::IHwWifiExt
93197fb716daa48493b3305fe255078622cbce7e2d582dd3f055ec0f9958fb21 vendor.honor.hardware.wifi@1.2::types
8ef05181c3d96c5311100f8f2049603c016fdb419ab686c40c3a560a64d907c8 vendor.honor.hardware.wifi@1.2::IHwWifiExt
cf0416321d62cff8b1690bd7ececd3f6608a1c542e55854d0be0533e992dfb47 vendor.honor.hardware.wifi.p2pext_supplicant@1.0::types
e59962cd0b25703cdf3d98dcacd0ce6ca1ade2ee8cdb19fdcfddb2cba3d34b41 vendor.honor.hardware.wifi.p2pext_supplicant@1.0::IP2pExtSupplicant
09f4c357bd9252d859c9799342d2e11132096d3c0e0ae770f5f39ef9ecf3b4f3 vendor.honor.hardware.wifi.stereo@1.0::IStereo
0f2b3b9418e235dca91dd6f2484969afd5cf74534a8cb066c1b6c4c6a2dd61f2 vendor.honor.hardware.wifi.stereo@1.0::IStereoCallBack
c04c1bf74b3c21cdac2ad6d2a50bec612d4c95a40ef233be95684633674f74da vendor.honor.hardware.wifi.supplicant@1.0::types
530689e7414978135ba507f9999ba677511c777c153f684ac512c2419eb692be vendor.honor.hardware.wifi.supplicant@1.0::ISupplicantP2pIface
ca9366452ec5847a6b0864603954690f3b3ad4b866ad852315538d9113248bfa vendor.honor.hardware.wifi.supplicant@1.0::ISupplicantP2pIfaceCallback
06f7351a6c4820fcc508da957f354b6210362ca915698a96b2afc98af1158754 vendor.honor.hardware.wifi.supplicant@1.0::ISupplicantStaIface
ed8c8757f39f6434dff812c415f68c7f4df5dfcdc3e11f9a71852954eedee937 vendor.honor.hardware.wifi.supplicant@1.0::ISupplicantStaIfaceCallback
91fda12c30dd2e27694546c7654859636160cddc49707a7c00bd3094155fc392 vendor.honor.hardware.wifi.supplicant@1.0::ISupplicantStaNetwork
0b612be9f88a947511a6974498880625561d46420e2364f05064e79eb88d6d05 vendor.honor.hardware.wifi.supplicant@1.1::types
2456cb2c02132490b66a88b29f5dd4601a9b7ef6bd9ee83f938df4c0ed7e1482 vendor.honor.hardware.wifi.supplicant@1.1::ISupplicantP2pIface
3634053f380c74c0819494c631e26a4499877fdfe39bb443396cf42f12ea0535 vendor.honor.hardware.wifi.supplicant@1.1::ISupplicantStaNetwork
a3b06104f22fd17d70c0b25ea7ead137bf0b36d0a8f4862b2cfb5e5a8f03510b vendor.honor.hardware.wifi.supplicant@1.1::ISupplicantStaNetworkCallback
b26849ddf2cf697ad83406dc85cef19f206c0dba3631f3a7043b26ac763bda45 vendor.honor.hardware.wifi.supplicant@2.0::types
74f0b3ccbc85bcb0d21d882726bd8e204d4d5ba4ac116caddac503475c2a5b22 vendor.honor.hardware.wifi.supplicant@2.0::ISupplicant
3224b7c1e33e891162f5c8993f8c414b092eb88311610fe8b4f4235b4fc52ca5 vendor.honor.hardware.wifi.supplicant@2.0::ISupplicantP2pIface
400a885f4a94802ba565322599c1708fb77671880b725a31d54fb068f404326b vendor.honor.hardware.wifi.supplicant@2.0::ISupplicantP2pIfaceCallback
fbfc730168051be650da486f91b7c9fc6edbce5341afa59496662a3a10fc3389 vendor.honor.hardware.wifi.supplicant@2.0::ISupplicantStaIface
0244129f742d36f9498b975eafd2f456f6d9046b3abafde9c52ca973a815ba81 vendor.honor.hardware.wifi.supplicant@2.0::ISupplicantStaIfaceCallback
a817074ea11dc9c07242cc828c01b15b563032bcb10e50f7857fa3c8be38b768 vendor.honor.hardware.wifi.supplicant@2.0::ISupplicantStaNetwork
a50c4c9a6d8c434c2604797f91e33104b7e31ff05dc0f2a917146cbaae73c7f1 vendor.honor.hardware.wifi.supplicant@2.0::ISupplicantStaNetworkCallback
f71cee3f3155c7b98ff6ef0b7ec26a4afdfe286d101334e35857f9c5233b5ca6 vendor.honor.hardware.wifi.supplicant@3.0::ISupplicant
f497406546a24d6217569c33efe312e76eca3f9daa68612db9259f38490ebdc2 vendor.honor.hardware.wifi.supplicant@3.0::ISupplicantP2pIface
ab4fdf52f9bf6a99a57d529e0ebef304d3d9955f7d54e795b3f7e1fb616ff847 vendor.honor.hardware.wifi.supplicant@3.0::ISupplicantP2pIfaceCallback
e93affea2ec6786cef6c1f7e480f3f7bb56a2b0295f672ce6b9264a2e3a1861f vendor.honor.hardware.wifi.supplicant@3.0::ISupplicantStaIface
cf45b9d391d3289e8034b1701bf2dc6dde7189c593aa1012385d816ab42bb3f2 vendor.honor.hardware.wifi.supplicant@3.0::ISupplicantStaIfaceCallback
d31485d463a04dee9b64aedbce17eb43345bf4c7cad3501818c083eaf05b94bf vendor.honor.hardware.wifi.supplicant@3.0::ISupplicantStaNetwork
a49abd6d405ebfb4e2e5cb2c9140be0e57356d48755f30cf453ca24dda51581b vendor.honor.hardware.wifi.supplicant@3.0::ISupplicantStaNetworkCallback
b2739e9168322bd6dd0467a518dfadfa763dd94be719d5888b61db5e772775b3 vendor.honor.hardware.wifi.supplicant@4.0::ISupplicant
f38a159fc1830408768a55e7b9197812ab279087ba7f80d5eb7211d4ff51106f vendor.honor.hardware.wifi.supplicant@4.0::ISupplicantP2pIface
380d4f2abef7ee231a8059b7eea5048a2feb6881a8ae6266cb62e4981d224d80 vendor.honor.hardware.wifi.supplicant@4.0::ISupplicantP2pIfaceCallback
44de3eec01403a88a3990bf08c46fa7d782d3964f95dec6d320e89d2e8458be8 vendor.honor.hardware.wifi.supplicant@4.0::ISupplicantStaIface
7b3e17192a1f9cee308882fe532a7c095c8a9c3eb4b1c0dbecc6b4da2399cc4a vendor.honor.hardware.wifi.supplicant@4.0::ISupplicantStaIfaceCallback
f4e98c9a626d1672fa985f6f71cf6e669816606c717160f5de1f093e19ba248f vendor.honor.hardware.wifi.supplicant@4.0::ISupplicantStaNetwork
ee8f5ac52fed605c3252b0dd6fc98bcf12eeffc5123d279b0bee7b2ee66dba4a vendor.honor.hardware.wifi.supplicant@4.0::ISupplicantStaNetworkCallback
17e49c3c7997ffd098da65115d3065a09776fa55e0f39266cc04892023d320f0 vendor.honor.hardware.wifi.waudio@1.0::IWaudio
9f4732587d1bc01e710715b1da36a67e7ccd732111d9d3664927298a6b2b4d80 vendor.honor.hardware.wifi.waudio@1.0::IWaudioCallback
76dea966bbcb463318b59b6a94da80ea7ff8b9b6fc753a4c4ebe9c598ee5b7b1 vendor.honor.hardware.pixelworks_display@1.0::types
3d54d12a9b99f9b198b0839aea85f7eb83fa61cf5115cadf5f0b602dc8d6b202 vendor.honor.hardware.pixelworks_display@1.0::IIris
4eeb5fc49d0be4b65b99aca1930788f9a3cf5b4ab0795e07c6e985d724b5dc72 vendor.honor.hardware.pixelworks_display@1.0::IIrisCallback
279d5f896f7692350f9214664d035e9db9a1b6d02747b49e225fdc4feb7cbd3f vendor.honor.hardware.pixelworks_display@1.1::types
dfed69e7cd90e3c007aad704a97c3234046ffd4a77c2fb0ac7fd65a5590901ba vendor.honor.hardware.pixelworks_display@1.1::IIris
8886d97a60f5dce87719e0d4b8c1dd522eeae0d4b122159cc3eae96ab619b61d vendor.honor.hardware.pixelworks_display@1.1::IIrisCallback
e8b2c0e9790c3f0f4fa67083cf98046559725942d01e5f9d97f97bd338e69977 vendor.honor.hardware.pixelworks_display@1.1::ISoftIrisClient
f2e121e317a784b5eb6e67b5041f89ea5c7cdf26c23b34b2276f1c65574286b1 vendor.honor.hardware.pixelworks_feature@1.0::types
97707df1fb581aa2f3a2e6ef52a621ff5329bab9798361bc1bd0b75b29fca36f vendor.honor.hardware.pixelworks_feature@1.0::IIrisFeature
504318b1796acd69f4116a76cf865202f3314e6c8f4e0f69a4613aa45b1d38c8 vendor.honor.hardware.dtv@1.0::IHwdtv
6adc21a1f119c4063cb7ea679c53bf7f173bf3d03b090874b3b405b2b5e8d115 vendor.honor.hardware.dtv@1.0::IHwdtvCallback
610df478635de1c29d3d2abd3ced397576b093f0d7638c19f8808c4471e4ae27 vendor.honor.hardware.tv@1.0::types
a0ee63c97c92fcd81aa34eaab2e2c33107249aaf5d2676e054f1bc7ab76040f8 vendor.honor.hardware.tv@1.0::IHwtvmw
90d1f6a0427aae8cfbeb7bc967578b7c2e8a4c52d21cf39982412640b8fa6efd vendor.honor.hardware.tv@1.0::IHwtvmwCallback
0ae14c009e762b9af46820fa63abb90b9d04fed1e421c914524825a5d93cb234 vendor.honor.hardware.tvadaptor@1.0::types
f2bd0c8151a613864d84d19f217c9352a8d3646686fdb598b584726bf8b28f16 vendor.honor.hardware.tvadaptor@1.0::IAudioExt
1e7483ca9040e0281bf8374719bd8d8a3380acc0098d957eb5e56aee85a0edee vendor.honor.hardware.tvadaptor@1.0::ICecCallback
a95a453bfdd349537be9c62ae3b8f4a1bf8189989cd0c1717dc282a841dcd548 vendor.honor.hardware.tvadaptor@1.0::ICecExt
98a4f4152008b8c878dd04d78c56acaa2381ccbdb5c4c64ee281042ff2ad3d13 vendor.honor.hardware.tvadaptor@1.0::IDTVAVSync
8d3190819996287fd74d0ed69b9dab42efde71fa602f810571b88911a2dff09a vendor.honor.hardware.tvadaptor@1.0::IDTVDemodExt
d02dc2fd53cc17fc64d1031ad33eb941ded2fe6545f3a99b1f814ae655a2ab2f vendor.honor.hardware.tvadaptor@1.0::IDTVDemuxExt
6a02a910485dc9ab5f2963fce66ce7b3b3c8058b70e474c11700cf140c6dbd00 vendor.honor.hardware.tvadaptor@1.0::IDTVTunerExt
2892fe4dd809665ead926766712202aec75c2f0ad5327dfffa57a5b07dcda1eb vendor.honor.hardware.tvadaptor@1.0::IDTVVideoExt
efb15e09779384d57cf7ff284da1bc06d71a015ecf5823a5504c5bf92684a2d9 vendor.honor.hardware.tvadaptor@1.0::IDevCtrlExt
e9d00e808b847403731b5874c8dd85201dc99adf4abbb0bcf47af6bc69002018 vendor.honor.hardware.tvadaptor@1.0::IFactoryExt
b6b66c77198fa7fe3bb53b56e58fb5f5e9795ffab9f983450c82ea342f4c4717 vendor.honor.hardware.tvadaptor@1.0::IHndtvCallback
271b3f4e416f992ed9e527ec9c945bc5f4da813e709f8e11e0f937a37861b84f vendor.honor.hardware.tvadaptor@1.0::IPictureExt
ccf36ae867f91425110e99f021462ab4d729b3707c9b80b667beee8deca2289f vendor.honor.hardware.tvadaptor@1.0::IScreenRecord
aa5f88682da7e6228285560aeb379aca6c109a047a155f4146ca0cc527745174 vendor.honor.hardware.tvadaptor@1.0::IScreenRecordListener
02118d0f484e182de73841a780dcdad16cdc2519d43fa4f7338355096920fd6d vendor.honor.hardware.tvadaptor@1.0::ISystemCallback
da0801215f4b7e458a2b4a8ccb9f7e5069d3faf875fc0eb56a110a97ca7e4b4d vendor.honor.hardware.tvadaptor@1.0::ISystemExt
819b796bfd9aaf4e4efc0029e8ef82f976f3777e312038088213f2d4444142fe vendor.honor.hardware.tvadaptor@1.0::IVideoExt
2f21c10017aede3b0309c075689b7e4c7b8941e10d1c7dbc8bb4adc35022e40a vendor.honor.hardware.hnblesensorhub@1.0::types
c620a8f25453b30f1bd1d23dad908ac1d8ff82eb9f13b2dfd9e58e075968535b vendor.honor.hardware.hnblesensorhub@1.0::IHnBleSensorHub
766522d4364120a56c5b250244c79ed247092afaed4d8fb3e2cb56f73d11b161 vendor.honor.hardware.hnblesensorhub@1.0::IHnBleSensorHubCallback
52b3507b722c7062cc86b9f70922b3df1c372306f4d47a13aca5c09b54a18baf vendor.honor.hardware.hnblesensorhub@1.1::types
a6726c1dcbc65860e0ebf0bf71eff6c964302543a6b567fb0ca157aa01fa8c23 vendor.honor.hardware.hnblesensorhub@1.1::IHnBleSensorHub
342bbc497ce2bdc2cf010611327a3777cb11b4eed6db073380e5ecd6e56b1811 vendor.honor.hardware.hnblesensorhub@1.1::IHnBleSensorHubCallback
1427e27b328fae0c6e62ee848436909303ef0865650ea00da1c83adbaf5cf0b4 vendor.honor.hardware.camera.hulk@1.0::types
790ed04307133a398eaa313fb87a5df97afa99fd318da61fffb50a1daa8533fe vendor.honor.hardware.camera.hulk@1.0::IHulkService
89456bd4acf1b61cf32bef10a405c5ee79100adead2c33e3ec328e73913d43e7 vendor.honor.hardware.camera.hulk@1.0::IHulkPostProcCallback
