{"expresscode":"ZTO","expressname":"中通快递","expressalias":[{"isCertain":"0","name":"中通快递"},{"isCertain":"0","name":"中通速递"},{"isCertain":"0","name":"中通速运"},{"isCertain":"0","name":"中通"},{"isCertain":"2","name":"ZTO"},{"isCertain":"2","name":"zto"}]}
{"expresscode":"YTO","expressname":"圆通速递","expressalias":[{"isCertain":"0","name":"圆通速递"},{"isCertain":"0","name":"圆通速运"},{"isCertain":"0","name":"圆通快递"},{"isCertain":"0","name":"圆通"},{"isCertain":"2","name":"YTO"},{"isCertain":"2","name":"yto"}]}
{"expresscode":"STO","expressname":"申通快递","expressalias":[{"isCertain":"0","name":"申通快递"},{"isCertain":"0","name":"申通速递"},{"isCertain":"0","name":"申通快运"},{"isCertain":"0","name":"申通"},{"isCertain":"2","name":"STO"},{"isCertain":"2","name":"sto"}]}
{"expresscode":"YUNDA","expressname":"韵达快递","expressalias":[{"isCertain":"0","name":"韵达快递"},{"isCertain":"0","name":"韵达速递"},{"isCertain":"0","name":"韵达"},{"isCertain":"2","name":"YUNDA"},{"isCertain":"2","name":"yunda"}]}
{"expresscode":"YDKY","expressname":"韵达快运","expressalias":[{"isCertain":"0","name":"韵达快运"}]}
{"expresscode":"HTKY","expressname":"百世快递","expressalias":[{"isCertain":"0","name":"百世快递"},{"isCertain":"0","name":"百世物流"},{"isCertain":"0","name":"百世汇通"},{"isCertain":"0","name":"汇通快递"},{"isCertain":"0","name":"汇通速递"},{"isCertain":"0","name":"汇通速运"},{"isCertain":"1","name":"百世"},{"isCertain":"1","name":"汇通"}]}
{"expresscode":"SF","expressname":"顺丰速运","expressalias":[{"isCertain":"0","name":"顺丰速运"},{"isCertain":"0","name":"顺丰快递"},{"isCertain":"0","name":"顺丰速递"},{"isCertain":"0","name":"顺丰"},{"isCertain":"2","name":"SF"},{"isCertain":"2","name":"sf"}]}
{"expresscode":"TTKDEX","expressname":"天天快递","expressalias":[{"isCertain":"0","name":"天天快递"},{"isCertain":"1","name":"天天"},{"isCertain":"2","name":"TTK"},{"isCertain":"2","name":"ttk"}]}
{"expresscode":"FAST","expressname":"快捷快递","expressalias":[{"isCertain":"0","name":"快捷快递"},{"isCertain":"0","name":"快捷速递"},{"isCertain":"1","name":"快捷"}]}
{"expresscode":"QFKD","expressname":"全峰快递","expressalias":[{"isCertain":"0","name":"全峰快递"},{"isCertain":"0","name":"全峰"}]}
{"expresscode":"GTO","expressname":"国通快递","expressalias":[{"isCertain":"0","name":"国通快递"},{"isCertain":"1","name":"国通"}]}
{"expresscode":"ZJS","expressname":"宅急送","expressalias":[{"isCertain":"0","name":"宅急送"}]}
{"expresscode":"UC","expressname":"优速物流","expressalias":[{"isCertain":"0","name":"优速物流"},{"isCertain":"0","name":"优速快递"},{"isCertain":"0","name":"优速"}]}
{"expresscode":"DBKD","expressname":"德邦快递","expressalias":[{"isCertain":"0","name":"德邦快递"},{"isCertain":"1","name":"德邦"}]}
{"expresscode":"DBL","expressname":"德邦物流","expressalias":[{"isCertain":"0","name":"德邦物流"}]}
{"expresscode":"EMS","expressname":"EMS","expressalias":[{"isCertain":"2","name":"EMS"},{"isCertain":"2","name":"ems"},{"isCertain":"0","name":"中速快递"},{"isCertain":"0","name":"中国邮政速递物流"},{"isCertain":"0","name":"E特快"},{"isCertain":"0","name":"e特快"},{"isCertain":"0","name":"e邮宝"},{"isCertain":"0","name":"E邮宝"},{"isCertain":"0","name":"中国邮政EMS"}]}
{"expresscode":"EMSGJ","expressname":"EMS国际","expressalias":[{"isCertain":"0","name":"EMS国际"},{"isCertain":"0","name":"EMS国际查询"},{"isCertain":1,"name":"ems国际"},{"isCertain":1,"name":"ems国际查询"}]}
{"expresscode":"CNPOSTGJ","expressname":"邮政国际包裹","expressalias":[{"isCertain":"0","name":"邮政国际包裹"}]}
{"expresscode":"POSTB","expressname":"邮政快递包裹","expressalias":[{"isCertain":"0","name":"邮政快递包裹"},{"isCertain":"0","name":"邮政包裹"},{"isCertain":0,"name":"包裹信件"},{"isCertain":"0","name":"邮政标准快递"},{"isCertain":"0","name":"邮政快递"},{"isCertain":"0","name":"中国邮政"},{"isCertain":"1","name":"邮政"}]}
{"expresscode":"DHLDE","expressname":"DHL德国","expressalias":[{"isCertain":"0","name":"DHL德国"},{"isCertain":"0","name":"DHL-德国"},{"isCertain":1,"name":"dhl德国"},{"isCertain":1,"name":"dhl-德国"}]}
{"expresscode":"KERRYEAS","expressname":"嘉里大通","expressalias":[{"isCertain":"0","name":"嘉里大通"}]}
{"expresscode":"TMS56","expressname":"加运美","expressalias":[{"isCertain":"0","name":"加运美"}]}
{"expresscode":"POSTSE","expressname":"瑞典邮政","expressalias":[{"isCertain":"0","name":"瑞典邮政"}]}
{"expresscode":"TNT","expressname":"TNT","expressalias":[{"isCertain":"2","name":"TNT"},{"isCertain":"0","name":"TNT快递"},{"isCertain":2,"name":"tnt"},{"isCertain":0,"name":"tnt快递"}]}
{"expresscode":"UPS","expressname":"UPS","expressalias":[{"isCertain":"2","name":"UPS"},{"isCertain":2,"name":"ups"}]}
{"expresscode":"USPS","expressname":"USPS","expressalias":[{"isCertain":"2","name":"USPS"},{"isCertain":"2","name":"usps"},{"isCertain":"1","name":"美国邮政"}]}
{"expresscode":"DHLCN","expressname":"DHL中国","expressalias":[{"isCertain":"0","name":"DHL中国"},{"isCertain":"0","name":"DHL-中国件"},{"isCertain":"0","name":"DHL中国件"},{"isCertain":1,"name":"dhl中国"},{"isCertain":1,"name":"dhl-中国件"},{"isCertain":1,"name":"dhl中国件"},{"isCertain":2,"name":"dhl"},{"isCertain":2,"name":"DHL"}]}
{"expresscode":"ZTKY","expressname":"中铁物流","expressalias":[{"isCertain":"0","name":"中铁物流"},{"isCertain":"0","name":"中铁快递"},{"isCertain":"0","name":"飞豹快递"},{"isCertain":"1","name":"飞豹"}]}
{"expresscode":"DHL","expressname":"DHL全球","expressalias":[{"isCertain":"0","name":"DHL全球"},{"isCertain":1,"name":"dhl全球"}]}
{"expresscode":"FEDEX","expressname":"FedEx国际","expressalias":[{"isCertain":"0","name":"FedEx国际"},{"isCertain":"1","name":"FedEx-国际"}]}
{"expresscode":"FEDEXUS","expressname":"FedEx美国","expressalias":[{"isCertain":"0","name":"FedEx美国"},{"isCertain":1,"name":"FedEx-美国"}]}
{"expresscode":"FEDEXCN","expressname":"FedEx中国","expressalias":[{"isCertain":"0","name":"FedEx中国"},{"isCertain":1,"name":"FedEx-中国"}]}
{"expresscode":"POSTTH","expressname":"泰国邮政","expressalias":[{"isCertain":"0","name":"泰国邮政"}]}
{"expresscode":"XFWL","expressname":"信丰物流","expressalias":[{"isCertain":"0","name":"信丰物流"},{"isCertain":"0","name":"信丰快递"},{"isCertain":"1","name":"信丰"}]}
{"expresscode":"RRS","expressname":"日日顺物流","expressalias":[{"isCertain":"0","name":"日日顺物流"},{"isCertain":"0","name":"日日顺快递"},{"isCertain":"1","name":"日日顺"}]}
{"expresscode":"EWINSHINE","expressname":"万象物流","expressalias":[{"isCertain":"0","name":"万象物流"},{"isCertain":"0","name":"万象快递"},{"isCertain":"1","name":"万象"}]}
{"expresscode":"RFD","expressname":"如风达","expressalias":[{"isCertain":"0","name":"如风达"}]}
{"expresscode":"ANE56","expressname":"安能","expressalias":[{"isCertain":"0","name":"安能物流"},{"isCertain":"0","name":"安能快递"},{"isCertain":"1","name":"安能"}]}
{"expresscode":"HOAU","expressname":"天地华宇","expressalias":[{"isCertain":"0","name":"天地华宇"},{"isCertain":1,"name":"华宇"}]}
{"expresscode":"JIAJI","expressname":"佳吉快运","expressalias":[{"isCertain":"0","name":"佳吉快运"},{"isCertain":"0","name":"佳吉快递"},{"isCertain":"0","name":"佳吉物流"},{"isCertain":"1","name":"佳吉"}]}
{"expresscode":"SURE","expressname":"速尔快递","expressalias":[{"isCertain":"0","name":"速尔快递"},{"isCertain":"1","name":"速尔"}]}
{"expresscode":"UAPEX","expressname":"全一快递","expressalias":[{"isCertain":"0","name":"全一快递"},{"isCertain":"1","name":"全一"}]}
{"expresscode":"QRT","expressname":"全日通","expressalias":[{"isCertain":"0","name":"全日通"}]}
{"expresscode":"GZFY","expressname":"凡宇快递","expressalias":[{"isCertain":"0","name":"凡宇快递"},{"isCertain":"1","name":"凡宇"}]}
{"expresscode":"XBWL","expressname":"新邦物流","expressalias":[{"isCertain":"0","name":"新邦物流"},{"isCertain":"0","name":"新邦快递"},{"isCertain":"1","name":"新邦"}]}
{"expresscode":"CAE","expressname":"民航快递","expressalias":[{"isCertain":"0","name":"民航快递"},{"isCertain":"1","name":"民航"}]}
{"expresscode":"CRE","expressname":"中铁快运","expressalias":[{"isCertain":"0","name":"中铁快运"},{"isCertain":"1","name":"中铁"}]}
{"expresscode":"FEC","expressname":"银捷速递","expressalias":[{"isCertain":"0","name":"银捷速递"},{"isCertain":1,"name":"银捷"}]}
{"expresscode":"FJSFWLJTYXGS","expressname":"盛丰物流","expressalias":[{"isCertain":"0","name":"盛丰物流"},{"isCertain":"0","name":"盛丰快递"},{"isCertain":"1","name":"盛丰"}]}
{"expresscode":"HLWL","expressname":"恒路物流","expressalias":[{"isCertain":"0","name":"恒路物流"},{"isCertain":"0","name":"恒路快递"},{"isCertain":"1","name":"恒路"}]}
{"expresscode":"JDKD","expressname":"京东快递","expressalias":[{"isCertain":"0","name":"京东快递"},{"isCertain":"0","name":"京东物流"},{"isCertain":"1","name":"京东"},{"isCertain":"2","name":"JD"},{"isCertain":"2","name":"jd"}]}
{"expresscode":"JIAYI","expressname":"佳怡物流","expressalias":[{"isCertain":"0","name":"佳怡物流"},{"isCertain":"0","name":"佳怡快递"},{"isCertain":"1","name":"佳怡"}]}
{"expresscode":"KYE","expressname":"跨越速运","expressalias":[{"isCertain":"0","name":"跨越速运"},{"isCertain":"0","name":"跨越速递"},{"isCertain":"1","name":"跨越"}]}
{"expresscode":"LTS","expressname":"联昊通","expressalias":[{"isCertain":"0","name":"联昊通"}]}
{"expresscode":"SZSA56","expressname":"圣安物流","expressalias":[{"isCertain":"0","name":"圣安物流"},{"isCertain":"0","name":"圣安快递"},{"isCertain":"1","name":"圣安"}]}
{"expresscode":"SHENGHUI","expressname":"盛辉物流","expressalias":[{"isCertain":"0","name":"盛辉物流"},{"isCertain":"0","name":"盛辉快递"},{"isCertain":"1","name":"盛辉"}]}
{"expresscode":"SZKKE","expressname":"京广速递","expressalias":[{"isCertain":"0","name":"京广速递"},{"isCertain":"1","name":"京广"}]}
{"expresscode":"YCKY","expressname":"远成快运","expressalias":[{"isCertain":"1","name":"远成"},{"isCertain":"0","name":"远成物流"},{"isCertain":"0","name":"远成快递"},{"isCertain":"0","name":"远成快运"}]}
{"expresscode":"YTZG","expressname":"运通中港快递","expressalias":[{"isCertain":"0","name":"运通中港快递"},{"isCertain":"0","name":"运通中港"},{"isCertain":"0","name":"运通快递"},{"isCertain":1,"name":"运通"}]}
{"expresscode":"POSTBR","expressname":"巴西邮政","expressalias":[{"isCertain":"0","name":"巴西邮政"}]}
{"expresscode":"POSTCH","expressname":"瑞士邮政","expressalias":[{"isCertain":"0","name":"瑞士邮政"}]}
{"expresscode":"BLSYZ","expressname":"比利时邮政","expressalias":[{"isCertain":"0","name":"比利时邮政"}]}
{"expresscode":"RBYZEMS","expressname":"日本邮政","expressalias":[{"isCertain":"0","name":"日本邮政"},{"isCertain":"0","name":"日本邮政（Japan Post）"},{"isCertain":0,"name":"日本邮政(Japan Post)"}]}
{"expresscode":"EPOST","expressname":"韩国邮政","expressalias":[{"isCertain":"0","name":"韩国邮政"}]}
{"expresscode":"EYB","expressname":"EMS经济快递","expressalias":[{"isCertain":"0","name":"EMS经济快递"}]}
{"expresscode":"BESTQJT","expressname":"百世快运","expressalias":[{"isCertain":"0","name":"百世快运"}]}
{"expresscode":"HUANGMAJIA","expressname":"黄马甲配送","expressalias":[{"isCertain":"0","name":"黄马甲配送"},{"isCertain":1,"name":"黄马甲"},{"isCertain":"0","name":"黄马甲快递"}]}
{"expresscode":"CHENGBANG","expressname":"晟邦物流","expressalias":[{"isCertain":"0","name":"晟邦物流"},{"isCertain":"0","name":"南京晟邦"},{"isCertain":"0","name":"南京晟邦物流"},{"isCertain":"0","name":"南京晟邦快递"},{"isCertain":0,"name":"晟邦快递"},{"isCertain":"1","name":"晟邦"}]}
{"expresscode":"GZLT","expressname":"飞远配送","expressalias":[{"isCertain":"0","name":"飞远配送"},{"isCertain":"1","name":"飞远"}]}
{"expresscode":"HZABC","expressname":"飞远(爱彼西)配送","expressalias":[{"isCertain":"0","name":"飞远(爱彼西)配送"},{"isCertain":"0","name":"飞远（爱彼西）配送"},{"isCertain":1,"name":"飞远(爱彼西)"},{"isCertain":1,"name":"飞远（爱彼西）"}]}
{"expresscode":"SNWL","expressname":"苏宁快递","expressalias":[{"isCertain":"0","name":"苏宁快递"},{"isCertain":"0","name":"苏宁物流"},{"isCertain":"0","name":"苏宁易购快递"},{"isCertain":1,"name":"苏宁"},{"isCertain":"2","name":"SUNING"},{"isCertain":"2","name":"suning"}]}
{"expresscode":"ZMKM","expressname":"芝麻开门","expressalias":[{"isCertain":"0","name":"芝麻开门"},{"isCertain":"0","name":"丹鸟快递"},{"isCertain":"0","name":"丹鸟物流"},{"isCertain":"1","name":"丹鸟"}]}
{"expresscode":"JDYWL","expressname":"筋斗云物流","expressalias":[{"isCertain":"0","name":"筋斗云物流"},{"isCertain":"1","name":"筋斗云"}]}
{"expresscode":"BJCS","expressname":"城市一百物流","expressalias":[{"isCertain":"0","name":"城市一百物流"},{"isCertain":"0","name":"城市100"},{"isCertain":1,"name":"城市一百"}]}
{"expresscode":"LB","expressname":"龙邦速递","expressalias":[{"isCertain":"0","name":"龙邦速递"},{"isCertain":"1","name":"龙邦"}]}
{"expresscode":"YCT","expressname":"黑猫宅急便","expressalias":[{"isCertain":"0","name":"黑猫宅急便"},{"isCertain":"0","name":"宅急便"}]}
{"expresscode":"ROYALMAIL","expressname":"英国皇家邮政","expressalias":[{"isCertain":"0","name":"英国皇家邮政"}]}
{"expresscode":"JKYZ","expressname":"捷克邮政","expressalias":[{"isCertain":"0","name":"捷克邮政"}]}
{"expresscode":"BLYZ","expressname":"波兰邮政","expressalias":[{"isCertain":"0","name":"波兰邮政"}]}
{"expresscode":"FGYZ","expressname":"法国邮政","expressalias":[{"isCertain":"0","name":"法国邮政"}]}
{"expresscode":"POSTTR","expressname":"土耳其邮政","expressalias":[{"isCertain":"0","name":"土耳其邮政"}]}
{"expresscode":"POSTCL","expressname":"智利邮政","expressalias":[{"isCertain":"0","name":"智利邮政"}]}
{"expresscode":"POSTBY","expressname":"白俄罗斯邮政","expressalias":[{"isCertain":"0","name":"白俄罗斯邮政"}]}
{"expresscode":"POSTES","expressname":"西班牙邮政","expressalias":[{"isCertain":"0","name":"西班牙邮政"}]}
{"expresscode":"POSTUA","expressname":"乌克兰邮政","expressalias":[{"isCertain":"0","name":"乌克兰邮政"}]}
{"expresscode":"POSTNO","expressname":"挪威邮政","expressalias":[{"isCertain":"0","name":"挪威邮政"}]}
{"expresscode":"POSTZA","expressname":"南非邮政","expressalias":[{"isCertain":"0","name":"南非邮政"}]}
{"expresscode":"POSTPT","expressname":"葡萄牙邮政","expressalias":[{"isCertain":"0","name":"葡萄牙邮政"}]}
{"expresscode":"POSTSA","expressname":"沙特邮政","expressalias":[{"isCertain":"0","name":"沙特邮政"}]}
{"expresscode":"POSTIN","expressname":"印度邮政","expressalias":[{"isCertain":"0","name":"印度邮政"}]}
{"expresscode":"POSTBG","expressname":"保加利亚邮政","expressalias":[{"isCertain":"0","name":"保加利亚邮政"}]}
{"expresscode":"POSTAE","expressname":"阿联酋邮政","expressalias":[{"isCertain":"0","name":"阿联酋邮政"}]}
{"expresscode":"POSTAU","expressname":"澳大利亚邮政","expressalias":[{"isCertain":"0","name":"澳大利亚邮政"}]}
{"expresscode":"POSTPK","expressname":"巴基斯坦邮政","expressalias":[{"isCertain":"0","name":"巴基斯坦邮政"}]}
{"expresscode":"POSTMT","expressname":"马耳他邮政","expressalias":[{"isCertain":"0","name":"马耳他邮政"}]}
{"expresscode":"POSTLB","expressname":"黎巴嫩邮政","expressalias":[{"isCertain":"0","name":"黎巴嫩邮政"}]}
{"expresscode":"POSTMD","expressname":"摩尔多瓦邮政","expressalias":[{"isCertain":"0","name":"摩尔多瓦邮政"}]}
{"expresscode":"POSTSRB","expressname":"塞尔维亚邮政","expressalias":[{"isCertain":"0","name":"塞尔维亚邮政"}]}
{"expresscode":"POSTHR","expressname":"克罗地亚邮政","expressalias":[{"isCertain":"0","name":"克罗地亚邮政"}]}
{"expresscode":"POSTAM","expressname":"亚美尼亚邮政","expressalias":[{"isCertain":"0","name":"亚美尼亚邮政"}]}
{"expresscode":"POSTMK","expressname":"马其顿邮政","expressalias":[{"isCertain":"0","name":"马其顿邮政"}]}
{"expresscode":"ONTRAC","expressname":"OnTrac","expressalias":[{"isCertain":"0","name":"OnTrac"}]}
{"expresscode":"CITYLINK","expressname":"City-Link","expressalias":[{"isCertain":"0","name":"City-Link"}]}
{"expresscode":"COE","expressname":"COE","expressalias":[{"isCertain":"2","name":"COE"},{"isCertain":"0","name":"COE快递"},{"isCertain":"0","name":"东方快递"},{"isCertain":"0","name":"中国东方(COE)"},{"isCertain":0,"name":"中国东方（COE）"},{"isCertain":2,"name":"coe"},{"isCertain":0,"name":"coe快递"},{"isCertain":"0","name":"东方快递"},{"isCertain":0,"name":"中国东方(coe)"},{"isCertain":0,"name":"中国东方（coe）"}]}
{"expresscode":"DTW","expressname":"大田物流","expressalias":[{"isCertain":"0","name":"大田物流"},{"isCertain":"0","name":"大田快递"},{"isCertain":"1","name":"大田"}]}
{"expresscode":"EES","expressname":"百福东方","expressalias":[{"isCertain":"0","name":"百福东方"}]}
{"expresscode":"MBEX","expressname":"民邦快递","expressalias":[{"isCertain":"0","name":"民邦快递"},{"isCertain":"0","name":"民邦速递"},{"isCertain":"1","name":"民邦"}]}
{"expresscode":"HQKY","expressname":"华企快运","expressalias":[{"isCertain":"0","name":"华企快运"}]}
{"expresscode":"YFEXPRESS","expressname":"越丰物流","expressalias":[{"isCertain":"0","name":"越丰物流"},{"isCertain":"0","name":"越丰快递"},{"isCertain":"1","name":"越丰"}]}
{"expresscode":"AIR","expressname":"亚风速递","expressalias":[{"isCertain":"0","name":"亚风速递"},{"isCertain":"1","name":"亚风"}]}
{"expresscode":"MANCOWL","expressname":"万家物流","expressalias":[{"isCertain":"0","name":"万家物流"},{"isCertain":"0","name":"万家快递"},{"isCertain":"1","name":"万家"}]}
{"expresscode":"SZML56","expressname":"明亮物流","expressalias":[{"isCertain":"0","name":"明亮物流"},{"isCertain":"0","name":"明亮快递"},{"isCertain":"1","name":"明亮"}]}
{"expresscode":"CXCOD","expressname":"传喜物流","expressalias":[{"isCertain":"0","name":"传喜物流"},{"isCertain":"0","name":"传喜快递"},{"isCertain":"1","name":"传喜"}]}
{"expresscode":"4PX","expressname":"递四方","expressalias":[{"isCertain":"0","name":"递四方"}]}
{"expresscode":"POSTFI","expressname":"芬兰邮政","expressalias":[{"isCertain":"0","name":"芬兰邮政"}]}
{"expresscode":"POSTAR","expressname":"阿根廷邮政","expressalias":[{"isCertain":"0","name":"阿根廷邮政"}]}
{"expresscode":"POSTSK","expressname":"斯洛伐克邮政","expressalias":[{"isCertain":"0","name":"斯洛伐克邮政"}]}
{"expresscode":"SERPOST","expressname":"秘鲁邮政","expressalias":[{"isCertain":"0","name":"秘鲁邮政"}]}
{"expresscode":"POSTIT","expressname":"意大利邮政","expressalias":[{"isCertain":"0","name":"意大利邮政"}]}
{"expresscode":"POSTSI","expressname":"斯洛文尼亚邮政","expressalias":[{"isCertain":"0","name":"斯洛文尼亚邮政"}]}
{"expresscode":"POSTHU","expressname":"匈牙利邮政","expressalias":[{"isCertain":"0","name":"匈牙利邮政"}]}
{"expresscode":"POSTMU","expressname":"毛里求斯邮政","expressalias":[{"isCertain":"0","name":"毛里求斯邮政"}]}
{"expresscode":"POSTAT","expressname":"奥地利邮政","expressalias":[{"isCertain":"0","name":"奥地利邮政"}]}
{"expresscode":"POSTAL","expressname":"阿尔巴尼亚邮政","expressalias":[{"isCertain":"0","name":"阿尔巴尼亚邮政"}]}
{"expresscode":"POSTEE","expressname":"爱沙尼亚邮政","expressalias":[{"isCertain":"0","name":"爱沙尼亚邮政"}]}
{"expresscode":"ARAMEX","expressname":"Aramex","expressalias":[{"isCertain":"0","name":"Aramex"}]}
{"expresscode":"SANTAI","expressname":"三态速递","expressalias":[{"isCertain":"0","name":"三态速递"}]}
{"expresscode":"OCS","expressname":"OCS","expressalias":[{"isCertain":"2","name":"OCS"}]}
{"expresscode":"MYAAE","expressname":"AAE全球专递","expressalias":[{"isCertain":"0","name":"AAE全球专递"}]}
{"expresscode":"POSTLV","expressname":"拉脱维亚邮政","expressalias":[{"isCertain":"0","name":"拉脱维亚邮政"}]}
{"expresscode":"YWWL","expressname":"燕文物流","expressalias":[{"isCertain":"0","name":"燕文物流"}]}
{"expresscode":"ASENDIA","expressname":"Asendia USA","expressalias":[{"isCertain":"0","name":"Asendia USA"}]}
{"expresscode":"RUSTON","expressname":"俄速通","expressalias":[{"isCertain":"0","name":"俄速通"}]}
{"expresscode":"XLOBO","expressname":"贝海国际速递","expressalias":[{"isCertain":"0","name":"贝海国际速递"},{"isCertain":1,"name":"贝海国际"},{"isCertain":1,"name":"贝海"}]}
{"expresscode":"SPSR","expressname":"中俄快递","expressalias":[{"isCertain":"0","name":"中俄快递"}]}
{"expresscode":"POSTCO","expressname":"哥伦比亚邮政","expressalias":[{"isCertain":"0","name":"哥伦比亚邮政"}]}
{"expresscode":"SAD","expressname":"赛澳递","expressalias":[{"isCertain":"0","name":"赛澳递"},{"isCertain":"0","name":"华东江苏赛澳递快递"}]}
{"expresscode":"SUIJIAWL","expressname":"穗佳物流","expressalias":[{"isCertain":"0","name":"穗佳物流"},{"isCertain":"0","name":"穗佳快递"},{"isCertain":"1","name":"穗佳"}]}