{
    "Header": {
        "magic": 11,
        "version": 1
    },
    "BleScanCfg": [
        {
            "PackageName": "fr.gouv.android.stopcovid",
            "ScanType": 1,
            "ScanMode": 1,
            "ScanInt": 5000,
            "ScanWin": 500
        },
        {
            "PackageName": "com.orange.contacttracing.sample",
            "ScanType": 1,
            "ScanMode": 1,
            "ScanInt": 5000,
            "ScanWin": 500
        }
    ],
    "AppFeatureCfg": [
        {
            "PackageName": "fr.gouv.android.stopcovid",
            "FeatureType": 0
        },
        {
            "PackageName": "com.orange.contacttracing.sample",
            "FeatureType": 0
        }
    ],
    "HnBlePeripheralCfg": [
        {
            "PencilPid": "4241,4261,9473,9474,9475,9476",
            "KeyboardPid": "4253,4254,4260,4274,1285,17665,1289",
            "KbSupHostDicPid": "4254,4260,1285",
            "KbName": "HONOR Smart Keyboard,HONOR Wireless Keyboard,HONOR Floating Keyboard,HONOR Pad V7 Keyboard",
            "KbModelId": "000106,000104"
        }
    ],
    "ForceStartTrackGame": [
        {
            "PackageName": "com.happyelements.AndroidAnimal"
        },
        {
            "PackageName": "com.tencent.feiji"
        }
    ],
    "BleAppWakeup": [
        {
            "PackageName" : "com.chehejia.oc.m01",
            "SHA1": "BC:8F:95:CC:DF:A2:72:98:A2:BD:A4:CF:C0:E6:37:E3:9C:FC:C2:E5",
            "Scan_Span": 604800,
            "rssi_thresh": -90,
            "scan_report_interval" : 10
        }
    ],
    "GattAppMtuKeep": [
        {
            "PackageName": "com.hihonor.nearby"
        },
        {
            "PackageName": "com.hihonor.airlink"
        },
        {
            "PackageName": "com.hihonor.health"
        }
    ]
}
