{
    "id": "rhythm",
    "title_id": "story_template_title_rhythm",
    "music": "Resource/music/out.aac",
    "resolution": [1680, 720],
    "segments": [
        {
            "camera_id": 0,
            "duration": 2.5,
            "shot_mode": "normal_video",
            "demo_offset": [0, 2.5],
            "audio_offset": 0,
            "algo_scripts": {
            },
            "holder_scripts": {
            }
        },
        {
            "camera_id": 0,
            "duration": 3.5,
            "shot_mode": "normal_video",
            "demo_offset": [2, 5.5],
            "audio_offset": 2,
            "algo_scripts": {
            },
            "holder_scripts": {
            }
        },
        {
            "camera_id": 0,
            "duration": 2,
            "shot_mode": "normal_video",
            "demo_offset": [5, 7],
            "audio_offset": 5,
            "algo_scripts": {
            },
            "holder_scripts": {
            }
        },
        {
            "camera_id": 0,
            "duration": 4.5,
            "shot_mode": "normal_video",
            "demo_offset": [6.5, 11],
            "audio_offset": 6.5,
            "algo_scripts": {
            },
            "holder_scripts": {
            }
        },
        {
            "camera_id": 0,
            "duration": 2.3,
            "shot_mode": "normal_video",
            "demo_offset": [10.5, 12.8],
            "audio_offset": 10.5,
            "algo_scripts": {
            },
            "holder_scripts": {
            }
        }
    ]
}