#,version,,,,,,,,,,,,,,
2023,5,31,1,,,,,,,,,,,,
#,row_col_num,,,,,,,,,,,,,,
36,16,,,,,,,,,,,,,,
#,noise,,,,,,,,,,,,,,
-800,800,,,,,,,,,,,,,,
#,raw_max,,,,,,,,,,,,,,
10842,10842,10842,10842,10842,10842,10842,10842,10842,10842,10842,10842,10842,10842,10842,10842
10842,10842,10842,10842,10842,10842,10842,10842,10842,10842,10842,10842,10842,10842,10842,10842
10842,10842,10842,10842,10842,10842,10842,10842,10842,10842,10842,10842,10842,10842,10842,10842
10842,10842,10842,10842,10842,10842,10842,10842,10842,10842,10842,10842,10842,10842,10842,10842
10842,10842,10842,10842,10842,10842,10842,10842,10842,10842,10842,10842,10842,10842,10842,10842
10842,10842,10842,10842,10842,10842,10842,10842,10842,10842,10842,10842,10842,10842,10842,10842
10842,10842,10842,10842,10842,10842,10842,10842,10842,10842,10842,10842,10842,10842,10842,10842
10842,10842,10842,10842,10842,10842,10842,10842,10842,10842,10842,10842,10842,10842,10842,10842
10842,10842,10842,10842,10842,10842,10842,10842,10842,10842,10842,10842,10842,10842,10842,10842
10842,10842,10842,10842,10842,10842,10842,10842,10842,10842,10842,10842,10842,10842,10842,10842
10842,10842,10842,10842,10842,10842,10842,10842,10842,10842,10842,10842,10842,10842,10842,10842
10842,10842,10842,10842,10842,10842,10842,10842,10842,10842,10842,10842,10842,10842,10842,10842
10842,10842,10842,10842,10842,10842,10842,10842,10842,10842,10842,10842,10842,10842,10842,10842
10842,10842,10842,10842,10842,10842,10842,10842,10842,10842,10842,10842,10842,10842,10842,10842
10842,10842,10842,10842,10842,10842,10842,10842,10842,10842,10842,10842,10842,10842,10842,10842
10842,10842,10842,10842,10842,10842,10842,10842,10842,10842,10842,10842,10842,10842,10842,10842
10842,10842,10842,10842,10842,10842,10842,10842,10842,10842,10842,10842,10842,10842,10842,10842
10842,10842,10842,10842,10842,10842,10842,10842,10842,10842,10842,10842,10842,10842,10842,10842
10842,10842,10842,10842,10842,10842,10842,10842,10842,10842,10842,10842,10842,10842,10842,10842
10842,10842,10842,10842,10842,10842,10842,10842,10842,10842,10842,10842,10842,10842,10842,10842
10842,10842,10842,10842,10842,10842,10842,10842,10842,10842,10842,10842,10842,10842,10842,10842
10842,10842,10842,10842,10842,10842,10842,10842,10842,10842,10842,10842,10842,10842,10842,10842
10842,10842,10842,10842,10842,10842,10842,10842,10842,10842,10842,10842,10842,10842,10842,10842
10842,10842,10842,10842,10842,10842,10842,10842,10842,10842,10842,10842,10842,10842,10842,10842
10842,10842,10842,10842,10842,10842,10842,10842,10842,10842,10842,10842,10842,10842,10842,10842
10842,10842,10842,10842,10842,10842,10842,10842,10842,10842,10842,10842,10842,10842,10842,10842
10842,10842,10842,10842,10842,10842,10842,10842,10842,10842,10842,10842,10842,10842,10842,10842
10842,10842,10842,10842,10842,10842,10842,10842,10842,10842,10842,10842,10842,10842,10842,10842
10842,10842,10842,10842,10842,10842,10842,10842,10842,10842,10842,10842,10842,10842,10842,10842
10842,10842,10842,10842,10842,10842,10842,10842,10842,10842,10842,10842,10842,10842,10842,10842
10842,10842,10842,10842,10842,10842,10842,10842,10842,10842,10842,10842,10842,10842,10842,10842
10842,10842,10842,10842,10842,10842,10842,10842,10842,10842,10842,10842,10842,10842,10842,10842
10842,10842,10842,10842,10842,10842,10842,10842,10842,10842,10842,10842,10842,10842,10842,10842
10842,10842,10842,10842,10842,10842,10842,10842,10842,10842,10842,10842,10842,10842,10842,10842
10842,10842,10842,10842,10842,10842,10842,10842,10842,10842,10842,10842,10842,10842,10842,10842
10842,10842,10842,10842,10842,10842,10842,10842,10842,10842,10842,10842,10842,10842,10842,10842
#,raw_min,,,,,,,,,,,,,,
5542,5542,5542,5542,5542,5542,5542,5542,5542,5542,5542,5542,5542,5542,5542,5542
5542,5542,5542,5542,5542,5542,5542,5542,5542,5542,5542,5542,5542,5542,5542,5542
5542,5542,5542,5542,5542,5542,5542,5542,5542,5542,5542,5542,5542,5542,5542,5542
5542,5542,5542,5542,5542,5542,5542,5542,5542,5542,5542,5542,5542,5542,5542,5542
5542,5542,5542,5542,5542,5542,5542,5542,5542,5542,5542,5542,5542,5542,5542,5542
5542,5542,5542,5542,5542,5542,5542,5542,5542,5542,5542,5542,5542,5542,5542,5542
5542,5542,5542,5542,5542,5542,5542,5542,5542,5542,5542,5542,5542,5542,5542,5542
5542,5542,5542,5542,5542,5542,5542,5542,5542,5542,5542,5542,5542,5542,5542,5542
5542,5542,5542,5542,5542,5542,5542,5542,5542,5542,5542,5542,5542,5542,5542,5542
5542,5542,5542,5542,5542,5542,5542,5542,5542,5542,5542,5542,5542,5542,5542,5542
5542,5542,5542,5542,5542,5542,5542,5542,5542,5542,5542,5542,5542,5542,5542,5542
5542,5542,5542,5542,5542,5542,5542,5542,5542,5542,5542,5542,5542,5542,5542,5542
5542,5542,5542,5542,5542,5542,5542,5542,5542,5542,5542,5542,5542,5542,5542,5542
5542,5542,5542,5542,5542,5542,5542,5542,5542,5542,5542,5542,5542,5542,5542,5542
5542,5542,5542,5542,5542,5542,5542,5542,5542,5542,5542,5542,5542,5542,5542,5542
5542,5542,5542,5542,5542,5542,5542,5542,5542,5542,5542,5542,5542,5542,5542,5542
5542,5542,5542,5542,5542,5542,5542,5542,5542,5542,5542,5542,5542,5542,5542,5542
5542,5542,5542,5542,5542,5542,5542,5542,5542,5542,5542,5542,5542,5542,5542,5542
5542,5542,5542,5542,5542,5542,5542,5542,5542,5542,5542,5542,5542,5542,5542,5542
5542,5542,5542,5542,5542,5542,5542,5542,5542,5542,5542,5542,5542,5542,5542,5542
5542,5542,5542,5542,5542,5542,5542,5542,5542,5542,5542,5542,5542,5542,5542,5542
5542,5542,5542,5542,5542,5542,5542,5542,5542,5542,5542,5542,5542,5542,5542,5542
5542,5542,5542,5542,5542,5542,5542,5542,5542,5542,5542,5542,5542,5542,5542,5542
5542,5542,5542,5542,5542,5542,5542,5542,5542,5542,5542,5542,5542,5542,5542,5542
5542,5542,5542,5542,5542,5542,5542,5542,5542,5542,5542,5542,5542,5542,5542,5542
5542,5542,5542,5542,5542,5542,5542,5542,5542,5542,5542,5542,5542,5542,5542,5542
5542,5542,5542,5542,5542,5542,5542,5542,5542,5542,5542,5542,5542,5542,5542,5542
5542,5542,5542,5542,5542,5542,5542,5542,5542,5542,5542,5542,5542,5542,5542,5542
5542,5542,5542,5542,5542,5542,5542,5542,5542,5542,5542,5542,5542,5542,5542,5542
5542,5542,5542,5542,5542,5542,5542,5542,5542,5542,5542,5542,5542,5542,5542,5542
5542,5542,5542,5542,5542,5542,5542,5542,5542,5542,5542,5542,5542,5542,5542,5542
5542,5542,5542,5542,5542,5542,5542,5542,5542,5542,5542,5542,5542,5542,5542,5542
5542,5542,5542,5542,5542,5542,5542,5542,5542,5542,5542,5542,5542,5542,5542,5542
5542,5542,5542,5542,5542,5542,5542,5542,5542,5542,5542,5542,5542,5542,5542,5542
5542,5542,5542,5542,5542,5542,5542,5542,5542,5542,5542,5542,5542,5542,5542,5542
5542,5542,5542,5542,5542,5542,5542,5542,5542,5542,5542,5542,5542,5542,5542,5542
#,raw_row_delta_max,,,,,,,,,,,,,,
1600,1600,1600,1600,1600,1600,1600,1600,1600,1600,1600,1600,1600,1600,1600,1600
1600,1600,1600,1600,1600,1600,1600,1600,1600,1600,1600,1600,1600,1600,1600,1600
1600,1600,1600,1600,1600,1600,1600,1600,1600,1600,1600,1600,1600,1600,1600,1600
1600,1600,1600,1600,1600,1600,1600,1600,1600,1600,1600,1600,1600,1600,1600,1600
1600,1600,1600,1600,1600,1600,1600,1600,1600,1600,1600,1600,1600,1600,1600,1600
1600,1600,1600,1600,1600,1600,1600,1600,1600,1600,1600,1600,1600,1600,1600,1600
1600,1600,1600,1600,1600,1600,1600,1600,1600,1600,1600,1600,1600,1600,1600,1600
1600,1600,1600,1600,1600,1600,1600,1600,1600,1600,1600,1600,1600,1600,1600,1600
1600,1600,1600,1600,1600,1600,1600,1600,1600,1600,1600,1600,1600,1600,1600,1600
1600,1600,1600,1600,1600,1600,1600,1600,1600,1600,1600,1600,1600,1600,1600,1600
1600,1600,1600,1600,1600,1600,1600,1600,1600,1600,1600,1600,1600,1600,1600,1600
1600,1600,1600,1600,1600,1600,1600,1600,1600,1600,1600,1600,1600,1600,1600,1600
1600,1600,1600,1600,1600,1600,1600,1600,1600,1600,1600,1600,1600,1600,1600,1600
1600,1600,1600,1600,1600,1600,1600,1600,1600,1600,1600,1600,1600,1600,1600,1600
1600,1600,1600,1600,1600,1600,1600,1600,1600,1600,1600,1600,1600,1600,1600,1600
1600,1600,1600,1600,1600,1600,1600,1600,1600,1600,1600,1600,1600,1600,1600,1600
1600,1600,1600,1600,1600,1600,1600,1600,1600,1600,1600,1600,1600,1600,1600,1600
1600,1600,1600,1600,1600,1600,1600,1600,1600,1600,1600,1600,1600,1600,1600,1600
1600,1600,1600,1600,1600,1600,1600,1600,1600,1600,1600,1600,1600,1600,1600,1600
1600,1600,1600,1600,1600,1600,1600,1600,1600,1600,1600,1600,1600,1600,1600,1600
1600,1600,1600,1600,1600,1600,1600,1600,1600,1600,1600,1600,1600,1600,1600,1600
1600,1600,1600,1600,1600,1600,1600,1600,1600,1600,1600,1600,1600,1600,1600,1600
1600,1600,1600,1600,1600,1600,1600,1600,1600,1600,1600,1600,1600,1600,1600,1600
1600,1600,1600,1600,1600,1600,1600,1600,1600,1600,1600,1600,1600,1600,1600,1600
1600,1600,1600,1600,1600,1600,1600,1600,1600,1600,1600,1600,1600,1600,1600,1600
1600,1600,1600,1600,1600,1600,1600,1600,1600,1600,1600,1600,1600,1600,1600,1600
1600,1600,1600,1600,1600,1600,1600,1600,1600,1600,1600,1600,1600,1600,1600,1600
1600,1600,1600,1600,1600,1600,1600,1600,1600,1600,1600,1600,1600,1600,1600,1600
1600,1600,1600,1600,1600,1600,1600,1600,1600,1600,1600,1600,1600,1600,1600,1600
1600,1600,1600,1600,1600,1600,1600,1600,1600,1600,1600,1600,1600,1600,1600,1600
1600,1600,1600,1600,1600,1600,1600,1600,1600,1600,1600,1600,1600,1600,1600,1600
1600,1600,1600,1600,1600,1600,1600,1600,1600,1600,1600,1600,1600,1600,1600,1600
1600,1600,1600,1600,1600,1600,1600,1600,1600,1600,1600,1600,1600,1600,1600,1600
1600,1600,1600,1600,1600,1600,1600,1600,1600,1600,1600,1600,1600,1600,1600,1600
1600,1600,1600,1600,1600,1600,1600,1600,1600,1600,1600,1600,1600,1600,1600,1600
#,raw_row_delta_min,,,,,,,,,,,,,,
-1600,-1600,-1600,-1600,-1600,-1600,-1600,-1600,-1600,-1600,-1600,-1600,-1600,-1600,-1600,-1600
-1600,-1600,-1600,-1600,-1600,-1600,-1600,-1600,-1600,-1600,-1600,-1600,-1600,-1600,-1600,-1600
-1600,-1600,-1600,-1600,-1600,-1600,-1600,-1600,-1600,-1600,-1600,-1600,-1600,-1600,-1600,-1600
-1600,-1600,-1600,-1600,-1600,-1600,-1600,-1600,-1600,-1600,-1600,-1600,-1600,-1600,-1600,-1600
-1600,-1600,-1600,-1600,-1600,-1600,-1600,-1600,-1600,-1600,-1600,-1600,-1600,-1600,-1600,-1600
-1600,-1600,-1600,-1600,-1600,-1600,-1600,-1600,-1600,-1600,-1600,-1600,-1600,-1600,-1600,-1600
-1600,-1600,-1600,-1600,-1600,-1600,-1600,-1600,-1600,-1600,-1600,-1600,-1600,-1600,-1600,-1600
-1600,-1600,-1600,-1600,-1600,-1600,-1600,-1600,-1600,-1600,-1600,-1600,-1600,-1600,-1600,-1600
-1600,-1600,-1600,-1600,-1600,-1600,-1600,-1600,-1600,-1600,-1600,-1600,-1600,-1600,-1600,-1600
-1600,-1600,-1600,-1600,-1600,-1600,-1600,-1600,-1600,-1600,-1600,-1600,-1600,-1600,-1600,-1600
-1600,-1600,-1600,-1600,-1600,-1600,-1600,-1600,-1600,-1600,-1600,-1600,-1600,-1600,-1600,-1600
-1600,-1600,-1600,-1600,-1600,-1600,-1600,-1600,-1600,-1600,-1600,-1600,-1600,-1600,-1600,-1600
-1600,-1600,-1600,-1600,-1600,-1600,-1600,-1600,-1600,-1600,-1600,-1600,-1600,-1600,-1600,-1600
-1600,-1600,-1600,-1600,-1600,-1600,-1600,-1600,-1600,-1600,-1600,-1600,-1600,-1600,-1600,-1600
-1600,-1600,-1600,-1600,-1600,-1600,-1600,-1600,-1600,-1600,-1600,-1600,-1600,-1600,-1600,-1600
-1600,-1600,-1600,-1600,-1600,-1600,-1600,-1600,-1600,-1600,-1600,-1600,-1600,-1600,-1600,-1600
-1600,-1600,-1600,-1600,-1600,-1600,-1600,-1600,-1600,-1600,-1600,-1600,-1600,-1600,-1600,-1600
-1600,-1600,-1600,-1600,-1600,-1600,-1600,-1600,-1600,-1600,-1600,-1600,-1600,-1600,-1600,-1600
-1600,-1600,-1600,-1600,-1600,-1600,-1600,-1600,-1600,-1600,-1600,-1600,-1600,-1600,-1600,-1600
-1600,-1600,-1600,-1600,-1600,-1600,-1600,-1600,-1600,-1600,-1600,-1600,-1600,-1600,-1600,-1600
-1600,-1600,-1600,-1600,-1600,-1600,-1600,-1600,-1600,-1600,-1600,-1600,-1600,-1600,-1600,-1600
-1600,-1600,-1600,-1600,-1600,-1600,-1600,-1600,-1600,-1600,-1600,-1600,-1600,-1600,-1600,-1600
-1600,-1600,-1600,-1600,-1600,-1600,-1600,-1600,-1600,-1600,-1600,-1600,-1600,-1600,-1600,-1600
-1600,-1600,-1600,-1600,-1600,-1600,-1600,-1600,-1600,-1600,-1600,-1600,-1600,-1600,-1600,-1600
-1600,-1600,-1600,-1600,-1600,-1600,-1600,-1600,-1600,-1600,-1600,-1600,-1600,-1600,-1600,-1600
-1600,-1600,-1600,-1600,-1600,-1600,-1600,-1600,-1600,-1600,-1600,-1600,-1600,-1600,-1600,-1600
-1600,-1600,-1600,-1600,-1600,-1600,-1600,-1600,-1600,-1600,-1600,-1600,-1600,-1600,-1600,-1600
-1600,-1600,-1600,-1600,-1600,-1600,-1600,-1600,-1600,-1600,-1600,-1600,-1600,-1600,-1600,-1600
-1600,-1600,-1600,-1600,-1600,-1600,-1600,-1600,-1600,-1600,-1600,-1600,-1600,-1600,-1600,-1600
-1600,-1600,-1600,-1600,-1600,-1600,-1600,-1600,-1600,-1600,-1600,-1600,-1600,-1600,-1600,-1600
-1600,-1600,-1600,-1600,-1600,-1600,-1600,-1600,-1600,-1600,-1600,-1600,-1600,-1600,-1600,-1600
-1600,-1600,-1600,-1600,-1600,-1600,-1600,-1600,-1600,-1600,-1600,-1600,-1600,-1600,-1600,-1600
-1600,-1600,-1600,-1600,-1600,-1600,-1600,-1600,-1600,-1600,-1600,-1600,-1600,-1600,-1600,-1600
-1600,-1600,-1600,-1600,-1600,-1600,-1600,-1600,-1600,-1600,-1600,-1600,-1600,-1600,-1600,-1600
-1600,-1600,-1600,-1600,-1600,-1600,-1600,-1600,-1600,-1600,-1600,-1600,-1600,-1600,-1600,-1600
#,raw_col_delta_max,,,,,,,,,,,,,,
1600,1600,1600,1600,1600,1600,1600,1600,1600,1600,1600,1600,1600,1600,1600,
1600,1600,1600,1600,1600,1600,1600,1600,1600,1600,1600,1600,1600,1600,1600,
1600,1600,1600,1600,1600,1600,1600,1600,1600,1600,1600,1600,1600,1600,1600,
1600,1600,1600,1600,1600,1600,1600,1600,1600,1600,1600,1600,1600,1600,1600,
1600,1600,1600,1600,1600,1600,1600,1600,1600,1600,1600,1600,1600,1600,1600,
1600,1600,1600,1600,1600,1600,1600,1600,1600,1600,1600,1600,1600,1600,1600,
1600,1600,1600,1600,1600,1600,1600,1600,1600,1600,1600,1600,1600,1600,1600,
1600,1600,1600,1600,1600,1600,1600,1600,1600,1600,1600,1600,1600,1600,1600,
1600,1600,1600,1600,1600,1600,1600,1600,1600,1600,1600,1600,1600,1600,1600,
1600,1600,1600,1600,1600,1600,1600,1600,1600,1600,1600,1600,1600,1600,1600,
1600,1600,1600,1600,1600,1600,1600,1600,1600,1600,1600,1600,1600,1600,1600,
1600,1600,1600,1600,1600,1600,1600,1600,1600,1600,1600,1600,1600,1600,1600,
1600,1600,1600,1600,1600,1600,1600,1600,1600,1600,1600,1600,1600,1600,1600,
1600,1600,1600,1600,1600,1600,1600,1600,1600,1600,1600,1600,1600,1600,1600,
1600,1600,1600,1600,1600,1600,1600,1600,1600,1600,1600,1600,1600,1600,1600,
1600,1600,1600,1600,1600,1600,1600,1600,1600,1600,1600,1600,1600,1600,1600,
1600,1600,1600,1600,1600,1600,1600,1600,1600,1600,1600,1600,1600,1600,1600,
1600,1600,1600,1600,1600,1600,1600,1600,1600,1600,1600,1600,1600,1600,1600,
1600,1600,1600,1600,1600,1600,1600,1600,1600,1600,1600,1600,1600,1600,1600,
1600,1600,1600,1600,1600,1600,1600,1600,1600,1600,1600,1600,1600,1600,1600,
1600,1600,1600,1600,1600,1600,1600,1600,1600,1600,1600,1600,1600,1600,1600,
1600,1600,1600,1600,1600,1600,1600,1600,1600,1600,1600,1600,1600,1600,1600,
1600,1600,1600,1600,1600,1600,1600,1600,1600,1600,1600,1600,1600,1600,1600,
1600,1600,1600,1600,1600,1600,1600,1600,1600,1600,1600,1600,1600,1600,1600,
1600,1600,1600,1600,1600,1600,1600,1600,1600,1600,1600,1600,1600,1600,1600,
1600,1600,1600,1600,1600,1600,1600,1600,1600,1600,1600,1600,1600,1600,1600,
1600,1600,1600,1600,1600,1600,1600,1600,1600,1600,1600,1600,1600,1600,1600,
1600,1600,1600,1600,1600,1600,1600,1600,1600,1600,1600,1600,1600,1600,1600,
1600,1600,1600,1600,1600,1600,1600,1600,1600,1600,1600,1600,1600,1600,1600,
1600,1600,1600,1600,1600,1600,1600,1600,1600,1600,1600,1600,1600,1600,1600,
1600,1600,1600,1600,1600,1600,1600,1600,1600,1600,1600,1600,1600,1600,1600,
1600,1600,1600,1600,1600,1600,1600,1600,1600,1600,1600,1600,1600,1600,1600,
1600,1600,1600,1600,1600,1600,1600,1600,1600,1600,1600,1600,1600,1600,1600,
1600,1600,1600,1600,1600,1600,1600,1600,1600,1600,1600,1600,1600,1600,1600,
1600,1600,1600,1600,1600,1600,1600,1600,1600,1600,1600,1600,1600,1600,1600,
1600,1600,1600,1600,1600,1600,1600,1600,1600,1600,1600,1600,1600,1600,1600,
#,raw_col_delta_min,,,,,,,,,,,,,,
-1600,-1600,-1600,-1600,-1600,-1600,-1600,-1600,-1600,-1600,-1600,-1600,-1600,-1600,-1600,
-1600,-1600,-1600,-1600,-1600,-1600,-1600,-1600,-1600,-1600,-1600,-1600,-1600,-1600,-1600,
-1600,-1600,-1600,-1600,-1600,-1600,-1600,-1600,-1600,-1600,-1600,-1600,-1600,-1600,-1600,
-1600,-1600,-1600,-1600,-1600,-1600,-1600,-1600,-1600,-1600,-1600,-1600,-1600,-1600,-1600,
-1600,-1600,-1600,-1600,-1600,-1600,-1600,-1600,-1600,-1600,-1600,-1600,-1600,-1600,-1600,
-1600,-1600,-1600,-1600,-1600,-1600,-1600,-1600,-1600,-1600,-1600,-1600,-1600,-1600,-1600,
-1600,-1600,-1600,-1600,-1600,-1600,-1600,-1600,-1600,-1600,-1600,-1600,-1600,-1600,-1600,
-1600,-1600,-1600,-1600,-1600,-1600,-1600,-1600,-1600,-1600,-1600,-1600,-1600,-1600,-1600,
-1600,-1600,-1600,-1600,-1600,-1600,-1600,-1600,-1600,-1600,-1600,-1600,-1600,-1600,-1600,
-1600,-1600,-1600,-1600,-1600,-1600,-1600,-1600,-1600,-1600,-1600,-1600,-1600,-1600,-1600,
-1600,-1600,-1600,-1600,-1600,-1600,-1600,-1600,-1600,-1600,-1600,-1600,-1600,-1600,-1600,
-1600,-1600,-1600,-1600,-1600,-1600,-1600,-1600,-1600,-1600,-1600,-1600,-1600,-1600,-1600,
-1600,-1600,-1600,-1600,-1600,-1600,-1600,-1600,-1600,-1600,-1600,-1600,-1600,-1600,-1600,
-1600,-1600,-1600,-1600,-1600,-1600,-1600,-1600,-1600,-1600,-1600,-1600,-1600,-1600,-1600,
-1600,-1600,-1600,-1600,-1600,-1600,-1600,-1600,-1600,-1600,-1600,-1600,-1600,-1600,-1600,
-1600,-1600,-1600,-1600,-1600,-1600,-1600,-1600,-1600,-1600,-1600,-1600,-1600,-1600,-1600,
-1600,-1600,-1600,-1600,-1600,-1600,-1600,-1600,-1600,-1600,-1600,-1600,-1600,-1600,-1600,
-1600,-1600,-1600,-1600,-1600,-1600,-1600,-1600,-1600,-1600,-1600,-1600,-1600,-1600,-1600,
-1600,-1600,-1600,-1600,-1600,-1600,-1600,-1600,-1600,-1600,-1600,-1600,-1600,-1600,-1600,
-1600,-1600,-1600,-1600,-1600,-1600,-1600,-1600,-1600,-1600,-1600,-1600,-1600,-1600,-1600,
-1600,-1600,-1600,-1600,-1600,-1600,-1600,-1600,-1600,-1600,-1600,-1600,-1600,-1600,-1600,
-1600,-1600,-1600,-1600,-1600,-1600,-1600,-1600,-1600,-1600,-1600,-1600,-1600,-1600,-1600,
-1600,-1600,-1600,-1600,-1600,-1600,-1600,-1600,-1600,-1600,-1600,-1600,-1600,-1600,-1600,
-1600,-1600,-1600,-1600,-1600,-1600,-1600,-1600,-1600,-1600,-1600,-1600,-1600,-1600,-1600,
-1600,-1600,-1600,-1600,-1600,-1600,-1600,-1600,-1600,-1600,-1600,-1600,-1600,-1600,-1600,
-1600,-1600,-1600,-1600,-1600,-1600,-1600,-1600,-1600,-1600,-1600,-1600,-1600,-1600,-1600,
-1600,-1600,-1600,-1600,-1600,-1600,-1600,-1600,-1600,-1600,-1600,-1600,-1600,-1600,-1600,
-1600,-1600,-1600,-1600,-1600,-1600,-1600,-1600,-1600,-1600,-1600,-1600,-1600,-1600,-1600,
-1600,-1600,-1600,-1600,-1600,-1600,-1600,-1600,-1600,-1600,-1600,-1600,-1600,-1600,-1600,
-1600,-1600,-1600,-1600,-1600,-1600,-1600,-1600,-1600,-1600,-1600,-1600,-1600,-1600,-1600,
-1600,-1600,-1600,-1600,-1600,-1600,-1600,-1600,-1600,-1600,-1600,-1600,-1600,-1600,-1600,
-1600,-1600,-1600,-1600,-1600,-1600,-1600,-1600,-1600,-1600,-1600,-1600,-1600,-1600,-1600,
-1600,-1600,-1600,-1600,-1600,-1600,-1600,-1600,-1600,-1600,-1600,-1600,-1600,-1600,-1600,
-1600,-1600,-1600,-1600,-1600,-1600,-1600,-1600,-1600,-1600,-1600,-1600,-1600,-1600,-1600,
-1600,-1600,-1600,-1600,-1600,-1600,-1600,-1600,-1600,-1600,-1600,-1600,-1600,-1600,-1600,
-1600,-1600,-1600,-1600,-1600,-1600,-1600,-1600,-1600,-1600,-1600,-1600,-1600,-1600,-1600,
