﻿{
  "type": "rhythm",
  "duration": 25000,
  "name": "Wave-25",
  "id": "Rhythm_25_2",
  "separationStep": 1870,
  "separationMinDuration": 4000,
  "separationMaxDuration": 8000,
  "transitions": [
    {
      "name": "叠化",
      "priority": 10,
      "pickCondition": -1,
      "horizon": true,
      "vertical": true
    },
    {
      "name": "模糊",
      "priority": 0,
      "pickCondition": -1,
      "horizon": true,
      "vertical": true
    },
    {
      "name": "融化",
      "priority": 0,
      "pickCondition": -1,
      "horizon": true,
      "vertical": true
    },
    {
      "name": "上移",
      "priority": 90,
      "pickCondition": 2,
      "horizon": true,
      "vertical": false
    },
    {
      "name": "下移",
      "priority": 90,
      "pickCondition": -1,
      "horizon": true,
      "vertical": true
    },
    {
      "name": "左移",
      "priority": 90,
      "pickCondition": 2,
      "horizon": false,
      "vertical": true
    },
    {
      "name": "右移",
      "priority": 90,
      "pickCondition": -1,
      "horizon": true,
      "vertical": true
    },
    {
      "name": "黑场",
      "priority": 70,
      "pickCondition": -1,
      "horizon": true,
      "vertical": true
    },
    {
      "name": "白场",
      "priority": 50,
      "pickCondition": -1,
      "horizon": true,
      "vertical": true
    },
    {
      "name": "放大",
      "priority": 90,
      "pickCondition": -1,
      "horizon": true,
      "vertical": true
    },
    {
      "name": "缩小",
      "priority": 90,
      "pickCondition": -1,
      "horizon": true,
      "vertical": true
    },
    {
      "name": "旋转",
      "priority": 90,
      "pickCondition": 1,
      "horizon": true,
      "vertical": true
    }
  ],
  "transitionMaxCount": 4,
  "filterId": "filter_res_01",
  "filterStrength": 0.4,
  "sticker": {
    "id": "have_fun",
    "scaleHorizon": 0.4,
    "scaleVertical": 0.6,
    "locationHorizonX": 0,
    "locationHorizonY": -0.8,
    "locationVerticalX": 0,
    "locationVerticalY": -0.35,
    "beginTime": 0
  },
  "borderId": "null",
  "specialEffect": [
    {
      "effectId": "blingbling",
      "effectStart": 0
    },
    {
      "effectId": "burst",
      "effectStart": -1
    },
    {
      "effectId": "graphics",
      "effectStart": -1
    }
  ],
  "tail": "honor_vlog"
}