{
	"type":"CalendarExt",
	"subType":"BVL-AN16",
	"params":[
		{
			"name":"my_day_enable",
			"type":"bool",
			"value":"true"
		},
		{
			"name":"smart_scan_enable",
			"type":"bool",
			"value":"false"
		}
	],
	"compatibleversion":"1"
}