{
  "com.app.moontv": 0,
  "com.ledou.mhjy.xxxxxx": 1,
  "com.qdkj.yhxymnrs.xxxxxx": 2,
  "com.xxxxxx.appmarket": 3,
  "com.baidu.swan": 4,
  "com.hihonor.tips": 5,
  "com.netease.pes.xxxxxx": 6,
  "com.tencent.mtt": 7,
  "com.tencent.tmgp.sgame": 8,
  "com.tencent.qqlive": 9,
  "com.xxxxxx.health": 10,
  "com.hihonor.phoneservice": 11,
  "com.honor.club": 12,
  "com.tencent.tmgp.cod": 13,
  "com.leleketang.SchoolFantasy": 14,
  "com.sfacg": 15,
  "com.huoshe.fkbgs.xxxxxx": 16,
  "com.sjf.kbmsdtw.xxxxxx": 17,
  "com.sjf.zhxymxx.xxxxxx": 18,
  "com.wepie.snake.xxxxxx": 19,
  "com.wepie.weplay": 20,
  "com.fengguo.wpjz.xxxxxx": 21,
  "com.microsoft.office.onenote": 22,
  "com.sjzmor.hldbpapk.xxxxxx": 23,
  "com.xxxxxx.himovie": 24,
  "com.huoshe.cjpkx.xxxxxx": 25,
  "com.xxxxxx.scanner": 26,
  "com.hihonor.compass": 27,
  "com.ximalaya.ting.kid": 28,
  "com.hihonor.mms": 29,
  "com.theone.aipeilian": 30,
  "com.xxxxxx.vassistant": 31,
  "com.jiliguala.niuwa": 32,
  "com.bairimeng.dmmdzz.vivo": 33,
  "com.tencent.mm": 34,
  "com.tencent.tmgp.supercell.clashroyale": 35,
  "cn.nineton.dailycheck": 36,
  "com.easygame2022.sheepmatchcn.xxxxxx": 37,
  "com.qiyi.video": 38,
  "com.xingin.xhs": 39,
  "com.youqi.fjjf": 40,
  "com.hihonor.calendar": 41,
  "com.baidu.haokan": 42,
  "com.happyelements.AndroidAnimal": 43,
  "com.sy.xxyg.xxxxxx": 44,
  "com.hihonor.health": 45,
  "com.xxxxxx.android.pushagent": 46,
  "com.nineton.todolist": 47,
  "com.ximalaya.ting.android": 48,
  "com.hihonor.parentcontrol": 49,
  "com.tencent.tmgp.jnbg2": 50,
  "com.youkagames.murdermystery": 51,
  "com.ks.kaishustory": 52,
  "com.hihonor.search": 53,
  "com.hihonor.numberidentity": 54,
  "com.hihonor.dsdscardmanager": 55,
  "com.tencent.news": 56,
  "com.minitech.miniworld": 57,
  "com.hihonor.filemanager": 58,
  "com.sdhy.wztk.xxxxxx": 59,
  "com.gorgeous.lite": 60,
  "com.xiaobanlong.main": 61,
  "com.sofunny.Sausage": 62,
  "com.sjzmor.srqsmnqapk.xxxxxx": 63,
  "com.zhihu.android": 64,
  "com.tencent.wework": 65,
  "com.dragon.read": 66,
  "com.sinyee.babybus.drawingII": 67,
  "com.tuyoo.gomoku.xxxxxx": 68,
  "com.taobao.live": 69,
  "com.sina.weibo": 70,
  "com.hihonor.hncloud": 71,
  "com.fenbi.android.solar": 72,
  "com.outfit7.mytalkingtom2.xxxxxx": 73,
  "com.hihonor.videoeditor": 74,
  "com.hihonor.HnMultiScreenShot": 75,
  "com.duowan.kiwi": 76,
  "com.dw.wzsjkthk.xxxxxx": 77,
  "com.jingdong.app.mall": 78,
  "com.kuiyi.twdcr.game.xxxxxx": 79,
  "tv.danmaku.bili": 80,
  "com.minitech.miniworld.xxxxxx": 81,
  "com.xxxxxx.gamebox": 82,
  "com.clicli.app": 83,
  "com.ef.edtech.hf": 84,
  "com.kuaikan.comic": 85,
  "com.hihonor.android.totemweather": 86,
  "com.dianshijia.newlive": 87,
  "com.yl.tkzx2.normald": 88,
  "com.hihonor.devicemanager": 89,
  "com.mihoyo.hyperion": 90,
  "com.youzu.bs": 91,
  "com.wooduan.ssjj.xxxxxx": 92,
  "com.xxxxxx.hwireader": 93,
  "com.hihonor.motionservice": 94,
  "com.autonavi.minimap": 95,
  "com.hongen.app.word": 96,
  "com.mywallpaper.customizechanger": 97,
  "com.tmd.mb.dsyw.dy.tt7": 98,
  "com.ss.android.ugc.live": 99,
  "com.sohu.newsclient": 100,
  "com.supercell.clashroyale.xxxxxx": 101,
  "com.greatefunhy.sdgs.xxxxxx": 102,
  "com.tc.bhrgzywz.xxxxxx": 103,
  "com.taptap": 104,
  "com.ihuman.imath": 105,
  "com.yswj.miaowu": 106,
  "com.iyuba.talkshow.pig": 107,
  "com.xxxxxx.welink": 108,
  "ctrip.android.view": 109,
  "com.android.permissioncontroller": 110,
  "com.tencent.mf.uam": 111,
  "com.kwai.m2u": 112,
  "com.theotino.chinadaily": 113,
  "com.hihonor.lbs": 114,
  "com.miHoYo.Yuanshen": 115,
  "com.hihonor.photos": 116,
  "com.wuba": 117,
  "com.bairimeng.dmmdzz.xxxxxx": 118,
  "cn.honor.qinxuan": 119,
  "com.baidu.searchbox": 120,
  "com.habby.danke.xxxxxx": 121,
  "com.xxxxxx.music": 122,
  "com.tencent.tmgp.pubgmhd": 123,
  "com.hihonor.notepad": 124,
  "com.fenbi.android.zenglish": 125,
  "com.yunbu.badmintonleague.xxxxxx": 126,
  "com.xxxxxx.educenter": 127,
  "com.policar.xxxxxx": 128,
  "com.armymen.xxxxxx": 129,
  "com.lemon.lv": 130,
  "com.hihonor.screenrecorder": 131,
  "com.yodo1.sniper3dv2.xxxxxx": 132,
  "com.hihonor.soundrecorder": 133,
  "com.sinyee.babybus.icecream": 134,
  "com.hihonor.servicecenter": 135,
  "com.jiongji.andriod.card": 136,
  "com.dw.szdr.xxxxxx": 137,
  "com.hihonor.hiboard": 138,
  "com.shanbay.sentence": 139,
  "com.t2ksports.nba2k20and": 140,
  "com.hoolai.wlzq.xxxxxx": 141,
  "com.netease.party.xxxxxx": 142,
  "com.hihonor.contacts": 143,
  "com.mampod.ergedd": 144,
  "com.taobao.litetao": 145,
  "com.kwai.videoeditor": 146,
  "com.android.phone": 147,
  "com.xxxxxx.hidisk": 148,
  "com.hihonor.suggestion": 149,
  "com.jf.elsfkfgb.xxxxxx": 150,
  "com.achievo.vipshop": 151,
  "com.hihonor.calculator": 152,
  "com.xxxxxx.fastapp": 153,
  "com.ss.android.article.video": 154,
  "com.sohu.inputmethod.sogou": 155,
  "com.my.fakesms": 156,
  "com.taobao.taobao": 157,
  "com.outfit7.talkingtomgoldrun.xxxxxx": 158,
  "com.xxxxxx.meetime": 159,
  "com.ss.android.ugc.aweme": 160,
  "com.luna.music": 161,
  "com.hihonor.camera": 162,
  "com.android.captiveportallogin": 163,
  "com.aligames.sgzzlb.xxxxxx": 164,
  "com.sinyee.babybus.recommendapp": 165,
  "com.eg.android.AlipayGphone": 166,
  "com.hihonor.desktop.explorer": 167,
  "com.hihonor.collectkit": 168,
  "com.jojoread.huiben": 169,
  "com.sinyee.babybus.chants": 170,
  "com.sina.news": 171,
  "com.kmxs.reader": 172,
  "com.mobbanana.rlylc.xxxxxx": 173,
  "com.fingertip.saolei.xxxxxx": 174,
  "cn.soulapp.android": 175,
  "com.tal.abctimelibrary": 176,
  "com.tencent.mobileqq": 177,
  "com.xxxxxx.browser": 178,
  "com.gkid.crazyrope": 179,
  "a.baozouptu": 180,
  "com.somer.sq.puzzle": 181,
  "com.petal.litegames": 182,
  "com.gameley.mmwan": 183,
  "com.hihonor.quickengine": 184,
  "com.sinyee.babybus.world": 185,
  "com.by.butter.camera": 186,
  "com.xunmeng.pinduoduo": 187,
  "com.tencent.qqlivexxxxxx": 188,
  "com.ss.android.article.news": 189,
  "com.taptap.game.sandbox.addon": 190,
  "com.gzsd.rsmns.xxxxxx": 191,
  "com.snda.lantern.wifilocating": 192,
  "com.hihonor.lens": 193,
  "com.qrqm.sckb.xxxxxx": 194,
  "com.lofter.android": 195,
  "com.xxxxxx.hifolder": 196,
  "com.puzzle.miniworld.xxxxxx": 197,
  "com.shizhuang.duapp": 198,
  "com.viva.time_todo": 199,
  "com.touchtech.tangshi": 200,
  "com.plan.kot32.tomatotime": 201,
  "com.shanbay.news": 202,
  "com.hihonor.betaclub": 203,
  "com.mt.mtxx.mtxx": 204,
  "com.hihonor.deskclock": 205,
  "com.xxxxxx.android.thememanager": 206,
  "com.byfen.market": 207,
  "com.smile.gifmaker": 208,
  "com.baidu.appsearch": 209,
  "com.xxxxxx.hwid": 210,
  "com.baidu.netdisk": 211,
  "com.kingnet.gundam.xxxxxx": 212,
  "com.kiloo.subwaysurf": 213,
  "com.hihonor.vmall": 214,
  "com.hihonor.gameperceptio": 215,
  "com.kuaishou.nebula": 216,
  "com.netease.mc.xxxxxx": 217,
  "com.youku.phone": 218,
  "com.huabenapp": 219,
  "com.jzzs.ParentsHelper": 220,
  "com.tencent.qqmusic": 221,
  "com.xxxxxx.gameassistant": 222,
  "com.mendon.riza": 223,
  "com.hihonor.mirror": 224,
  "air.com.gongfubb.wksz": 225,
  "com.hihonor.magazine": 226,
  "com.miHoYo.enterprise.NGHSoD": 227,
  "com.hihonor.controlcenter": 228,
  "uni.UNI51C2192": 229,
  "com.tencent.jkchess": 230,
  "com.hihonor.hndockbar": 231,
  "com.gzsd.cjdstk.xxxxxx": 232,
  "com.meitu.meiyancamera": 233,
  "com.android.settings": 234,
  "com.zscy.kcddmn.xxxxxx": 235,
  "com.vivo.sdkplugin": 236,
  "com.kingwin.pk.xxxxxx": 237,
  "com.shusheng.JoJoRead": 238,
  "com.netease.tank.xxxxxx": 239,
  "cn.ultralisk.gameapp.game17.xxxxxx": 240,
  "com.xxxxxx.wallet": 241,
  "com.tencent.KiHan": 242,
  "com.turbochilli.rollingsky_cn.xxxxxx": 243,
  "com.xxxxxx.hitouch": 244,
  "com.drpanda.chineseacademy.xxxxxx": 245,
  "com.xs.fm": 246,
  "com.meta.box": 247,
  "com.mingya.realdriving2.chaos": 248,
  "com.hihonor.android.pushagent": 249,
  "com.UCMobile": 250,
  "com.lemon.faceu": 251,
  "com.hunantv.imgo.activity": 252,
  "com.hihonor.magichome": 253,
  "com.hihonor.iconnect": 254,
  "com.baijiahulian.maodou": 255,
  "com.ishowedu.child.peiyin": 256,
  "com.A17zuoye.mobile.homework": 257,
  "com.mizhongtech.qief": 258,
  "com.melestudio.dimensional.xxxxxx": 259,
  "me.ele": 260,
  "com.hihonor.keychain": 261,
  "com.sankuai.meituan": 262,
  "com.kugou.android": 263,
  "com.youdao.yread": 264,
  "com.hihonor.findmydevice": 265,
  "com.ztgame.bob": 266,
  "com.tencent.tmgp.supercell.clashofclans": 267,
  "com.zq.mnzxcds.xxxxxx": 268,
  "com.dianping.v1": 269,
  "com.qiyi.video.lite": 270,
  "com.kunpo.myhome.jrtt.xxxxxx": 271,
  "com.hihonor.trustagent": 272,
  "com.tencent.tmgp.speedmobile": 273,
  "com.quark.browser": 274,
  "com.mihuan.mgssapk.xxxxxx": 275,
  "com.netease.wotb.xxxxxx": 276,
  "com.cyclotron.in": 277,
  "com.baidu.homework": 278,
  "com.aleen.game001": 279,
  "com.hihonor.heartstudy": 280,
  "com.hihonor.systemappsupdater": 281,
  "com.coolapk.market": 282,
  "com.ss.android.ugc.aweme.lite": 283,
  "kp.source.gas.poetry": 284,
  "com.flyersoft.seekbooks": 285,
  "com.huati": 286,
  "yx.myacg.plus": 287,
  "uni.UNID498BB2": 288,
  "com.xxxxxx.lives": 289,
  "com.ss.android.article.lite": 290,
  "com.my.configwifi": 291,
  "com.zcool.community": 292,
  "com.xxxxxx.hisuite": 293,
  "cn.wps.moffice_eng": 294,
  "com.taobao.idlefish": 295,
  "com.deepaso.FlipClockMini": 296,
  "com.douban.frodo": 297,
  "com.kkys.video": 298,
  "com.wakdev.nfctools.pro": 299,
  "com.nxp.taginfolite": 300,
  "com.honor.tools": 301,
  "com.hihonor.KingKong": 302,
  "com.yiche.price": 303,
  "cn.mucang.android.parallelvehicle": 304,
  "com.yiche.autoeasy": 305,
  "com.cankaoxiaoxi.app1": 306,
  "com.wondertek.paper": 307,
  "com.baidu.autocar": 308,
  "com.baojiazhijia.qichebaojia": 309,
  "com.timanetworks.android.frame.audisuper.release": 310,
  "com.szzc": 311,
  "com.ss.android.auto": 312,
  "cn.etouch.ecalendar": 313,
  "com.kingsoft.moffice_pro_hw": 314,
  "com.popcap.pvz2cthdhwct": 315,
  "com.microsoft.appmanager": 316,
  "com.hihonor.email": 317,
  "com.android.providers.contacts": 318,
  "com.xxxxxx.hiskytone": 319,
  "com.xxxxxx.skytone": 320,
  "com.hihonor.imedia.sws": 321,
  "com.hihonor.devicefinder": 322,
  "com.hihonor.android.wfdft": 323,
  "com.hihonor.handoff": 324,
  "com.honor.collectlog": 325,
  "com.netease.cloudmusic": 326,
  "com.iflytek.inputmethod": 327,
  "com.sankuai.youxuan": 328,
  "com.tmall.wireless": 329,
  "com.antutu.ABenchMark": 330,
  "com.kk.xx.newdevinfo": 331,
  "com.cainiao.wireless": 332,
  "com.jsmcc": 333,
  "com.zol.android": 334,
  "air.tv.douyu.android": 335,
  "com.chaozh.iReaderFree": 336,
  "com.gowlom2.cwjdcq": 337,
  "com.hihonor.desktop.systemui": 338
}
