-118.531	-120.625
8.844	-120.688
136.188	-120.781
263.5	-120.875
390.812	-121.031
518.094	-121.25
645.375	-121.5
772.656	-121.812
899.938	-122.156
1027.25	-122.594
1154.594	-123.031
1282	-123.5
1409.5	-123.938
1537.062	-124.375
1664.719	-124.75
1792.438	-125.031
1920.219	-125.188
2048	-125.25
2175.812	-125.188
2303.594	-125.031
2431.312	-124.719
2558.938	-124.375
2686.5	-123.938
2814	-123.469
2941.406	-123
3068.75	-122.562
3196.062	-122.156
3323.344	-121.812
3450.625	-121.5
3577.906	-121.25
3705.188	-121.031
3832.5	-120.875
3959.812	-120.75
4087.156	-120.688
4214.531	-120.625
-118.594	6.781
8.75	6.719
136.062	6.594
263.344	6.438
390.625	6.25
517.844	6
645.062	5.656
772.281	5.281
899.5	4.812
1026.75	4.281
1154.062	3.719
1281.469	3.125
1409	2.562
1536.625	2.031
1664.375	1.594
1792.188	1.25
1920.094	1.062
2048	1
2175.938	1.062
2303.844	1.25
2431.656	1.594
2559.406	2.031
2687.031	2.562
2814.531	3.156
2941.938	3.719
3069.25	4.312
3196.5	4.812
3323.719	5.281
3450.938	5.688
3578.156	6
3705.375	6.25
3832.656	6.438
3959.938	6.594
4087.25	6.719
4214.594	6.781
-118.656	134.188
8.656	134.094
135.938	133.969
263.156	133.781
390.375	133.531
517.531	133.219
644.656	132.812
771.781	132.312
898.938	131.75
1026.125	131.094
1153.438	130.406
1280.844	129.719
1408.406	129.062
1536.125	128.469
1663.969	128.031
1791.906	127.688
1919.938	127.5
2048	127.438
2176.094	127.5
2304.094	127.688
2432.062	128.031
2559.906	128.5
2687.625	129.062
2815.156	129.75
2942.562	130.438
3069.875	131.125
3197.062	131.781
3324.219	132.344
3451.344	132.812
3578.469	133.219
3705.656	133.531
3832.844	133.781
3960.062	133.969
4087.344	134.094
4214.656	134.188
-118.75	261.594
8.531	261.469
135.75	261.312
262.938	261.094
390.062	260.812
517.125	260.438
644.188	259.938
771.219	259.375
898.281	258.688
1025.406	257.938
1152.688	257.156
1280.125	256.406
1407.781	255.75
1535.625	255.219
1663.594	254.875
1791.688	254.656
1919.844	254.531
2048.031	254.5
2176.188	254.531
2304.344	254.656
2432.406	254.875
2560.406	255.25
2688.25	255.75
2815.875	256.438
2943.312	257.188
3070.594	257.969
3197.719	258.719
3324.781	259.406
3451.812	259.969
3578.875	260.438
3705.938	260.812
3833.062	261.094
3960.25	261.312
4087.469	261.469
4214.75	261.594
-118.844	389
8.375	388.875
135.562	388.688
262.656	388.438
389.688	388.094
516.688	387.656
643.594	387.125
770.531	386.438
897.5	385.688
1024.594	384.875
1151.906	384.062
1279.469	383.375
1407.281	382.875
1535.281	382.594
1663.438	382.469
1791.625	382.5
1919.812	382.531
2048.031	382.562
2176.219	382.531
2304.406	382.5
2432.594	382.5
2560.75	382.594
2688.75	382.906
2816.562	383.406
2944.094	384.094
3071.406	384.906
3198.5	385.719
3325.469	386.469
3452.375	387.125
3579.312	387.688
3706.312	388.094
3833.344	388.438
3960.438	388.688
4087.625	388.875
4214.844	389
-118.969	516.406
8.219	516.25
135.344	516.062
262.344	515.781
389.281	515.406
516.156	514.938
642.969	514.312
769.781	513.594
896.688	512.812
1023.812	512
1151.219	511.312
1278.969	510.844
1407.031	510.688
1535.281	510.75
1663.562	511.031
1791.781	511.344
1919.938	511.562
2048	511.656
2176.094	511.562
2304.25	511.312
2432.469	511.031
2560.75	510.75
2689	510.688
2817.031	510.875
2944.781	511.344
3072.188	512.031
3199.312	512.844
3326.219	513.625
3453.031	514.344
3579.844	514.938
3706.688	515.438
3833.625	515.781
3960.656	516.062
4087.781	516.25
4214.969	516.406
-119.062	643.812
8.062	643.656
135.094	643.469
262.031	643.156
388.844	642.781
515.594	642.25
642.281	641.625
769	640.906
895.906	640.125
1023.125	639.438
1150.781	638.969
1278.844	638.875
1407.219	639.125
1535.688	639.656
1664.031	640.281
1792.188	640.844
1920.156	641.25
2048	641.406
2175.875	641.25
2303.812	640.844
2432	640.25
2560.344	639.625
2688.812	639.125
2817.188	638.875
2945.25	639
3072.906	639.469
3200.094	640.156
3326.969	640.906
3453.719	641.656
3580.406	642.281
3707.125	642.781
3833.969	643.188
3960.906	643.469
4087.938	643.688
4215.062	643.812
-119.188	771.25
7.875	771.094
134.844	770.875
261.688	770.594
388.406	770.188
515.031	769.688
641.594	769.062
768.25	768.344
895.219	767.688
1022.656	767.219
1150.656	767.062
1279.125	767.344
1407.844	768
1536.438	768.844
1664.781	769.75
1792.781	770.5
1920.469	771
2048	771.188
2175.531	771
2303.25	770.469
2431.25	769.719
2559.594	768.812
2688.219	767.969
2816.906	767.344
2945.375	767.062
3073.375	767.219
3200.781	767.719
3327.719	768.375
3454.375	769.062
3580.969	769.688
3707.594	770.219
3834.312	770.594
3961.156	770.906
4088.125	771.094
4215.188	771.25
-119.312	898.688
7.688	898.562
134.594	898.344
261.344	898.062
387.969	897.688
514.469	897.219
640.938	896.625
767.594	896
894.719	895.5
1022.469	895.25
1150.906	895.438
1279.781	896.031
1408.75	896.906
1537.438	897.969
1665.688	898.938
1793.469	899.781
1920.844	900.312
2048	900.5
2175.156	900.281
2302.562	899.75
2430.344	898.906
2558.594	897.906
2687.312	896.875
2816.281	896
2945.156	895.406
3073.562	895.25
3201.312	895.5
3328.375	896.031
3455.031	896.656
3581.531	897.219
3708.031	897.719
3834.625	898.094
3961.406	898.375
4088.281	898.562
4215.312	898.688
-119.438	1026.156
7.531	1026.031
134.375	1025.844
261.031	1025.594
387.562	1025.25
513.938	1024.844
640.375	1024.344
767.094	1023.844
894.406	1023.5
1022.531	1023.5
1151.406	1023.875
1280.625	1024.594
1409.781	1025.562
1538.5	1026.625
1666.625	1027.594
1794.156	1028.375
1921.188	1028.906
2048	1029.062
2174.781	1028.875
2301.844	1028.344
2429.406	1027.562
2557.562	1026.594
2686.281	1025.531
2815.438	1024.562
2944.656	1023.844
3073.5	1023.469
3201.625	1023.531
3328.906	1023.875
3455.594	1024.344
3582.031	1024.844
3708.438	1025.281
3834.938	1025.625
3961.625	1025.875
4088.469	1026.031
4215.438	1026.156
-119.531	1153.656
7.406	1153.531
134.188	1153.406
260.781	1153.188
387.188	1152.906
513.531	1152.562
639.938	1152.188
766.719	1151.844
894.281	1151.656
1022.75	1151.75
1152	1152.188
1281.5	1152.906
1410.75	1153.781
1539.438	1154.688
1667.469	1155.531
1794.781	1156.219
1921.531	1156.656
2048	1156.812
2174.438	1156.656
2301.219	1156.188
2428.562	1155.5
2556.594	1154.656
2685.312	1153.75
2814.594	1152.906
2944.094	1152.188
3073.281	1151.75
3201.75	1151.656
3329.281	1151.844
3456.062	1152.188
3582.438	1152.594
3708.781	1152.938
3835.219	1153.188
3961.812	1153.406
4088.594	1153.531
4215.531	1153.656
-119.594	1281.125
7.281	1281.062
134.031	1280.969
260.562	1280.812
386.938	1280.625
513.219	1280.406
639.625	1280.156
766.5	1279.938
894.25	1279.844
1023.031	1279.969
1152.531	1280.344
1282.219	1280.906
1411.531	1281.531
1540.219	1282.188
1668.125	1282.812
1795.281	1283.312
1921.812	1283.656
2047.969	1283.75
2174.156	1283.625
2300.719	1283.281
2427.875	1282.781
2555.812	1282.188
2684.531	1281.531
2813.875	1280.875
2943.531	1280.344
3073.031	1279.969
3201.781	1279.844
3329.5	1279.938
3456.375	1280.156
3582.75	1280.406
3709.031	1280.625
3835.406	1280.812
3961.969	1280.969
4088.688	1281.062
4215.594	1281.125
-119.656	1408.656
7.219	1408.594
133.938	1408.562
260.438	1408.5
386.781	1408.406
513.031	1408.281
639.438	1408.156
766.375	1408.062
894.281	1408.031
1023.25	1408.125
1152.906	1408.312
1282.656	1408.594
1412.031	1408.906
1540.719	1409.25
1668.562	1409.562
1795.625	1409.812
1922	1409.969
2047.969	1410.031
2173.969	1409.969
2300.375	1409.781
2427.438	1409.531
2555.312	1409.25
2684.031	1408.906
2813.406	1408.594
2943.188	1408.312
3072.812	1408.125
3201.75	1408.031
3329.625	1408.062
3456.562	1408.156
3582.938	1408.281
3709.188	1408.406
3835.531	1408.5
3962.031	1408.562
4088.75	1408.594
4215.656	1408.656
-119.656	1536.156
7.219	1536.156
133.906	1536.156
260.406	1536.156
386.719	1536.188
512.969	1536.188
639.375	1536.219
766.344	1536.219
894.312	1536.219
1023.312	1536.219
1153	1536.188
1282.812	1536.156
1412.188	1536.094
1540.844	1536.062
1668.688	1536.031
1795.719	1536
1922.031	1535.969
2047.969	1535.938
2173.938	1535.969
2300.281	1536
2427.312	1536.031
2555.188	1536.062
2683.875	1536.125
2813.281	1536.156
2943.062	1536.188
3072.75	1536.219
3201.75	1536.219
3329.656	1536.219
3456.594	1536.219
3583	1536.188
3709.25	1536.188
3835.562	1536.156
3962.062	1536.156
4088.781	1536.156
4215.656	1536.156
-119.625	1663.656
7.25	1663.688
133.938	1663.75
260.469	1663.844
386.812	1663.969
513.062	1664.125
639.469	1664.25
766.406	1664.375
894.281	1664.438
1023.219	1664.312
1152.844	1664.062
1282.594	1663.719
1411.938	1663.312
1540.625	1662.906
1668.5	1662.531
1795.562	1662.219
1921.969	1662
2047.969	1661.938
2174	1662
2300.438	1662.219
2427.531	1662.531
2555.406	1662.938
2684.125	1663.344
2813.5	1663.75
2943.25	1664.094
3072.875	1664.312
3201.75	1664.438
3329.594	1664.375
3456.531	1664.25
3582.906	1664.094
3709.156	1663.969
3835.5	1663.844
3962.031	1663.75
4088.75	1663.688
4215.625	1663.656
-119.594	1791.156
7.312	1791.25
134.062	1791.344
260.625	1791.5
387	1791.719
513.281	1792
639.688	1792.281
766.531	1792.531
894.25	1792.625
1022.969	1792.5
1152.406	1792.094
1282.062	1791.5
1411.375	1790.781
1540.062	1790.062
1668	1789.375
1795.188	1788.844
1921.75	1788.469
2047.969	1788.344
2174.219	1788.469
2300.812	1788.844
2428.031	1789.406
2555.969	1790.062
2684.688	1790.812
2814.031	1791.5
2943.656	1792.094
3073.094	1792.5
3201.781	1792.625
3329.469	1792.5
3456.312	1792.25
3582.688	1791.969
3708.969	1791.719
3835.375	1791.5
3961.938	1791.344
4088.688	1791.25
4215.594	1791.156
-119.5	1918.656
7.438	1918.75
134.219	1918.906
260.844	1919.125
387.281	1919.438
513.625	1919.781
640.031	1920.219
766.812	1920.594
894.281	1920.812
1022.688	1920.719
1151.844	1920.281
1281.281	1919.531
1410.531	1918.625
1539.219	1917.688
1667.281	1916.812
1794.625	1916.094
1921.469	1915.625
2048	1915.469
2174.531	1915.625
2301.375	1916.094
2428.75	1916.844
2556.812	1917.719
2685.531	1918.656
2814.781	1919.562
2944.219	1920.312
3073.344	1920.719
3201.719	1920.812
3329.188	1920.562
3455.938	1920.188
3582.344	1919.781
3708.688	1919.406
3835.156	1919.125
3961.781	1918.906
4088.562	1918.75
4215.5	1918.656
-119.406	2046.125
7.562	2046.25
134.406	2046.438
261.094	2046.719
387.656	2047.062
514.062	2047.5
640.5	2048.031
767.219	2048.531
894.469	2048.938
1022.5	2049
1151.25	2048.656
1280.406	2047.938
1409.531	2046.969
1538.25	2045.906
1666.406	2044.906
1793.969	2044.125
1921.125	2043.594
2048	2043.406
2174.875	2043.594
2302.031	2044.125
2429.625	2044.938
2557.812	2045.938
2686.531	2047
2815.656	2047.969
2944.812	2048.688
3073.562	2049
3201.562	2048.906
3328.781	2048.531
3455.469	2048
3581.906	2047.5
3708.344	2047.031
3834.875	2046.688
3961.562	2046.438
4088.406	2046.25
4215.406	2046.125
-119.281	2173.594
7.75	2173.719
134.656	2173.938
261.438	2174.219
388.062	2174.625
514.594	2175.094
641.094	2175.719
767.75	2176.344
894.812	2176.906
1022.469	2177.188
1150.812	2177.094
1279.594	2176.562
1408.5	2175.719
1537.188	2174.688
1665.469	2173.719
1793.281	2172.906
1920.75	2172.375
2048	2172.188
2175.25	2172.375
2302.719	2172.938
2430.562	2173.75
2558.844	2174.719
2687.562	2175.75
2816.469	2176.594
2945.25	2177.094
3073.531	2177.188
3201.188	2176.875
3328.219	2176.312
3454.875	2175.688
3581.375	2175.094
3707.906	2174.594
3834.562	2174.219
3961.344	2173.938
4088.25	2173.719
4215.281	2173.594
-119.156	2301.031
7.906	2301.188
134.906	2301.406
261.781	2301.688
388.5	2302.094
515.156	2302.594
641.75	2303.25
768.438	2303.938
895.375	2304.656
1022.75	2305.188
1150.656	2305.406
1279.031	2305.219
1407.656	2304.656
1536.25	2303.875
1664.594	2303.031
1792.625	2302.281
1920.406	2301.812
2048	2301.656
2175.625	2301.812
2303.375	2302.312
2431.438	2303.031
2559.812	2303.875
2688.406	2304.688
2817	2305.219
2945.375	2305.406
3073.281	2305.188
3200.625	2304.625
3327.562	2303.938
3454.219	2303.219
3580.812	2302.594
3707.469	2302.062
3834.219	2301.688
3961.094	2301.375
4088.094	2301.188
4215.156	2301.031
-119.062	2428.469
8.094	2428.594
135.156	2428.812
262.094	2429.094
388.969	2429.5
515.719	2430
642.438	2430.625
769.188	2431.375
896.094	2432.156
1023.25	2432.875
1150.844	2433.406
1278.844	2433.594
1407.156	2433.438
1535.562	2433.031
1663.906	2432.469
1792.094	2431.969
1920.094	2431.594
2048	2431.469
2175.938	2431.594
2303.938	2431.969
2432.125	2432.5
2560.5	2433.062
2688.906	2433.469
2817.188	2433.594
2945.156	2433.375
3072.75	2432.844
3199.906	2432.125
3326.812	2431.344
3453.531	2430.594
3580.25	2429.969
3707.031	2429.469
3833.875	2429.094
3960.844	2428.812
4087.906	2428.594
4215.062	2428.469
-118.938	2555.875
8.281	2556.031
135.375	2556.219
262.438	2556.469
389.406	2556.844
516.281	2557.312
643.125	2557.906
769.969	2558.625
896.875	2559.406
1024	2560.219
1151.375	2560.969
1279.062	2561.5
1407.062	2561.75
1535.25	2561.781
1663.5	2561.594
1791.719	2561.375
1919.906	2561.188
2048	2561.094
2176.125	2561.188
2304.312	2561.375
2432.531	2561.594
2560.781	2561.781
2688.969	2561.75
2816.938	2561.469
2944.656	2560.938
3072	2560.219
3199.094	2559.406
3326.031	2558.594
3452.875	2557.875
3579.719	2557.312
3706.594	2556.844
3833.562	2556.469
3960.594	2556.219
4087.75	2556
4214.938	2555.875
-118.812	2683.281
8.438	2683.406
135.594	2683.594
262.719	2683.844
389.781	2684.156
516.781	2684.562
643.75	2685.094
770.688	2685.75
897.688	2686.5
1024.812	2687.312
1152.094	2688.125
1279.625	2688.812
1407.375	2689.375
1535.344	2689.75
1663.438	2689.938
1791.625	2690
1919.812	2690
2048.031	2689.969
2176.219	2690
2304.406	2690
2432.594	2689.938
2560.688	2689.75
2688.656	2689.375
2816.406	2688.812
2943.906	2688.094
3071.188	2687.281
3198.312	2686.469
3325.281	2685.719
3452.25	2685.094
3579.219	2684.562
3706.219	2684.125
3833.281	2683.812
3960.406	2683.594
4087.594	2683.406
4214.812	2683.281
-118.719	2810.688
8.562	2810.812
135.812	2810.938
263	2811.156
390.125	2811.438
517.219	2811.812
644.312	2812.25
771.344	2812.812
898.438	2813.469
1025.594	2814.219
1152.875	2814.969
1280.312	2815.719
1407.938	2816.375
1535.719	2816.938
1663.688	2817.344
1791.75	2817.594
1919.875	2817.719
2048.031	2817.781
2176.156	2817.719
2304.281	2817.594
2432.344	2817.312
2560.281	2816.906
2688.094	2816.375
2815.719	2815.688
2943.125	2814.938
3070.406	2814.188
3197.562	2813.438
3324.625	2812.812
3451.688	2812.25
3578.75	2811.781
3705.875	2811.438
3833	2811.156
3960.188	2810.938
4087.438	2810.781
4214.719	2810.688
-118.625	2938.094
8.688	2938.188
135.969	2938.312
263.219	2938.469
390.438	2938.719
517.594	2939.031
644.75	2939.406
771.906	2939.875
899.094	2940.406
1026.312	2941.031
1153.594	2941.688
1281	2942.375
1408.562	2943
1536.25	2943.594
1664.062	2944.062
1791.969	2944.375
1919.969	2944.594
2048	2944.656
2176.062	2944.594
2304.031	2944.375
2431.969	2944.031
2559.781	2943.562
2687.469	2943
2815	2942.344
2942.406	2941.656
3069.719	2941
3196.906	2940.375
3324.094	2939.844
3451.25	2939.375
3578.406	2939
3705.562	2938.719
3832.781	2938.469
3960.031	2938.312
4087.312	2938.188
4214.656	2938.094
-118.562	3065.5
8.781	3065.562
136.094	3065.656
263.406	3065.812
390.656	3066
517.906	3066.25
645.156	3066.562
772.375	3066.906
899.625	3067.344
1026.875	3067.844
1154.219	3068.406
1281.625	3068.938
1409.125	3069.5
1536.75	3070
1664.438	3070.438
1792.25	3070.75
1920.125	3070.938
2048	3071
2175.906	3070.938
2303.781	3070.75
2431.562	3070.406
2559.281	3070
2686.875	3069.469
2814.375	3068.938
2941.781	3068.375
3069.125	3067.844
3196.406	3067.344
3323.625	3066.906
3450.844	3066.531
3578.094	3066.219
3705.344	3066
3832.594	3065.812
3959.906	3065.656
4087.219	3065.562
4214.594	3065.5
-118.531	3192.906
8.844	3192.938
136.219	3193.031
263.531	3193.156
390.844	3193.281
518.156	3193.469
645.438	3193.719
772.719	3194
900.031	3194.344
1027.344	3194.75
1154.719	3195.156
1282.125	3195.594
1409.594	3196.031
1537.156	3196.438
1664.781	3196.781
1792.5	3197.031
1920.25	3197.188
2048	3197.25
2175.781	3197.188
2303.531	3197.031
2431.219	3196.75
2558.844	3196.406
2686.406	3196
2813.875	3195.562
2941.312	3195.125
3068.656	3194.719
3195.969	3194.344
3323.281	3194
3450.562	3193.719
3577.844	3193.469
3705.156	3193.281
3832.469	3193.125
3959.812	3193.031
4087.156	3192.938
4214.531	3192.906