{
	"dataVersion": "20240205",
	"appName": {
		"万家基金": [
			"万家基金",
			"萬家基金",
			"晚家集金",
			"丸家基金",
			"万庭基金",
			"腕家基金",
			"萬稼基金",
			"万稼基金",
			"万嫁基金",
			"万镓基金",
			"万傢基金",
			"万鎵基金",
			"万幏基金",
			"万糘基金",
			"万榢基金"
		],
		"富国富钱包": [
			"富国富钱包",
			"富國富錢包",
			"福过福千宝",
			"复果付钳袍",
			"富邦富钱包",
			"附国附钱包",
			"富國富钱包",
			"富国富錢包",
			"富国福钱包",
			"富国福钱宝",
			"富國福钱包",
			"富國福钱宝",
			"冨国富钱包",
			"冨国冨钱包"
		],
		"广发基金": [
			"广发基金",
			"广发基錦",
			"广發基金",
			"广發基錦",
			"廣发基金",
			"廣发基錦",
			"廣發基金",
			"廣發基錦"
		],
		"华夏基金管家": [
			"华夏基金管家",
			"华夏基金管嘉",
			"华夏基金管加",
			"華夏基金管家",
			"華夏基金管嘉",
			"華夏基金管加"
		],
		"嘉实理财嘉": [
			"嘉实理财嘉",
			"嘉实理财佳",
			"嘉实理财家",
			"嘉实理財嘉",
			"嘉实理財佳",
			"嘉实理財家",
			"嘉實理财嘉",
			"嘉實理财佳",
			"嘉實理财家",
			"嘉實理財嘉",
			"嘉實理財佳",
			"嘉實理財家",
			"佳实理财嘉",
			"佳实理财佳",
			"佳实理财家",
			"佳实理財嘉",
			"佳实理財佳",
			"佳实理財家",
			"佳實理财嘉",
			"佳實理财佳",
			"佳實理财家",
			"佳實理財嘉",
			"佳實理財佳",
			"佳實理財家",
			"家实理财嘉",
			"家实理财佳",
			"家实理财家",
			"家实理財嘉",
			"家实理財佳",
			"家实理財家",
			"家實理财嘉",
			"家實理财佳",
			"家實理财家",
			"家實理財嘉",
			"家實理財佳",
			"家實理財家"
		],
		"景顺长城基金": [
			"景顺长城基金",
			"景顺长城基錦",
			"景顺長城基金",
			"景顺長城基錦",
			"景順长城基金",
			"景順长城基錦",
			"景順長城基金",
			"景順長城基錦"
		],
		"中信模拟期权": [
			"中信模拟期权",
			"中信模拟期權",
			"中信模擬期权",
			"中信模擬期權"
		],
		"中信汇点期权": [
			"中信汇点期权",
			"中信汇点期權",
			"中信汇點期权",
			"中信汇點期權",
			"中信匯点期权",
			"中信匯点期權",
			"中信匯點期权",
			"中信匯點期權"
		],
		"中信证券至胜": [
			"中信证券至胜",
			"中信证券至勝",
			"中信證券至胜",
			"中信證券至勝"
		],
		"中信证券": [
			"中信证券",
			"中信證券"
		],
		"中国银河证券": [
			"中国银河证券",
			"中国银河證券",
			"中国銀河证券",
			"中国銀河證券",
			"中國银河证券",
			"中國银河證券",
			"中國銀河证券",
			"中國銀河證券"
		],
		"银河掌厅": [
			"银河掌厅",
			"银河掌廳",
			"銀河掌厅",
			"銀河掌廳"
		],
		"银河天弓": [
			"银河天弓",
			"銀河天弓"
		],
		"玉衡股票期权交易系统": [
			"玉衡股票期权交易系统",
			"玉衡股票期权交易系統",
			"玉衡股票期權交易系统",
			"玉衡股票期權交易系統"
		],
		"海通e海通财": [
			"海通e海通财",
			"海通e海通財",
			"海通E海通财",
			"海通E海通財"
		],
		"国泰君安君弘": [
			"国泰君安君弘",
			"國泰君安君弘"
		],
		"江海司南": [
			"江海司南",
			"江南司南",
			"江海同南"
		],
		"江海锦龙综合版": [
			"江海锦龙综合版",
			"江海锦龙綜合版",
			"江海锦龍综合版",
			"江海锦龍綜合版",
			"江海錦龙综合版",
			"江海錦龙綜合版",
			"江海錦龍综合版",
			"江海錦龍綜合版"
		],
		"易方达e钱包": [
			"易方达e钱包",
			"易方达e錢包",
			"易方達e钱包",
			"易方達e錢包",
			"易方达E钱包",
			"易方达E錢包",
			"易方達E钱包",
			"易方達E錢包"
		],
		"雪球基金": [
			"雪球基金",
			"血球基金",
			"雪王基金",
			"冰雪基金",
			"冰球基金",
			"血旺基金"
		],
		"泉果基金": [
			"泉果基金",
			"湶果基金",
			"泉菓基金",
			"湶菓基金",
			"泉裹基金",
			"瑔果基金",
			"瑔菓基金"
		],
		"鹏华A加钱包": [
			"鹏华A加钱包",
			"鹏华A加錢包",
			"鹏華A加钱包",
			"鹏華A加錢包",
			"鵬华A加钱包",
			"鵬华A加錢包",
			"鵬華A加钱包",
			"鵬華A加錢包",
			"鹏华a加钱包",
			"鹏华a加錢包",
			"鹏華a加钱包",
			"鹏華a加錢包",
			"鵬华a加钱包",
			"鵬华a加錢包",
			"鵬華a加钱包",
			"鵬華a加錢包"
		]
	}
}