{
  "beat": [
    0,256,896,1984,2368,3680,3936,5152,5920,6112,6560,6880,7200,7616,7776,8031,8384,8640,9024,9760,10208,10528,10688,10848,11264,11552,11872,12192,12672,12928,13152,13408,13568,13728,14368,14656,15008,15200,15392,16160,16448,17184,17504,17664,17824,17984,18144,18368,18592,18880,19264,19520,19680,19872,20032,20288,20448,20672,21024,21216,21376,21632,21792,22112,22432,22624,22784,23008,23168,23456,23680,23840,24064,24448,24608,24768,24928,25120,25280,25536,25728,25888,26048,26336,26592,26752,26912,27104,27264,27424,27584,29974
    ],
  "beat_count": 92,
  "downbeat": [
    0,
    256,
    2368,
    6112,
    7616,
    9024,
    10528,
    12672,
    14656,
    16448,
    18144,
    21792,
    24608,
    26336,
    29696,
    29974
    ],
  "downbeat_count": 16
}