{
  "serial_name":"/dev/ttyHS1",
  "data_serial_bps":115200,
  "bios_serial_bps":38400,
  "download_serial_bps":3840000,
  "serial_flowControl":0,
  "serial_parity":0,
  "arfcn":201,
  "tx_gain":0,
  "rx_gain":0,
  "sweep_point":0,
  "tcmode_looptest":0,
  "rxfreq_stadj":100,
  "duplex_mode":0,
  "longdelay_switch":0,
  "PNB15_Rxdelay":0,
  "PNB15_Txdelay":0,
  "LongDelay_FN":0,
  "tcmode_byphyself":0,
  "tfsync_flag":1,
  "tx_fn_e":2,
  "em_fn_e":2,
  "ter_type":0,
  "freqlist0":20,
  "freqlist1":201,
  "freqlist2":381,
  "freqlist3":562,
  "freqlist4":742,
  "freqlist5":923,
  "freqlist6":1103,
  "freqlist7":0,
  "freqlist8":0,
  "freqlist9":0,
  "stack_mode":8,
  "log_file":"/data/vendor/log/tt_log",
  "auto_download":1,
  "download_file":"/odm/firmware",
  "bin_file":"0x14da8G0x025c4G0x0a6b8G0x00188G0x0f97cG0x0c8f4G0x04ff8G",
  "age_power_on":1,
  "age_reset":0,
  "age_uart":1,
  "age_sleep":1,
  "age_test_time":50,
  "cal_file":"/mnt/vendor/persist/hn_sat/*calnv*.bin",
  "voice_1_2k":0,
  "voice_2_4k":1,
  "temperature_compensate_flag":1,
  "temperature_compensate_value0":-4,
  "temperature_compensate_value1":-4,
  "temperature_compensate_value2":-2,
  "temperature_compensate_value3":-2,
  "temperature_compensate_value4":0,
  "temperature_compensate_value5":2,
  "temperature_compensate_value6":6,
  "temperature_compensate_value7":8,
  "temperature_compensate_value8":12,
  "temperature_compensate_value9":16,
  "single_log_file_size":60000000,
  "log_file_num":50,
  "lowpower":1,
  "lowpwr_log":0,
  "lowpower_cmer":0,
  "lowpower_cmer_sleep":5,
  "lowpower_cmer_wake":2,
  "cp_abnormal_state_file_name":"/data/vendor/log/tt_log/cp_boot_state.txt",
  "rfic_temperature_threshold":80,
  "rfic_practical_power_threshold":2000,
  "rfic_report_high_threshold":600,
  "rfic_report_low_threshold":600
}
