<eps>	0
接听电话	1
挂断电话	2
音箱接听	3
电视接听	4
平板接听	5
语音接听	6
派的接听	7
智慧屏接听	8
手机接听	9
手接听	10
来电话了	11
手机	12
手	13
不用	14
接听	15
派的	16
你的圈圈	17
语音	18
语影	19
云	20
你的	21
电话响了	22
有你电话	23
谁的电话	24
好像有	25
要不要接	26
别接	27
接不接	28
支撑	29
电视	30
智慧屏	31
智慧语	32
音箱	33
平板	34
我来	35
等会	36
谁打的	37
谁的	38
等会回	39
我的	40
暂时	41
回个	42
来了一个	43
起来	44
暂时不	45
把它	46
谁给我	47
谁给你	48
接	49
接听电	50
挂	51
挂断	52
挂断电	53
断电话	54
听电话	55
电话	56
话是天使	57
与英雄联盟	58
的话	59
看他	60
今年	61
实际	62
面临	63
炙热	64
第二排	65
白起	66
这也是	67
貌似	68
进塔	69
但是	70
势力	71
总决赛	72
紫婷	73
跑到	74
看到	75
听众	76
朋友	77
正在	78
收听	79
爆发	80
剑气	81
双间的脑浆	82
难以想象	83
天才	84
金锁	85
青羽阁	86
展天	87
般的精	88
高手	89
不断	90
情况	91
电扇	92
不想	93
很想	94
板油	95
老板	96
塑料板	97
预制板	98
视力	99
无视	100
巫师	101
十个	102
一时	103
时时	104
石头	105
大师	106
门派	107
语文	108
美国	109
英雄	110
好人	111
获得	112
近视	113
不是	114
合适	115
方式	116
可是	117
想你	118
想念	119
很像	120
大象	121
得到	122
好的	123
中央	124
钢板	125
央广	126
明网	127
挑战	128
肩上	129
他们能	130
减轻	131
拼搏	132
听见	133
挂到	134
刮刀	135
打响	136
印象	137
预想	138
长流	139
我	140
了	141
有	142
不	143
要听	144
有没	145
深圳	146
车站	147
有人	148
我吗	149
两	150
笨蛋	151
每	152
还在	153
主人	154
三年	155
问	156
节日	157
百度	158
永远	159
最后	160
汽车	161
网	162
周	163
新闻	164
服务	165
生	166
办法	167
起	168
光棍	169
昨晚	170
高兴	171
感冒	172
陪我	173
不着	174
笑	175
老师	176
生气	177
他们	178
中心	179
不在	180
死	181
跟我	182
理我	183
了呢	184
把我	185
关闭	186
猪	187
收	188
女孩	189
我只	190
五十	191
功能	192
还要	193
总	194
清楚	195
其实	196
李	197
到我	198
武汉	199
机器	200
睡着	201
冷	202
价格	203
祝福	204
爱我	205
空间	206
对我	207
查找	208
地	209
网站	210
聪明	211
多久	212
宝宝	213
我很	214
刚刚	215
考	216
新年	217
没事	218
元旦	219
为我	220
我没	221
安全	222
送	223
十二	224
时	225
地址	226
翻	227
心	228
消息	229
四川	230
本来	231
错	232
黄色	233
全	234
我吧	235
女生	236
取消	237
会儿	238
要我	239
突然	240
寂寞	241
书	242
活动	243
内容	244
肚子	245
室	246
不知	247
讨厌	248
美	249
其	250
至	251
笨	252
石	253
发生	254
希	255
麻烦	256
真的很	257
忘记	258
原来	259
都在	260
太多	261
多长	262
不接	263
想吃	264
早晨	265
药	266
东	267
不说	268
发货	269
然后	270
重要	271
市场	272
蛋	273
情	274
我妈	275
我做	276
工资	277
前	278
关掉	279
城	280
管理	281
毕业	282
专业	283
我到	284
很多	285
求	286
发送	287
就算	288
聊聊	289
减肥	290
平平	291
删除	292
春节	293
有关	294
色球	295
距离	296
旅游	297
未来	298
卓	299
性	300
厉害	301
半	302
们	303
交通	304
办公	305
IPHONE	306
温度	307
有多	308
头	309
冬至	310
计算	311
懂	312
地铁	313
厕所	314
汽	315
浏览	316
疼	317
全部	318
体育	319
餐馆	320
主席	321
公园	322
力	323
国	324
治疗	325
过我	326
都要	327
分	328
痛	329
不得	330
木	331
凤凰	332
正常	333
兴趣	334
饿	335
周围	336
肯德	337
南昌	338
昨	339
赶紧	340
输入	341
密码	342
工程	343
不睡	344
面	345
今日	346
人不	347
等我	348
合肥	349
属于	350
八岁	351
就没	352
欺负	353
国庆	354
有些	355
姑娘	356
就在	357
左右	358
早起	359
房子	360
看来	361
贵阳	362
星雨	363
祝您	364
斗	365
请我	366
费	367
我用	368
单位	369
很久	370
装	371
表白	372
称呼	373
乱	374
不够	375
道为	376
购物	377
有雨	378
要到	379
贵州	380
赚钱	381
没吃	382
万	383
精神	384
诺基	385
滚	386
植物	387
摩托	388
站到	389
山西	390
洛阳	391
寝室	392
控制	393
亲亲	394
老子	395
卫生	396
寻找	397
窝里	398
晓得	399
试	400
转弯	401
楼主	402
更新	403
地震	404
二三	405
几年	406
主	407
海口	408
都市	409
着呢	410
富	411
泉州	412
都说	413
社	414
不爱	415
篮球	416
长得	417
我爸	418
军	419
长途	420
朱	421
徐州	422
破	423
最爱	424
等着	425
客运	426
要买	427
特	428
春	429
发来	430
存在	431
我玩	432
浪费	433
星星	434
舍	435
比我	436
孤单	437
式	438
看书	439
忙完	440
用卡	441
秀	442
脾气	443
喊我	444
数据	445
升	446
不冷	447
集团	448
往	449
梦想	450
身高	451
姓名	452
生人	453
评论	454
美容	455
使	456
性格	457
维修	458
说呢	459
陕西	460
脑子	461
离我	462
事件	463
草	464
经验	465
猪肉	466
他在	467
感动	468
元	469
想买	470
公主	471
空	472
唐诗	473
皇帝	474
夫妻	475
不如	476
老鼠	477
躺在	478
属	479
米	480
叫做	481
主持	482
未	483
货	484
完美	485
LOVE	486
处女	487
零五	488
要发	489
陌	490
人和	491
校区	492
幽默	493
身	494
面积	495
动听	496
炒	497
牛肉	498
企业	499
王菲	500
十年	501
东北	502
明明	503
科学	504
宽带	505
才不	506
几次	507
名单	508
套	509
认真	510
傻子	511
自由	512
分享	513
狮	514
九七	515
很不	516
游记	517
招	518
名叫	519
检查	520
又没	521
物流	522
躺	523
分数	524
嘞	525
数	526
郭	527
九五	528
最炫	529
天水	530
场	531
我饿	532
专卖	533
康	534
牙	535
商城	536
百科	537
光	538
脱	539
七日	540
愚人	541
勇士	542
书记	543
气冷	544
寄	545
见到	546
诺	547
秦	548
四级	549
粉	550
就想	551
五日	552
想过	553
六十	554
哇	555
骗	556
抱	557
客气	558
动漫	559
让人	560
男女	561
到来	562
专用	563
有看	564
丢	565
流氓	566
脑	567
骗我	568
找找	569
要再	570
就像	571
送我	572
脚	573
经过	574
有在	575
乡	576
都能	577
蓝牙	578
四五	579
清理	580
报告	581
不该	582
羊	583
兔子	584
梅	585
养	586
佛山	587
抢	588
能让	589
猪头	590
生病	591
杀	592
终极	593
理	594
生产	595
六日	596
状况	597
克	598
我心	599
何必	600
来说	601
常州	602
桌面	603
果	604
各位	605
材料	606
二五	607
葡萄	608
白痴	609
早饭	610
客	611
色情	612
场所	613
美元	614
天涯	615
无敌	616
都听	617
扣扣	618
八五	619
周六	620
数字	621
总统	622
没来	623
关注	624
部分	625
购买	626
不清	627
特产	628
面对	629
王子	630
俊杰	631
如此	632
做到	633
抱抱	634
团	635
重复	636
能吃	637
心疼	638
柴油	639
都睡	640
拯救	641
成语	642
丑	643
就能	644
若	645
戴	646
人要	647
混	648
环境	649
班车	650
谱	651
叔叔	652
逛街	653
心中	654
温	655
公安	656
勇气	657
到时	658
的哦	659
子书	660
绵阳	661
吹	662
山市	663
喂	664
项目	665
高级	666
日程	667
我写	668
屁	669
作品	670
招呼	671
来找	672
有流	673
有过	674
待	675
同事	676
想干	677
网游	678
疯狂	679
驾驶	680
额	681
疯	682
火线	683
俩	684
古	685
来着	686
父母	687
沙	688
名称	689
仙	690
居然	691
多高	692
姓	693
真实	694
玩玩	695
宠物	696
有病	697
亚洲	698
全球	699
欠	700
爱人	701
校园	702
主演	703
腾	704
遵义	705
跟他	706
表示	707
事都	708
责任	709
运	710
启动	711
商务	712
七七	713
假如	714
万事	715
糟	716
悟空	717
双节	718
周五	719
假日	720
蒙古	721
公共	722
二八	723
利	724
勿扰	725
泡	726
牛奶	727
莫	728
足球	729
输	730
红色	731
喽	732
孕妇	733
桥	734
巧	735
阳	736
五天	737
赣州	738
从我	739
要带	740
招生	741
西游	742
头疼	743
做些	744
承认	745
做错	746
逗	747
羽绒	748
网速	749
有爱	750
甲	751
忍者	752
可怕	753
顺便	754
我请	755
舍得	756
今儿	757
里来	758
要脸	759
中考	760
日来	761
十天	762
几种	763
柳州	764
病毒	765
金刚	766
胸部	767
宇宙	768
酱油	769
面试	770
身材	771
伤感	772
那不	773
文学	774
邓	775
珠海	776
不玩	777
素	778
妇女	779
黑色	780
OK	781
辽宁	782
市区	783
据说	784
格式	785
油	786
副	787
美图	788
敏感	789
做过	790
动力	791
扬州	792
真诚	793
章	794
十日	795
度过	796
圆	797
汤圆	798
三围	799
改成	800
错过	801
包括	802
翅膀	803
有缘	804
雅人	805
发烧	806
邓丽	807
讨论	808
准时	809
长江	810
精彩	811
思考	812
三九	813
顾问	814
路由	815
冻	816
组织	817
后台	818
永恒	819
同样	820
重生	821
朝阳	822
资格	823
设定	824
佳	825
千年	826
摸	827
国荣	828
怕我	829
我从	830
劳动	831
张翰	832
川	833
说错	834
婚前	835
猪猪	836
期末	837
扣	838
为啥	839
女士	840
天来	841
修改	842
温暖	843
种人	844
都很	845
友谊	846
平洋	847
轻松	848
有种	849
书店	850
战士	851
坏人	852
二手	853
拉萨	854
骗子	855
房产	856
梁静	857
明日	858
巴马	859
早睡	860
邮	861
蓝色	862
懒	863
山寨	864
抽烟	865
途	866
邮编	867
钢琴	868
我的爱	869
盐城	870
俄	871
岳阳	872
肺	873
敷衍	874
魔术	875
烧烤	876
烦恼	877
浩特	878
驰	879
追求	880
得多	881
土	882
趟	883
共产	884
很忙	885
惹	886
像我	887
周日	888
我拿	889
第四	890
带来	891
存	892
史	893
杨幂	894
京	895
人人	896
刺激	897
千里	898
多钱	899
丝	900
似	901
型	902
政策	903
竟然	904
当前	905
那也	906
单机	907
骂人	908
文明	909
蛮	910
峰	911
日文	912
五三	913
专科	914
厚	915
付款	916
克力	917
排骨	918
眼里	919
就来	920
很烦	921
娃娃	922
装备	923
登陆	924
功夫	925
零三	926
哈喽	927
请假	928
长城	929
混蛋	930
设	931
会来	932
条路	933
用手	934
动作	935
秋天	936
房价	937
魅力	938
观看	939
我干	940
事成	941
四日	942
陌生	943
耳机	944
完全	945
我得	946
高潮	947
拜托	948
含	949
滋味	950
军事	951
预防	952
晴天	953
裸体	954
人多	955
WAP	956
洗完	957
骑士	958
呃	959
凌晨	960
位于	961
天河	962
百元	963
周年	964
总理	965
保证	966
送到	967
穷	968
汽油	969
呆	970
鼻子	971
汪峰	972
零四	973
和谁	974
谈过	975
芜湖	976
红柿	977
周星	978
负责	979
瑞	980
租车	981
穿梭	982
忙吗	983
命	984
复活	985
刚从	986
恶心	987
西站	988
工具	989
会玩	990
己	991
伦敦	992
天然	993
会所	994
熟悉	995
炫	996
滚蛋	997
秋	998
海阔	999
湘潭	1000
做完	1001
国语	1002
伞	1003
要让	1004
良心	1005
新娘	1006
四年	1007
何处	1008
高跟	1009
酒泉	1010
不靠	1011
平方	1012
苍井	1013
日元	1014
心如	1015
相关	1016
堵车	1017
蹲	1018
立	1019
心都	1020
四分	1021
订购	1022
珠	1023
古诗	1024
售价	1025
魔女	1026
胜利	1027
毛球	1028
足彩	1029
侦探	1030
五四	1031
爬山	1032
桌	1033
风流	1034
西南	1035
水平	1036
谁在	1037
高等	1038
跟着	1039
断	1040
暖	1041
霆锋	1042
照常	1043
危害	1044
几时	1045
几度	1046
闯	1047
蜜	1048
头痛	1049
恐龙	1050
鞍山	1051
奇	1052
几日	1053
司机	1054
商丘	1055
坑	1056
奇迹	1057
包容	1058
现场	1059
洋	1060
火星	1061
来吃	1062
门市	1063
罗拉	1064
板	1065
相遇	1066
做呢	1067
男友	1068
自私	1069
收入	1070
就够	1071
把他	1072
枪	1073
郑爽	1074
商品	1075
情侣	1076
严	1077
琴	1078
浪	1079
问道	1080
但我	1081
用我	1082
新婚	1083
TO	1084
跳舞	1085
沈	1086
组	1087
从事	1088
湖人	1089
光明	1090
厘米	1091
松	1092
欣	1093
都做	1094
寺	1095
步骤	1096
形成	1097
鄙视	1098
张雨	1099
进来	1100
某	1101
敏	1102
山区	1103
日前	1104
长期	1105
狗狗	1106
索尼	1107
想睡	1108
兆	1109
清除	1110
球队	1111
会让	1112
熟	1113
乔	1114
叫他	1115
搬	1116
针	1117
前台	1118
裸照	1119
脱掉	1120
瞎	1121
虹桥	1122
完整	1123
本事	1124
惠	1125
有害	1126
欠费	1127
三级	1128
金牛	1129
之类	1130
助理	1131
蘑菇	1132
胸罩	1133
操作	1134
补偿	1135
猛烈	1136
多吧	1137
凡	1138
窗	1139
自助	1140
落	1141
柳	1142
死人	1143
替我	1144
襄樊	1145
主流	1146
玩到	1147
致	1148
龙岗	1149
叔	1150
眼光	1151
成年	1152
西路	1153
利用	1154
事我	1155
人睡	1156
初三	1157
轩	1158
确实	1159
不愿	1160
气象	1161
激动	1162
工厂	1163
赏赐	1164
恒园	1165
坏水	1166
长厦	1167
奖给	1168
籍此	1169
洛城	1170
文田	1171
昆河	1172
路程	1173
通敌	1174
清峰	1175
拉卡	1176
凯龙	1177
模子	1178
新湘	1179
妈湾	1180
文燕	1181
橘子	1182
大枣	1183
怀来	1184
八中	1185
肚兜	1186
珍妮	1187
灭口	1188
降生	1189
滘口	1190
对岸	1191
干家	1192
欠债	1193
晨源	1194
本田	1195
赤岭	1196
租船	1197
舌苔	1198
德克	1199
惠顺	1200
通顺	1201
城关	1202
午宴	1203
拦下	1204
祥伟	1205
炮手	1206
脑里	1207
铭翔	1208
全行	1209
摩卡	1210
搞怪	1211
巴适	1212
海空	1213
友德	1214
广泉	1215
梦乡	1216
手贱	1217
惨叫	1218
畲族	1219
正星	1220
唐装	1221
昌宝	1222
成果	1223
凯丰	1224
驴肉	1225
纺店	1226
短文	1227
睁眼	1228
秋生	1229
开城	1230
梅湖	1231
头围	1232
调暗	1233
多招	1234
醉卧	1235
班纳	1236
瓣膜	1237
百路	1238
蚕豆	1239
完事	1240
海虾	1241
碰擦	1242
这货	1243
军盛	1244
艺恒	1245
总兵	1246
牛丸	1247
销往	1248
这款	1249
柳岩	1250
听错	1251
石荣	1252
追偿	1253
戏院	1254
征购	1255
尊卑	1256
文韬	1257
塑招	1258
动感	1259
喜舍	1260
双十	1261
翠前	1262
红圣	1263
粗略	1264
赌钱	1265
花海	1266
妓女	1267
梳妆	1268
参阅	1269
关岛	1270
烟厂	1271
莱登	1272
鑫发	1273
耽搁	1274
宏禹	1275
博园	1276
默想	1277
城龙	1278
琚湾	1279
装修	1280
卫衣	1281
映日	1282
跃莱	1283
落寞	1284
黄墩	1285
四开	1286
卓资	1287
战前	1288
园龙	1289
宛东	1290
酷似	1291
破音	1292
派往	1293
滑雪	1294
望岳	1295
林生	1296
巴楚	1297
擦洗	1298
大后	1299
驴友	1300
出浴	1301
无孩	1302
西坪	1303
负荷	1304
小潘	1305
型男	1306
苗木	1307
洗钱	1308
搬离	1309
小坤	1310
高干	1311
生烫	1312
汇阳	1313
声言	1314
姘头	1315
刚毅	1316
华沃	1317
友善	1318
出尘	1319
本文	1320
抽税	1321
利阳	1322
承托	1323
蜀秀	1324
瘦猴	1325
水深	1326
晚课	1327
薄厚	1328
后移	1329
狗官	1330
哈巴	1331
查勘	1332
广西	1333
清关	1334
君逸	1335
澳边	1336
童品	1337
迪尔	1338
农坛	1339
撞鬼	1340
成新	1341
茄子	1342
犯人	1343
强留	1344
小泽	1345
桌前	1346
清龙	1347
飞旺	1348
阿云	1349
嘉程	1350
指望	1351
大小	1352
染得	1353
多练	1354
小娟	1355
背后	1356
碗筷	1357
巧云	1358
船木	1359
驾训	1360
心苑	1361
八桥	1362
混用	1363
成诚	1364
相待	1365
迷踪	1366
花树	1367
歌唱	1368
才思	1369
蜡黄	1370
宝润	1371
欣澳	1372
拐弯	1373
泾县	1374
恒仁	1375
狗逼	1376
湘苑	1377
取道	1378
心软	1379
德感	1380
开架	1381
收益	1382
痴痴	1383
角社	1384
内嵌	1385
石梯	1386
香飘	1387
洪运	1388
确有	1389
春心	1390
王记	1391
顺喜	1392
都有	1393
分步	1394
康渠	1395
高斯	1396
国人	1397
存亡	1398
拼凑	1399
口镇	1400
搞清	1401
翔铁	1402
插话	1403
童坊	1404
潮邦	1405
长源	1406
黏腻	1407
模版	1408
拿下	1409
墙壁	1410
重名	1411
黄章	1412
求存	1413
香菇	1414
小关	1415
愤青	1416
草房	1417
锻亚	1418
顺翔	1419
村里	1420
梅云	1421
营利	1422
路斯	1423
成文	1424
后盖	1425
欣阳	1426
却有	1427
智邦	1428
够快	1429
盛记	1430
汪波	1431
鹏辉	1432
矍铄	1433
邦赛	1434
高墩	1435
忠骨	1436
火勺	1437
选择	1438
德龙	1439
新五	1440
洪茂	1441
黄酒	1442
费城	1443
油烟	1444
牛宴	1445
南场	1446
小羊	1447
弘盛	1448
酷跑	1449
润科	1450
沟门	1451
六七	1452
风路	1453
兴鹏	1454
宏马	1455
村季	1456
哭喊	1457
凯斯	1458
墙上	1459
兴中	1460
饿死	1461
大忠	1462
称赞	1463
捏死	1464
水朗	1465
较慢	1466
良民	1467
逆耳	1468
文林	1469
幼虫	1470
歌儿	1471
汉溪	1472
刑案	1473
甲醇	1474
母语	1475
护腕	1476
格瑞	1477
汉森	1478
萌生	1479
小屏	1480
长德	1481
青苑	1482
拆掉	1483
当成	1484
茫然	1485
玛利	1486
荣膺	1487
竹苑	1488
摊位	1489
鲜活	1490
大雷	1491
追认	1492
趁早	1493
溧水	1494
纤细	1495
烧杯	1496
通航	1497
喜事	1498
赣兴	1499
红妮	1500
大湾	1501
汇峰	1502
果业	1503
内需	1504
就到	1505
接案	1506
盆底	1507
全益	1508
机位	1509
西流	1510
古筝	1511
梦思	1512
昆甄	1513
锡港	1514
有理	1515
画堂	1516
杯茶	1517
启康	1518
阿霞	1519
降噪	1520
排掉	1521
那种	1522
菊泉	1523
松驰	1524
屁眼	1525
哨声	1526
油泥	1527
补选	1528
白脸	1529
新光	1530
多亏	1531
楼管	1532
社前	1533
花卷	1534
席间	1535
尚不	1536
炸平	1537
徐东	1538
红字	1539
平村	1540
前述	1541
桑树	1542
微店	1543
赛福	1544
士族	1545
阜成	1546
炸弹	1547
青圹	1548
安汉	1549
龙禹	1550
沙龙	1551
勾起	1552
土右	1553
那坡	1554
墙根	1555
头天	1556
黄则	1557
小乘	1558
鹭岭	1559
刑事	1560
断开	1561
阿凡	1562
器重	1563
速通	1564
洼村	1565
康桥	1566
古文	1567
茭塘	1568
肉蛋	1569
曹溪	1570
章鱼	1571
桥隧	1572
身馆	1573
好歹	1574
整车	1575
盖住	1576
屯子	1577
锅鱼	1578
等于	1579
峪口	1580
多场	1581
韩府	1582
科利	1583
华卫	1584
城品	1585
周鸿	1586
难寻	1587
洪雨	1588
冯庄	1589
贱货	1590
超额	1591
晨东	1592
慎入	1593
烙王	1594
梁祝	1595
神人	1596
水竹	1597
落花	1598
孙膑	1599
绕开	1600
锦湘	1601
阵地	1602
脚法	1603
灯饰	1604
照东	1605
导入	1606
启梦	1607
经幡	1608
赏心	1609
普明	1610
海楼	1611
鼎晟	1612
劲隆	1613
界首	1614
马坑	1615
山居	1616
成品	1617
沦为	1618
华特	1619
自小	1620
国成	1621
背上	1622
新增	1623
馨艺	1624
繁殖	1625
舒淇	1626
白首	1627
弄拉	1628
台兴	1629
避震	1630
吉日	1631
鸿豪	1632
拿渡	1633
香兰	1634
哈妮	1635
白刃	1636
灵药	1637
沉溺	1638
烂烂	1639
星港	1640
港湾	1641
石窟	1642
大万	1643
生缘	1644
小斌	1645
秋林	1646
屠龙	1647
公债	1648
浩天	1649
槎山	1650
思诺	1651
嘉祺	1652
炎热	1653
夫战	1654
前线	1655
戏迷	1656
贞元	1657
辣手	1658
泉润	1659
邓莎	1660
红冠	1661
过界	1662
受戒	1663
蚝油	1664
路发	1665
碱厂	1666
新有	1667
鲁伊	1668
牛粪	1669
华农	1670
纯阳	1671
兴衰	1672
密云	1673
苏合	1674
王府	1675
报以	1676
此话	1677
滑脱	1678
真神	1679
法人	1680
超限	1681
黑手	1682
恒基	1683
限购	1684
坐拥	1685
创天	1686
昔日	1687
狭义	1688
蒙住	1689
兴奋	1690
又有	1691
焦坑	1692
广粤	1693
口述	1694
银子	1695
柴湾	1696
市建	1697
工区	1698
西顺	1699
潭洲	1700
周周	1701
龙套	1702
川渝	1703
轻质	1704
同化	1705
成灌	1706
替你	1707
郭园	1708
短波	1709
灯管	1710
血透	1711
小萌	1712
洋服	1713
春艳	1714
功耗	1715
戴氏	1716
加码	1717
神宫	1718
单条	1719
酿酒	1720
闲看	1721
道真	1722
老孔	1723
呕心	1724
寺塔	1725
湖社	1726
安荣	1727
慢性	1728
还敢	1729
赵丽	1730
改签	1731
车胤	1732
长实	1733
查处	1734
甲虫	1735
泰安	1736
瑜珈	1737
华燕	1738
马达	1739
滂江	1740
受困	1741
杜马	1742
福宇	1743
蜂王	1744
提纯	1745
降妖	1746
刀鞘	1747
购店	1748
行善	1749
坤兴	1750
跑步	1751
百鬼	1752
铜冶	1753
表带	1754
隆德	1755
王水	1756
升平	1757
孵出	1758
赌侠	1759
怀庆	1760
死缓	1761
煮粥	1762
崂路	1763
躁狂	1764
终于	1765
远恒	1766
求佛	1767
飞流	1768
生字	1769
爱护	1770
祸水	1771
出师	1772
厨味	1773
陋习	1774
芳林	1775
管厂	1776
告示	1777
铭鸿	1778
打入	1779
农委	1780
札记	1781
西欧	1782
爱辉	1783
津城	1784
刘玲	1785
查收	1786
鹏双	1787
兰大	1788
清河	1789
煌煌	1790
扣划	1791
标签	1792
豪园	1793
男式	1794
苍蝇	1795
纳闷	1796
鱼类	1797
口交	1798
近路	1799
剿灭	1800
彭上	1801
另寻	1802
党首	1803
裙裾	1804
旱塘	1805
鸿华	1806
辉隆	1807
抱着	1808
幼儿	1809
区西	1810
品味	1811
收房	1812
霍邱	1813
秦峰	1814
楼东	1815
着床	1816
开罗	1817
热性	1818
鹏海	1819
景贤	1820
口语	1821
紫来	1822
步行	1823
若有	1824
召唤	1825
香火	1826
更具	1827
筹集	1828
弘立	1829
客轮	1830
认可	1831
招财	1832
鹅块	1833
鹤峰	1834
格畈	1835
柏杨	1836
势必	1837
驱动	1838
笔译	1839
耳麦	1840
孽障	1841
塞尚	1842
麻山	1843
接触	1844
可视	1845
胜安	1846
粮丰	1847
晋合	1848
疏影	1849
荆翠	1850
舅母	1851
相好	1852
摆脱	1853
麻生	1854
矿市	1855
前款	1856
悲情	1857
男装	1858
土灶	1859
西洪	1860
撞进	1861
聪聪	1862
全周	1863
机号	1864
小舅	1865
啊啊	1866
除领	1867
亲爱的	1868
一句话啊	1869
恰死的黄吧	1870
躲发录	1871
正式	1872
项目进展	1873
几千年前	1874
TR	1875
点之间是	1876
但是必有	1877
他可以减	1878
行行行	1879
拜拜	1880
还惦记着	1881
你这里面	1882
钱就有啊	1883
是影响	1884
什么程度	1885
你小	1886
胚胎	1887
非可的	1888
品牌	1889
滑板	1890
世界	1891
第一	1892
央广记者	1893
新年贺词	1894
第四十	1895
技术研究	1896
获批	1897
首席	1898
执行官	1899
新能源	1900
已经定罪	1901
开着的	1902
英雄联盟	1903
<UNK>	1904
#0	1905
<s>	1906
</s>	1907
<Version>	Honor_Net_1.1_20200725