{
	"type":"DynamicCapsule",
	"subType":"BVL-AN20HP",
	"params":[
		{
			"name":"capsuleduration",
			"type":"list",
			"value":"{\"capsuleduration\":[{\"name\":\"capsule_extreme_tolerance_control\",\"value\":\"true\"},{\"name\":\"capsule_extreme_tolerance_time\",\"value\":\"2400000\"}]}"
		}
	],
	"compatibleversion":"1"
}