-116.438	-119.031
10.719	-119.188
137.875	-119.344
265	-119.562
392.156	-119.812
519.281	-120.125
646.438	-120.438
773.594	-120.812
900.812	-121.219
1028.062	-121.688
1155.344	-122.125
1282.719	-122.594
1410.188	-123.062
1537.719	-123.469
1665.312	-123.812
1793	-124.062
1920.719	-124.25
2048.469	-124.312
2176.219	-124.25
2303.938	-124.094
2431.625	-123.844
2559.219	-123.5
2686.781	-123.094
2814.219	-122.656
2941.594	-122.188
3068.906	-121.719
3196.156	-121.281
3323.375	-120.844
3450.531	-120.469
3577.688	-120.125
3704.812	-119.844
3831.969	-119.594
3959.094	-119.375
4086.25	-119.188
4213.406	-119.031
-116.594	8.219
10.531	8.062
137.656	7.844
264.781	7.625
391.875	7.312
518.969	7
646.062	6.594
773.188	6.156
900.344	5.656
1027.562	5.125
1154.844	4.594
1282.219	4.031
1409.688	3.469
1537.281	2.969
1664.969	2.562
1792.75	2.25
1920.594	2.062
2048.469	1.969
2176.312	2.031
2304.156	2.219
2431.938	2.531
2559.656	2.938
2687.25	3.438
2814.75	3.969
2942.125	4.531
3069.406	5.094
3196.625	5.625
3323.812	6.125
3450.938	6.562
3578.031	6.938
3705.125	7.281
3832.219	7.594
3959.312	7.844
4086.438	8.031
4213.562	8.219
-116.75	135.469
10.344	135.281
137.438	135.062
264.5	134.812
391.531	134.469
518.562	134.094
645.594	133.656
772.688	133.125
899.781	132.562
1026.969	131.938
1154.219	131.281
1281.625	130.625
1409.125	130
1536.781	129.438
1664.562	128.969
1792.469	128.625
1920.438	128.406
2048.438	128.344
2176.469	128.406
2304.438	128.594
2432.344	128.938
2560.125	129.406
2687.812	129.938
2815.344	130.562
2942.719	131.219
3070	131.875
3197.188	132.5
3324.312	133.094
3451.375	133.594
3578.438	134.062
3705.469	134.438
3832.5	134.781
3959.562	135.031
4086.625	135.281
4213.719	135.469
-116.906	262.75
10.156	262.531
137.156	262.312
264.188	262
391.156	261.656
518.125	261.219
645.094	260.719
772.094	260.125
899.125	259.469
1026.281	258.781
1153.531	258.031
1280.938	257.312
1408.5	256.625
1536.25	256.031
1664.156	255.594
1792.188	255.25
1920.281	255.031
2048.438	254.969
2176.594	255.031
2304.688	255.219
2432.75	255.531
2560.656	256
2688.406	256.562
2816	257.25
2943.438	257.969
3070.688	258.719
3197.844	259.406
3324.906	260.062
3451.906	260.656
3578.875	261.188
3705.844	261.625
3832.812	261.969
3959.812	262.281
4086.844	262.531
4213.906	262.719
-117.094	390.031
9.906	389.812
136.906	389.562
263.844	389.25
390.75	388.844
517.625	388.375
644.531	387.844
771.438	387.188
898.406	386.469
1025.5	385.688
1152.75	384.906
1280.219	384.156
1407.875	383.5
1535.75	383
1663.812	382.625
1791.969	382.406
1920.188	382.281
2048.438	382.25
2176.688	382.281
2304.906	382.375
2433.094	382.594
2561.125	382.938
2689.031	383.438
2816.719	384.094
2944.188	384.844
3071.469	385.625
3198.562	386.406
3325.562	387.125
3452.469	387.781
3579.375	388.344
3706.25	388.812
3833.156	389.219
3960.094	389.531
4087.062	389.781
4214.094	390
-117.281	517.312
9.688	517.094
136.594	516.844
263.469	516.5
390.312	516.094
517.125	515.594
643.906	515
770.75	514.344
897.656	513.562
1024.719	512.781
1152	512
1279.531	511.312
1407.375	510.781
1535.406	510.469
1663.625	510.344
1791.906	510.344
1920.156	510.406
2048.438	510.406
2176.688	510.406
2304.969	510.344
2433.25	510.344
2561.469	510.469
2689.531	510.75
2817.375	511.25
2944.969	511.938
3072.25	512.688
3199.344	513.5
3326.281	514.25
3453.094	514.938
3579.906	515.562
3706.688	516.062
3833.531	516.469
3960.406	516.812
4087.312	517.094
4214.281	517.312
-117.469	644.656
9.438	644.438
136.312	644.156
263.094	643.812
389.844	643.406
516.562	642.906
643.25	642.281
770	641.594
896.875	640.844
1023.938	640.062
1151.312	639.375
1279.031	638.875
1407.094	638.625
1535.375	638.656
1663.75	638.906
1792.062	639.219
1920.281	639.5
2048.438	639.594
2176.594	639.5
2304.812	639.25
2433.125	638.906
2561.5	638.656
2689.781	638.625
2817.875	638.844
2945.625	639.312
3073.031	640
3200.125	640.75
3327	641.531
3453.75	642.219
3580.469	642.844
3707.156	643.375
3833.906	643.781
3960.719	644.125
4087.562	644.406
4214.469	644.625
-117.656	772
9.219	771.781
136	771.531
262.719	771.188
389.375	770.781
516	770.281
642.594	769.688
769.281	769
896.125	768.281
1023.25	767.625
1150.812	767.125
1278.812	766.875
1407.188	767
1535.75	767.469
1664.25	768.125
1792.531	768.781
1920.594	769.281
2048.469	769.469
2176.312	769.312
2304.344	768.844
2432.625	768.188
2561.094	767.5
2689.656	767.031
2818.062	766.875
2946.125	767.062
3073.719	767.562
3200.875	768.219
3327.75	768.938
3454.406	769.625
3581.031	770.219
3707.625	770.75
3834.281	771.156
3961	771.5
4087.812	771.75
4214.656	771.969
-117.844	899.344
8.969	899.156
135.719	898.938
262.375	898.625
388.938	898.219
515.469	897.75
642	897.219
768.594	896.594
895.469	895.969
1022.719	895.438
1150.562	895.156
1278.938	895.25
1407.688	895.75
1536.5	896.594
1665.094	897.562
1793.25	898.5
1921	899.125
2048.469	899.375
2175.938	899.188
2303.656	898.562
2431.75	897.656
2560.312	896.688
2689.125	895.812
2817.906	895.281
2946.344	895.156
3074.219	895.406
3201.531	895.906
3328.406	896.531
3455.031	897.156
3581.562	897.719
3708.094	898.188
3834.656	898.594
3961.312	898.906
4088.031	899.156
4214.844	899.344
-118	1026.75
8.781	1026.594
135.469	1026.375
262.062	1026.094
388.531	1025.75
515	1025.344
641.438	1024.875
768.031	1024.344
894.938	1023.844
1022.406	1023.5
1150.562	1023.438
1279.375	1023.812
1408.531	1024.562
1537.562	1025.625
1666.156	1026.75
1794.094	1027.75
1921.469	1028.406
2048.5	1028.688
2175.5	1028.469
2302.844	1027.812
2430.719	1026.844
2559.25	1025.719
2688.281	1024.656
2817.438	1023.844
2946.281	1023.469
3074.5	1023.469
3202.031	1023.812
3329	1024.281
3455.594	1024.812
3582.062	1025.312
3708.5	1025.719
3835	1026.062
3961.562	1026.344
4088.25	1026.562
4215	1026.719
-118.125	1154.156
8.625	1154.031
135.25	1153.875
261.781	1153.656
388.219	1153.375
514.562	1153.031
640.969	1152.656
767.562	1152.25
894.562	1151.906
1022.281	1151.688
1150.781	1151.812
1280	1152.281
1409.5	1153.125
1538.688	1154.188
1667.219	1155.25
1794.938	1156.156
1921.938	1156.75
2048.531	1156.969
2175.094	1156.781
2302.031	1156.219
2429.656	1155.344
2558.125	1154.281
2687.281	1153.219
2816.75	1152.344
2946	1151.844
3074.625	1151.688
3202.375	1151.875
3329.438	1152.219
3456.062	1152.625
3582.469	1153
3708.844	1153.344
3835.281	1153.625
3961.781	1153.844
4088.406	1154.031
4215.156	1154.156
-118.219	1281.594
8.469	1281.5
135.094	1281.375
261.562	1281.25
387.938	1281.031
514.281	1280.812
640.625	1280.531
767.25	1280.281
894.344	1280.062
1022.25	1279.969
1151.094	1280.125
1280.656	1280.594
1410.375	1281.281
1539.688	1282.094
1668.125	1282.906
1795.625	1283.594
1922.312	1284.062
2048.531	1284.219
2174.75	1284.062
2301.375	1283.656
2428.781	1283
2557.125	1282.188
2686.375	1281.344
2816.062	1280.625
2945.688	1280.156
3074.594	1279.969
3202.594	1280.031
3329.781	1280.25
3456.406	1280.531
3582.781	1280.781
3709.094	1281.031
3835.469	1281.219
3961.938	1281.375
4088.531	1281.5
4215.25	1281.594
-118.281	1409.062
8.406	1409
134.969	1408.938
261.438	1408.875
387.781	1408.75
514.062	1408.656
640.438	1408.5
767.031	1408.375
894.219	1408.281
1022.312	1408.25
1151.344	1408.344
1281.125	1408.625
1411	1409
1540.344	1409.469
1668.719	1409.906
1796.062	1410.25
1922.562	1410.5
2048.562	1410.594
2174.531	1410.531
2300.938	1410.281
2428.188	1409.938
2556.469	1409.5
2685.75	1409.062
2815.594	1408.656
2945.406	1408.375
3074.531	1408.25
3202.688	1408.25
3329.969	1408.375
3456.625	1408.5
3582.969	1408.625
3709.281	1408.75
3835.625	1408.844
3962.062	1408.938
4088.625	1409
4215.312	1409.031
-118.312	1536.5
8.375	1536.5
134.938	1536.5
261.406	1536.5
387.719	1536.5
514	1536.5
640.344	1536.5
766.969	1536.5
894.188	1536.5
1022.312	1536.5
1151.438	1536.5
1281.281	1536.5
1411.219	1536.5
1540.562	1536.5
1668.938	1536.5
1796.219	1536.5
1922.625	1536.5
2048.562	1536.5
2174.438	1536.5
2300.781	1536.5
2428	1536.5
2556.25	1536.5
2685.531	1536.5
2815.406	1536.5
2945.281	1536.5
3074.5	1536.5
3202.719	1536.5
3330.031	1536.5
3456.688	1536.5
3583.062	1536.5
3709.344	1536.5
3835.656	1536.5
3962.094	1536.5
4088.656	1536.5
4215.312	1536.5
-118.281	1663.969
8.406	1664
134.969	1664.062
261.438	1664.156
387.781	1664.25
514.094	1664.375
640.438	1664.5
767.031	1664.656
894.219	1664.75
1022.312	1664.781
1151.344	1664.656
1281.125	1664.406
1411	1664
1540.312	1663.531
1668.719	1663.094
1796.062	1662.719
1922.562	1662.469
2048.562	1662.406
2174.531	1662.469
2300.938	1662.688
2428.219	1663.062
2556.5	1663.5
2685.75	1663.969
2815.594	1664.375
2945.406	1664.656
3074.531	1664.781
3202.688	1664.781
3329.969	1664.656
3456.625	1664.531
3582.969	1664.375
3709.281	1664.25
3835.625	1664.156
3962.062	1664.094
4088.625	1664.031
4215.312	1663.969
-118.219	1791.406
8.5	1791.5
135.094	1791.625
261.562	1791.781
387.938	1791.969
514.281	1792.219
640.625	1792.469
767.25	1792.75
894.344	1792.969
1022.25	1793.062
1151.094	1792.906
1280.656	1792.438
1410.375	1791.75
1539.656	1790.906
1668.125	1790.094
1795.594	1789.406
1922.312	1788.938
2048.531	1788.781
2174.75	1788.938
2301.375	1789.344
2428.781	1790.031
2557.156	1790.844
2686.375	1791.688
2816.094	1792.406
2945.688	1792.875
3074.594	1793.062
3202.594	1793
3329.781	1792.781
3456.406	1792.5
3582.781	1792.219
3709.094	1792
3835.469	1791.781
3961.938	1791.625
4088.531	1791.5
4215.25	1791.406
-118.125	1918.844
8.625	1918.969
135.25	1919.156
261.781	1919.375
388.219	1919.656
514.594	1919.969
640.969	1920.375
767.562	1920.781
894.594	1921.125
1022.281	1921.312
1150.781	1921.219
1280	1920.75
1409.469	1919.906
1538.688	1918.844
1667.219	1917.781
1794.906	1916.875
1921.938	1916.281
2048.531	1916.031
2175.094	1916.219
2302.031	1916.812
2429.688	1917.688
2558.125	1918.75
2687.281	1919.812
2816.781	1920.688
2946.031	1921.188
3074.625	1921.344
3202.375	1921.156
3329.438	1920.812
3456.062	1920.406
3582.469	1920
3708.844	1919.688
3835.25	1919.406
3961.781	1919.156
4088.406	1919
4215.125	1918.844
-118	2046.25
8.781	2046.438
135.469	2046.656
262.062	2046.906
388.562	2047.25
515	2047.656
641.438	2048.156
768.031	2048.688
894.969	2049.188
1022.406	2049.531
1150.562	2049.594
1279.344	2049.25
1408.5	2048.469
1537.531	2047.438
1666.125	2046.281
1794.094	2045.312
1921.469	2044.625
2048.5	2044.375
2175.5	2044.562
2302.844	2045.219
2430.75	2046.188
2559.281	2047.312
2688.281	2048.375
2817.438	2049.188
2946.281	2049.562
3074.5	2049.531
3202.031	2049.219
3328.969	2048.719
3455.594	2048.188
3582.062	2047.719
3708.5	2047.281
3834.969	2046.938
3961.562	2046.656
4088.25	2046.438
4215	2046.281
-117.844	2173.656
9	2173.844
135.719	2174.094
262.375	2174.406
388.969	2174.781
515.469	2175.25
642	2175.812
768.625	2176.438
895.469	2177.062
1022.75	2177.562
1150.562	2177.844
1278.906	2177.781
1407.656	2177.281
1536.5	2176.469
1665.094	2175.469
1793.25	2174.562
1921	2173.938
2048.469	2173.688
2175.938	2173.875
2303.656	2174.5
2431.781	2175.375
2560.344	2176.375
2689.156	2177.219
2817.906	2177.75
2946.344	2177.875
3074.188	2177.625
3201.5	2177.094
3328.406	2176.5
3455.031	2175.875
3581.562	2175.312
3708.094	2174.812
3834.656	2174.438
3961.281	2174.125
4088.031	2173.875
4214.844	2173.688
-117.656	2301.031
9.219	2301.219
136	2301.5
262.75	2301.812
389.406	2302.219
516	2302.719
642.625	2303.344
769.281	2304
896.125	2304.719
1023.281	2305.406
1150.812	2305.906
1278.812	2306.156
1407.188	2306.031
1535.719	2305.594
1664.219	2304.938
1792.531	2304.281
1920.562	2303.781
2048.469	2303.594
2176.344	2303.75
2304.344	2304.219
2432.625	2304.875
2561.125	2305.531
2689.688	2306
2818.062	2306.156
2946.094	2305.938
3073.688	2305.438
3200.875	2304.781
3327.719	2304.062
3454.406	2303.375
3581	2302.781
3707.625	2302.281
3834.281	2301.844
3961	2301.531
4087.812	2301.25
4214.656	2301.031
-117.469	2428.375
9.438	2428.594
136.312	2428.844
263.125	2429.188
389.844	2429.594
516.562	2430.125
643.281	2430.719
770.031	2431.406
896.875	2432.188
1023.938	2432.938
1151.312	2433.625
1279.031	2434.156
1407.094	2434.406
1535.375	2434.375
1663.75	2434.156
1792.062	2433.844
1920.281	2433.562
2048.438	2433.438
2176.594	2433.531
2304.812	2433.812
2433.125	2434.125
2561.5	2434.375
2689.781	2434.406
2817.875	2434.188
2945.625	2433.688
3073.031	2433
3200.125	2432.25
3327	2431.5
3453.75	2430.781
3580.438	2430.156
3707.156	2429.656
3833.906	2429.219
3960.688	2428.875
4087.562	2428.594
4214.469	2428.375
-117.281	2555.688
9.688	2555.906
136.594	2556.156
263.469	2556.5
390.312	2556.906
517.125	2557.406
643.906	2558
770.75	2558.688
897.656	2559.438
1024.719	2560.219
1152	2561
1279.562	2561.688
1407.375	2562.219
1535.406	2562.531
1663.625	2562.688
1791.906	2562.688
1920.156	2562.656
2048.438	2562.625
2176.688	2562.625
2304.969	2562.688
2433.25	2562.688
2561.469	2562.562
2689.531	2562.25
2817.375	2561.75
2944.938	2561.094
3072.25	2560.312
3199.312	2559.5
3326.25	2558.75
3453.094	2558.062
3579.875	2557.469
3706.688	2556.938
3833.531	2556.531
3960.406	2556.188
4087.312	2555.938
4214.281	2555.719
-117.094	2683
9.906	2683.188
136.906	2683.438
263.844	2683.781
390.75	2684.156
517.656	2684.625
644.531	2685.188
771.469	2685.812
898.438	2686.531
1025.531	2687.312
1152.781	2688.094
1280.219	2688.844
1407.906	2689.5
1535.781	2690.031
1663.812	2690.406
1791.969	2690.625
1920.188	2690.75
2048.438	2690.781
2176.688	2690.75
2304.906	2690.625
2433.062	2690.406
2561.125	2690.062
2689.031	2689.562
2816.719	2688.906
2944.188	2688.156
3071.438	2687.375
3198.562	2686.594
3325.531	2685.875
3452.469	2685.219
3579.344	2684.656
3706.25	2684.188
3833.156	2683.812
3960.094	2683.469
4087.062	2683.219
4214.094	2683
-116.906	2810.25
10.156	2810.469
137.188	2810.719
264.188	2811
391.156	2811.344
518.125	2811.781
645.094	2812.281
772.094	2812.875
899.156	2813.531
1026.281	2814.219
1153.531	2814.969
1280.938	2815.688
1408.531	2816.375
1536.281	2816.938
1664.188	2817.406
1792.188	2817.75
1920.312	2817.969
2048.438	2818.031
2176.594	2817.969
2304.688	2817.781
2432.719	2817.469
2560.656	2817
2688.406	2816.438
2816	2815.75
2943.406	2815.031
3070.688	2814.281
3197.844	2813.594
3324.875	2812.938
3451.875	2812.344
3578.875	2811.844
3705.844	2811.406
3832.812	2811.031
3959.812	2810.719
4086.844	2810.469
4213.906	2810.281
-116.75	2937.531
10.344	2937.719
137.438	2937.938
264.5	2938.219
391.531	2938.531
518.562	2938.906
645.625	2939.344
772.688	2939.875
899.781	2940.438
1026.969	2941.062
1154.25	2941.719
1281.625	2942.375
1409.156	2943
1536.812	2943.562
1664.594	2944.031
1792.469	2944.375
1920.438	2944.594
2048.438	2944.656
2176.469	2944.594
2304.438	2944.406
2432.312	2944.062
2560.125	2943.594
2687.781	2943.031
2815.312	2942.438
2942.719	2941.781
3070	2941.125
3197.188	2940.5
3324.312	2939.906
3451.375	2939.406
3578.406	2938.938
3705.438	2938.562
3832.5	2938.25
3959.562	2937.969
4086.625	2937.719
4213.719	2937.531
-116.594	3064.781
10.562	3064.938
137.656	3065.156
264.781	3065.406
391.875	3065.688
518.969	3066.031
646.062	3066.406
773.188	3066.844
900.344	3067.344
1027.562	3067.875
1154.844	3068.406
1282.219	3068.969
1409.719	3069.531
1537.281	3070
1664.969	3070.438
1792.75	3070.75
1920.594	3070.938
2048.469	3071
2176.312	3070.938
2304.156	3070.75
2431.938	3070.469
2559.625	3070.062
2687.219	3069.562
2814.719	3069.031
2942.125	3068.469
3069.406	3067.906
3196.625	3067.375
3323.781	3066.875
3450.906	3066.438
3578.031	3066.062
3705.125	3065.719
3832.219	3065.406
3959.312	3065.188
4086.438	3064.969
4213.562	3064.812
-116.438	3192.031
10.719	3192.188
137.875	3192.375
265.031	3192.562
392.156	3192.812
519.312	3193.125
646.438	3193.438
773.625	3193.812
900.812	3194.219
1028.062	3194.656
1155.375	3195.125
1282.719	3195.594
1410.188	3196.031
1537.719	3196.438
1665.312	3196.781
1793	3197.062
1920.719	3197.219
2048.469	3197.281
2176.219	3197.25
2303.938	3197.094
2431.625	3196.812
2559.219	3196.5
2686.75	3196.094
2814.219	3195.625
2941.594	3195.188
3068.906	3194.719
3196.156	3194.281
3323.344	3193.844
3450.531	3193.469
3577.688	3193.156
3704.812	3192.844
3831.969	3192.594
3959.094	3192.375
4086.25	3192.188
4213.406	3192.031