{
  "thresholds":{
    "telephonyDuration": 60,
    "telephonyCount": 1
  },
  "monitorPeriod": {
    "suspectCallingMonitor": 21600,
    "callingforwardSetting": 21600,
    "zenModeSetting": 21600,
    "installUnknownApp": 259200,
    "invokePayment": 21600,
	"paymentByUnknowApp": 259200
  },
  "releaseMonitor": {
    "batteryLevel": 20
  },
  "products": {
    "phone": ["ALL"],
    "version": ["ALL"]
  },
  "antifraudPhone": ["96110"],
  "rangeRiskApp": 3
}