{
  "com.ss.android.ugc.aweme": 0,
  "com.smile.gifmaker": 0,
  "com.ss.android.ugc.aweme.lite": 0,
  "com.kuaishou.nebula": 0,
  "com.youku.phone": 0,
  "com.tencent.qqlive": 4,
  "com.ss.android.article.video": 0,
  "tv.danmaku.bili": 0,
  "com.qiyi.video": 0,
  "com.hunantv.imgo.activity": 0,
  "com.qiyi.video.lite": 0,
  "com.xunlei.downloadprovider": 0,
  "com.baidu.netdisk": 0,
  "com.duowan.kiwi": 0,
  "air.tv.douyu.android": 0,
  "com.tencent.qqgame.xq": 0,
  "com.qqgame.hlddz": 0,
  "com.qqgame.happymj": 0,
  "com.sinyee.babybus.recommendapp": 0,
  "com.duoduo.child.story": 0,
  "com.ximalaya.ting.android": 0,
  "com.tencent.qqmusic": 0,
  "com.netease.cloudmusic": 0,
  "com.tencent.karaoke": 0,
  "com.lingan.seeyou": 0,
  "com.gotokeep.keep": 0,
  "com.ss.android.article.news": 0,
  "com.tencent.news": 0,
  "com.tencent.mtt": 0,
  "com.hihonor.baidu.browser": 0,
  "com.baidu.searchbox": 0,
  "com.UCMobile": 0,
  "cn.wps.moffice_eng": 0,
  "com.hihonor.hnofficelauncher": 0
}