{
  "beat": [
    0,352,576,768,1120,1280,1472,1632,1856,2016,2176,2560,2944,3104,3296,3488,3680,3872,4192,4448,4736,4960,5152,5536,5696,5952,6112,6304,6560,6784,6944,7104,7296,7488,7712,8031,8224,8384,8576,8768,8960,9120,9536,9696,9856,10080,10272,10464,10656,10816,10976,11296,11520,11680,11872,12096,12416,12608,12800,12960,13152,13344,13536,13696,13920,14080,14240,14464,14656,14816,14976,15136,15360,15520,15776,15936,16096,16288,16480,16672,16832,16992,17216,17376,17536,17728,17920,18112,18272,18592,18816,19008,19232,19488,19776,19936,20096,20416,20576,20768,21088,21536,21760,21920,22336,22560,22848,23072,23360,23584,23744,23936,24160,24416,24704,24896,25216,25504,25728,25888,26112,26304,26496,26656,26912,27104,27424,27616,27776,28192,28384,28544,28800,29088,29280,30038
    ],
  "beat_count": 136,
  "downbeat": [
    0,
    1856,
    3296,
    5696,
    8384,
    11520,
    13536,
    15360,
    16672,
    19776,
    22336,
    24160,
    25504,
    28192,
    30038
    ],
  "downbeat_count": 15
}