#,version,,,,,,,,,,,,,,,,,,,,,,,,,,,,,,,,,,,,,,,,,,,,,,,,,,,,,,,,
2023,10,19,1,,,,,,,,,,,,,,,,,,,,,,,,,,,,,,,,,,,,,,,,,,,,,,,,,,,,,,
#,row_col_num,,,,,,,,,,,,,,,,,,,,,,,,,,,,,,,,,,,,,,,,,,,,,,,,,,,,,,,,
40,18,,,,,,,,,,,,,,,,,,,,,,,,,,,,,,,,,,,,,,,,,,,,,,,,,,,,,,,,
#,freq_noise,,,,,,,,,,,,,,,,,,,,,,,,,,,,,,,,,,,,,,,,,,,,,,,,,,,,,,,,
-500,500,,,,,,,,,,,,,,,,,,,,,,,,,,,,,,,,,,,,,,,,,,,,,,,,,,,,,,,,
#,raw_max,,,,,,,,,,,,,,,,,,,,,,,,,,,,,,,,,,,,,,,,,,,,,,,,,,,,,,,,
9985,9985,10119,10120,10182,10130,10087,9961,10122,9964,10098,9989,10053,10055,10040,10057,10059,10059,,,,,,,,,,,,,,,,,,,,,,,,,,,,,,,,,,,,,,,,
10152,10159,10107,9979,10156,10015,10162,10175,10017,9936,9996,10170,10065,10100,10043,10127,10053,9997,,,,,,,,,,,,,,,,,,,,,,,,,,,,,,,,,,,,,,,,
10153,10110,10099,10104,10093,10094,10095,10098,10097,10095,10081,10071,10068,10070,10073,10069,10066,10051,,,,,,,,,,,,,,,,,,,,,,,,,,,,,,,,,,,,,,,,
10174,10127,10119,10122,10113,10114,10114,10116,10108,10108,10100,10093,10091,10091,10096,10089,10084,10074,,,,,,,,,,,,,,,,,,,,,,,,,,,,,,,,,,,,,,,,
10205,10163,10156,10160,10148,10149,10148,10151,10145,10144,10136,10130,10130,10129,10133,10126,10119,10109,,,,,,,,,,,,,,,,,,,,,,,,,,,,,,,,,,,,,,,,
10201,10161,10153,10157,10147,10149,10148,10149,10142,10142,10136,10129,10127,10127,10131,10122,10116,10105,,,,,,,,,,,,,,,,,,,,,,,,,,,,,,,,,,,,,,,,
10239,10203,10195,10200,10188,10188,10191,10193,10184,10185,10177,10173,10172,10170,10170,10164,10157,10149,,,,,,,,,,,,,,,,,,,,,,,,,,,,,,,,,,,,,,,,
10228,10197,10190,10194,10182,10184,10185,10188,10181,10182,10176,10171,10168,10164,10166,10160,10152,10142,,,,,,,,,,,,,,,,,,,,,,,,,,,,,,,,,,,,,,,,
10243,10214,10206,10209,10197,10198,10199,10202,10198,10200,10194,10186,10183,10179,10181,10174,10167,10154,,,,,,,,,,,,,,,,,,,,,,,,,,,,,,,,,,,,,,,,
10266,10237,10230,10234,10221,10222,10226,10227,10222,10223,10216,10210,10207,10203,10206,10197,10188,10177,,,,,,,,,,,,,,,,,,,,,,,,,,,,,,,,,,,,,,,,
10280,10250,10243,10246,10234,10236,10237,10238,10234,10234,10228,10222,10219,10215,10216,10206,10199,10187,,,,,,,,,,,,,,,,,,,,,,,,,,,,,,,,,,,,,,,,
10269,10240,10233,10236,10222,10223,10225,10225,10219,10220,10213,10207,10204,10201,10202,10194,10185,10174,,,,,,,,,,,,,,,,,,,,,,,,,,,,,,,,,,,,,,,,
10294,10265,10256,10260,10245,10246,10248,10247,10241,10242,10238,10230,10230,10226,10225,10217,10208,10197,,,,,,,,,,,,,,,,,,,,,,,,,,,,,,,,,,,,,,,,
10298,10269,10258,10261,10249,10247,10251,10249,10243,10243,10239,10231,10231,10229,10227,10220,10213,10199,,,,,,,,,,,,,,,,,,,,,,,,,,,,,,,,,,,,,,,,
10301,10272,10328,10264,10294,10256,10251,10251,10245,10244,10239,10233,10231,10229,10228,10221,10213,10195,,,,,,,,,,,,,,,,,,,,,,,,,,,,,,,,,,,,,,,,
10310,10279,10266,10268,10255,10254,10255,10255,10249,10248,10243,10238,10235,10232,10233,10225,10218,10201,,,,,,,,,,,,,,,,,,,,,,,,,,,,,,,,,,,,,,,,
10315,10279,10260,10263,10250,10249,10250,10251,10246,10246,10239,10234,10230,10228,10229,10222,10218,10199,,,,,,,,,,,,,,,,,,,,,,,,,,,,,,,,,,,,,,,,
10369,10294,10324,10268,10307,10294,10254,10258,10254,10255,10249,10240,10237,10237,10239,10232,10227,10206,,,,,,,,,,,,,,,,,,,,,,,,,,,,,,,,,,,,,,,,
10405,10316,10299,10280,10278,10265,10264,10266,10263,10266,10260,10254,10252,10250,10250,10244,10240,10220,,,,,,,,,,,,,,,,,,,,,,,,,,,,,,,,,,,,,,,,
10633,10350,10305,10275,10255,10254,10254,10256,10251,10254,10250,10244,10240,10239,10241,10236,10232,10211,,,,,,,,,,,,,,,,,,,,,,,,,,,,,,,,,,,,,,,,
10024,10066,10067,10079,10074,10079,10083,10092,10091,10097,10098,10096,10097,10099,10107,10109,10113,10134,,,,,,,,,,,,,,,,,,,,,,,,,,,,,,,,,,,,,,,,
10069,10109,10114,10125,10119,10124,10128,10137,10136,10144,10143,10143,10144,10145,10150,10152,10154,10170,,,,,,,,,,,,,,,,,,,,,,,,,,,,,,,,,,,,,,,,
10077,10115,10117,10127,10123,10130,10134,10141,10140,10148,10146,10144,10146,10147,10152,10152,10156,10171,,,,,,,,,,,,,,,,,,,,,,,,,,,,,,,,,,,,,,,,
10083,10121,10125,10136,10132,10137,10143,10149,10146,10154,10152,10151,10153,10156,10160,10158,10163,10173,,,,,,,,,,,,,,,,,,,,,,,,,,,,,,,,,,,,,,,,
10096,10134,10134,10144,10140,10145,10151,10157,10156,10163,10162,10160,10162,10164,10169,10168,10172,10185,,,,,,,,,,,,,,,,,,,,,,,,,,,,,,,,,,,,,,,,
10099,10137,10136,10145,10141,10145,10153,10157,10158,10166,10164,10162,10165,10165,10168,10169,10175,10187,,,,,,,,,,,,,,,,,,,,,,,,,,,,,,,,,,,,,,,,
10126,10163,10164,10172,10169,10174,10181,10186,10187,10194,10192,10191,10195,10194,10198,10198,10205,10215,,,,,,,,,,,,,,,,,,,,,,,,,,,,,,,,,,,,,,,,
10121,10161,10160,10169,10165,10171,10175,10183,10180,10187,10186,10188,10191,10191,10194,10196,10202,10210,,,,,,,,,,,,,,,,,,,,,,,,,,,,,,,,,,,,,,,,
10138,10177,10176,10183,10179,10185,10191,10197,10196,10205,10203,10201,10205,10207,10212,10216,10219,10227,,,,,,,,,,,,,,,,,,,,,,,,,,,,,,,,,,,,,,,,
10093,10134,10134,10142,10138,10145,10151,10156,10154,10161,10160,10160,10164,10164,10172,10174,10181,10189,,,,,,,,,,,,,,,,,,,,,,,,,,,,,,,,,,,,,,,,
10119,10159,10156,10162,10160,10166,10172,10178,10180,10185,10184,10184,10185,10187,10193,10197,10206,10214,,,,,,,,,,,,,,,,,,,,,,,,,,,,,,,,,,,,,,,,
10110,10148,10144,10152,10148,10155,10163,10169,10167,10174,10171,10170,10173,10178,10184,10187,10194,10207,,,,,,,,,,,,,,,,,,,,,,,,,,,,,,,,,,,,,,,,
10089,10128,10125,10134,10128,10134,10143,10150,10149,10154,10154,10151,10153,10157,10165,10169,10176,10193,,,,,,,,,,,,,,,,,,,,,,,,,,,,,,,,,,,,,,,,
10122,10159,10155,10163,10159,10164,10172,10179,10177,10182,10181,10179,10182,10187,10193,10198,10207,10225,,,,,,,,,,,,,,,,,,,,,,,,,,,,,,,,,,,,,,,,
10136,10175,10170,10177,10175,10180,10188,10194,10192,10201,10199,10198,10199,10206,10212,10217,10227,10241,,,,,,,,,,,,,,,,,,,,,,,,,,,,,,,,,,,,,,,,
10096,10138,10136,10143,10142,10146,10154,10161,10159,10166,10165,10163,10166,10170,10179,10183,10195,10211,,,,,,,,,,,,,,,,,,,,,,,,,,,,,,,,,,,,,,,,
10080,10122,10118,10127,10126,10133,10140,10146,10145,10151,10151,10149,10152,10154,10165,10170,10181,10201,,,,,,,,,,,,,,,,,,,,,,,,,,,,,,,,,,,,,,,,
10108,10171,10165,10172,10173,10182,10188,10196,10196,10202,10200,10197,10199,10213,10209,10219,10232,10296,,,,,,,,,,,,,,,,,,,,,,,,,,,,,,,,,,,,,,,,
10009,10149,10150,10100,10153,10355,10127,10152,10190,10260,10269,10255,10255,10228,10208,10102,10295,10256,,,,,,,,,,,,,,,,,,,,,,,,,,,,,,,,,,,,,,,,
10100,10100,10109,10232,10139,10081,10126,10061,10145,10175,10115,10198,10244,10207,10168,10258,10162,10162,,,,,,,,,,,,,,,,,,,,,,,,,,,,,,,,,,,,,,,,
#,raw_min,,,,,,,,,,,,,,,,,,,,,,,,,,,,,,,,,,,,,,,,,,,,,,,,,,,,,,,,
6657,6657,6746,6747,6788,6754,6724,6640,6748,6643,6732,6659,6702,6703,6693,6705,6706,6706,,,,,,,,,,,,,,,,,,,,,,,,,,,,,,,,,,,,,,,,
6768,6773,6738,6653,6771,6677,6775,6784,6678,6624,6664,6780,6710,6733,6696,6751,6702,6665,,,,,,,,,,,,,,,,,,,,,,,,,,,,,,,,,,,,,,,,
6769,6740,6733,6736,6729,6729,6730,6732,6731,6730,6721,6714,6712,6713,6716,6713,6711,6701,,,,,,,,,,,,,,,,,,,,,,,,,,,,,,,,,,,,,,,,
6783,6751,6746,6748,6742,6743,6743,6744,6739,6739,6733,6728,6728,6727,6730,6726,6723,6716,,,,,,,,,,,,,,,,,,,,,,,,,,,,,,,,,,,,,,,,
6803,6775,6771,6773,6765,6766,6766,6768,6763,6762,6758,6754,6754,6753,6756,6751,6746,6740,,,,,,,,,,,,,,,,,,,,,,,,,,,,,,,,,,,,,,,,
6800,6774,6769,6771,6764,6766,6765,6766,6761,6761,6757,6752,6751,6751,6754,6748,6744,6737,,,,,,,,,,,,,,,,,,,,,,,,,,,,,,,,,,,,,,,,
6826,6802,6797,6800,6792,6792,6794,6795,6789,6790,6785,6782,6781,6780,6780,6776,6771,6766,,,,,,,,,,,,,,,,,,,,,,,,,,,,,,,,,,,,,,,,
6819,6798,6793,6796,6788,6789,6790,6792,6788,6788,6784,6781,6779,6776,6777,6773,6768,6761,,,,,,,,,,,,,,,,,,,,,,,,,,,,,,,,,,,,,,,,
6829,6810,6804,6806,6798,6799,6799,6801,6799,6800,6796,6791,6788,6786,6787,6782,6778,6770,,,,,,,,,,,,,,,,,,,,,,,,,,,,,,,,,,,,,,,,
6844,6825,6820,6823,6814,6815,6817,6818,6815,6815,6811,6807,6805,6802,6804,6798,6792,6785,,,,,,,,,,,,,,,,,,,,,,,,,,,,,,,,,,,,,,,,
6853,6834,6828,6831,6823,6824,6825,6825,6822,6823,6819,6815,6813,6810,6811,6804,6799,6792,,,,,,,,,,,,,,,,,,,,,,,,,,,,,,,,,,,,,,,,
6846,6827,6822,6824,6815,6816,6816,6816,6813,6813,6809,6805,6803,6801,6801,6796,6790,6782,,,,,,,,,,,,,,,,,,,,,,,,,,,,,,,,,,,,,,,,
6863,6844,6837,6840,6830,6831,6832,6832,6828,6828,6825,6820,6820,6817,6817,6811,6805,6798,,,,,,,,,,,,,,,,,,,,,,,,,,,,,,,,,,,,,,,,
6865,6846,6839,6841,6832,6832,6834,6833,6829,6829,6826,6821,6821,6819,6818,6814,6808,6799,,,,,,,,,,,,,,,,,,,,,,,,,,,,,,,,,,,,,,,,
6867,6848,6885,6843,6863,6837,6834,6834,6830,6830,6826,6822,6820,6819,6819,6814,6808,6797,,,,,,,,,,,,,,,,,,,,,,,,,,,,,,,,,,,,,,,,
6873,6853,6844,6846,6837,6836,6836,6837,6833,6832,6829,6825,6823,6822,6822,6817,6812,6801,,,,,,,,,,,,,,,,,,,,,,,,,,,,,,,,,,,,,,,,
6877,6853,6840,6842,6833,6833,6833,6834,6830,6831,6826,6822,6820,6818,6819,6815,6812,6799,,,,,,,,,,,,,,,,,,,,,,,,,,,,,,,,,,,,,,,,
6913,6863,6883,6846,6871,6863,6836,6839,6836,6837,6833,6827,6825,6825,6826,6821,6818,6804,,,,,,,,,,,,,,,,,,,,,,,,,,,,,,,,,,,,,,,,
6937,6878,6866,6853,6852,6843,6843,6844,6842,6844,6840,6836,6834,6833,6833,6830,6827,6814,,,,,,,,,,,,,,,,,,,,,,,,,,,,,,,,,,,,,,,,
7089,6900,6870,6850,6837,6836,6836,6837,6834,6836,6833,6829,6827,6826,6827,6824,6821,6807,,,,,,,,,,,,,,,,,,,,,,,,,,,,,,,,,,,,,,,,
6683,6711,6712,6720,6716,6719,6722,6728,6727,6731,6732,6731,6731,6733,6738,6739,6742,6756,,,,,,,,,,,,,,,,,,,,,,,,,,,,,,,,,,,,,,,,
6713,6740,6742,6750,6746,6749,6752,6758,6758,6762,6762,6762,6762,6763,6767,6768,6769,6780,,,,,,,,,,,,,,,,,,,,,,,,,,,,,,,,,,,,,,,,
6718,6744,6745,6751,6748,6754,6756,6761,6760,6765,6764,6763,6764,6765,6768,6768,6770,6781,,,,,,,,,,,,,,,,,,,,,,,,,,,,,,,,,,,,,,,,
6722,6748,6750,6757,6754,6758,6762,6766,6764,6769,6768,6767,6769,6770,6773,6772,6776,6782,,,,,,,,,,,,,,,,,,,,,,,,,,,,,,,,,,,,,,,,
6730,6756,6756,6763,6760,6764,6768,6771,6770,6775,6775,6773,6775,6776,6779,6778,6781,6790,,,,,,,,,,,,,,,,,,,,,,,,,,,,,,,,,,,,,,,,
6733,6758,6757,6764,6761,6764,6769,6772,6772,6777,6776,6775,6777,6777,6779,6780,6784,6791,,,,,,,,,,,,,,,,,,,,,,,,,,,,,,,,,,,,,,,,
6751,6776,6776,6781,6779,6783,6787,6791,6791,6796,6795,6794,6797,6796,6799,6798,6803,6810,,,,,,,,,,,,,,,,,,,,,,,,,,,,,,,,,,,,,,,,
6748,6774,6773,6779,6777,6780,6783,6789,6787,6791,6791,6792,6794,6794,6796,6798,6802,6807,,,,,,,,,,,,,,,,,,,,,,,,,,,,,,,,,,,,,,,,
6758,6785,6784,6789,6786,6790,6794,6798,6797,6803,6802,6801,6803,6804,6808,6810,6813,6818,,,,,,,,,,,,,,,,,,,,,,,,,,,,,,,,,,,,,,,,
6729,6756,6756,6761,6759,6764,6767,6771,6769,6774,6773,6773,6776,6776,6781,6782,6787,6793,,,,,,,,,,,,,,,,,,,,,,,,,,,,,,,,,,,,,,,,
6746,6773,6771,6775,6773,6777,6781,6786,6787,6790,6789,6789,6790,6791,6795,6798,6804,6809,,,,,,,,,,,,,,,,,,,,,,,,,,,,,,,,,,,,,,,,
6740,6765,6763,6768,6765,6770,6775,6779,6778,6782,6780,6780,6782,6785,6790,6791,6796,6804,,,,,,,,,,,,,,,,,,,,,,,,,,,,,,,,,,,,,,,,
6726,6752,6750,6756,6752,6756,6762,6767,6766,6769,6769,6767,6768,6771,6777,6779,6784,6795,,,,,,,,,,,,,,,,,,,,,,,,,,,,,,,,,,,,,,,,
6748,6773,6770,6775,6773,6776,6781,6786,6784,6788,6787,6786,6788,6791,6796,6799,6805,6817,,,,,,,,,,,,,,,,,,,,,,,,,,,,,,,,,,,,,,,,
6758,6783,6780,6785,6783,6787,6792,6796,6795,6800,6799,6798,6800,6804,6808,6811,6818,6828,,,,,,,,,,,,,,,,,,,,,,,,,,,,,,,,,,,,,,,,
6731,6759,6757,6762,6762,6764,6769,6774,6773,6777,6776,6775,6777,6780,6786,6789,6797,6808,,,,,,,,,,,,,,,,,,,,,,,,,,,,,,,,,,,,,,,,
6720,6748,6746,6752,6751,6756,6760,6764,6763,6767,6767,6766,6768,6769,6776,6780,6787,6800,,,,,,,,,,,,,,,,,,,,,,,,,,,,,,,,,,,,,,,,
6739,6781,6777,6781,6782,6788,6792,6797,6797,6801,6800,6798,6799,6808,6806,6812,6821,6864,,,,,,,,,,,,,,,,,,,,,,,,,,,,,,,,,,,,,,,,
6673,6766,6767,6733,6769,6903,6751,6768,6794,6840,6846,6837,6837,6818,6806,6734,6863,6837,,,,,,,,,,,,,,,,,,,,,,,,,,,,,,,,,,,,,,,,
6733,6733,6740,6821,6760,6721,6751,6707,6764,6784,6744,6799,6829,6805,6778,6839,6775,6775,,,,,,,,,,,,,,,,,,,,,,,,,,,,,,,,,,,,,,,,
#,raw_row_delta_max,,,,,,,,,,,,,,,,,,,,,,,,,,,,,,,,,,,,,,,,,,,,,,,,,,,,,,,,
1500,800,800,800,800,800,800,800,800,800,800,800,800,800,800,800,800,1500,,,,,,,,,,,,,,,,,,,,,,,,,,,,,,,,,,,,,,,,
600,600,600,600,600,600,600,600,800,800,600,600,600,600,600,600,600,600,,,,,,,,,,,,,,,,,,,,,,,,,,,,,,,,,,,,,,,,
400,400,400,400,400,400,400,400,400,400,400,400,400,400,400,400,400,400,,,,,,,,,,,,,,,,,,,,,,,,,,,,,,,,,,,,,,,,
400,400,400,400,400,400,400,400,400,400,400,400,400,400,400,400,400,400,,,,,,,,,,,,,,,,,,,,,,,,,,,,,,,,,,,,,,,,
400,400,400,400,400,400,400,400,400,400,400,400,400,400,400,400,400,400,,,,,,,,,,,,,,,,,,,,,,,,,,,,,,,,,,,,,,,,
400,400,400,400,400,400,400,400,400,400,400,400,400,400,400,400,400,400,,,,,,,,,,,,,,,,,,,,,,,,,,,,,,,,,,,,,,,,
400,400,400,400,400,400,400,400,400,400,400,400,400,400,400,400,400,400,,,,,,,,,,,,,,,,,,,,,,,,,,,,,,,,,,,,,,,,
400,400,400,400,400,400,400,400,400,400,400,400,400,400,400,400,400,400,,,,,,,,,,,,,,,,,,,,,,,,,,,,,,,,,,,,,,,,
400,400,400,400,400,400,400,400,400,400,400,400,400,400,400,400,400,400,,,,,,,,,,,,,,,,,,,,,,,,,,,,,,,,,,,,,,,,
400,400,400,400,400,400,400,400,400,400,400,400,400,400,400,400,400,400,,,,,,,,,,,,,,,,,,,,,,,,,,,,,,,,,,,,,,,,
400,400,400,400,400,400,400,400,400,400,400,400,400,400,400,400,400,400,,,,,,,,,,,,,,,,,,,,,,,,,,,,,,,,,,,,,,,,
400,400,400,400,400,400,400,400,400,400,400,400,400,400,400,400,400,400,,,,,,,,,,,,,,,,,,,,,,,,,,,,,,,,,,,,,,,,
400,400,400,400,400,400,400,400,400,400,400,400,400,400,400,400,400,400,,,,,,,,,,,,,,,,,,,,,,,,,,,,,,,,,,,,,,,,
400,400,400,400,400,400,400,400,400,400,400,400,400,400,400,400,400,400,,,,,,,,,,,,,,,,,,,,,,,,,,,,,,,,,,,,,,,,
400,400,400,400,400,400,400,400,400,400,400,400,400,400,400,400,400,400,,,,,,,,,,,,,,,,,,,,,,,,,,,,,,,,,,,,,,,,
400,400,400,400,400,400,400,400,400,400,400,400,400,400,400,400,400,400,,,,,,,,,,,,,,,,,,,,,,,,,,,,,,,,,,,,,,,,
400,400,400,400,400,400,400,400,400,400,400,400,400,400,400,400,400,400,,,,,,,,,,,,,,,,,,,,,,,,,,,,,,,,,,,,,,,,
400,400,400,400,400,400,400,400,400,400,400,400,400,400,400,400,400,400,,,,,,,,,,,,,,,,,,,,,,,,,,,,,,,,,,,,,,,,
500,400,400,400,400,400,400,400,400,400,400,400,400,400,400,400,400,400,,,,,,,,,,,,,,,,,,,,,,,,,,,,,,,,,,,,,,,,
1000,600,500,500,500,500,500,500,500,500,500,500,500,500,500,500,500,500,,,,,,,,,,,,,,,,,,,,,,,,,,,,,,,,,,,,,,,,
400,400,400,400,400,400,400,400,400,400,400,400,400,400,400,400,400,400,,,,,,,,,,,,,,,,,,,,,,,,,,,,,,,,,,,,,,,,
400,400,400,400,400,400,400,400,400,400,400,400,400,400,400,400,400,400,,,,,,,,,,,,,,,,,,,,,,,,,,,,,,,,,,,,,,,,
400,400,400,400,400,400,400,400,400,400,400,400,400,400,400,400,400,400,,,,,,,,,,,,,,,,,,,,,,,,,,,,,,,,,,,,,,,,
400,400,400,400,400,400,400,400,400,400,400,400,400,400,400,400,400,400,,,,,,,,,,,,,,,,,,,,,,,,,,,,,,,,,,,,,,,,
400,400,400,400,400,400,400,400,400,400,400,400,400,400,400,400,400,400,,,,,,,,,,,,,,,,,,,,,,,,,,,,,,,,,,,,,,,,
400,400,400,400,400,400,400,400,400,400,400,400,400,400,400,400,400,400,,,,,,,,,,,,,,,,,,,,,,,,,,,,,,,,,,,,,,,,
400,400,400,400,400,400,400,400,400,400,400,400,400,400,400,400,400,400,,,,,,,,,,,,,,,,,,,,,,,,,,,,,,,,,,,,,,,,
400,400,400,400,400,400,400,400,400,400,400,400,400,400,400,400,400,400,,,,,,,,,,,,,,,,,,,,,,,,,,,,,,,,,,,,,,,,
400,400,400,400,400,400,400,400,400,400,400,400,400,400,400,400,400,400,,,,,,,,,,,,,,,,,,,,,,,,,,,,,,,,,,,,,,,,
400,400,400,400,400,400,400,400,400,400,400,400,400,400,400,400,400,400,,,,,,,,,,,,,,,,,,,,,,,,,,,,,,,,,,,,,,,,
400,400,400,400,400,400,400,400,400,400,400,400,400,400,400,400,400,400,,,,,,,,,,,,,,,,,,,,,,,,,,,,,,,,,,,,,,,,
400,400,400,400,400,400,400,400,400,400,400,400,400,400,400,400,400,400,,,,,,,,,,,,,,,,,,,,,,,,,,,,,,,,,,,,,,,,
400,400,400,400,400,400,400,400,400,400,400,400,400,400,400,400,400,400,,,,,,,,,,,,,,,,,,,,,,,,,,,,,,,,,,,,,,,,
400,400,400,400,400,400,400,400,400,400,400,400,400,400,400,400,400,400,,,,,,,,,,,,,,,,,,,,,,,,,,,,,,,,,,,,,,,,
400,400,400,400,400,400,400,400,400,400,400,400,400,400,400,400,400,400,,,,,,,,,,,,,,,,,,,,,,,,,,,,,,,,,,,,,,,,
400,400,400,400,400,400,400,400,400,400,400,400,400,400,400,400,400,400,,,,,,,,,,,,,,,,,,,,,,,,,,,,,,,,,,,,,,,,
400,400,400,400,400,400,400,400,400,400,400,400,400,400,400,400,400,400,,,,,,,,,,,,,,,,,,,,,,,,,,,,,,,,,,,,,,,,
600,600,600,600,600,600,600,600,600,600,600,600,600,600,600,600,600,600,,,,,,,,,,,,,,,,,,,,,,,,,,,,,,,,,,,,,,,,
1500,700,700,700,700,700,700,700,700,700,700,700,700,700,700,700,700,1500,,,,,,,,,,,,,,,,,,,,,,,,,,,,,,,,,,,,,,,,
#,raw_row_delta_min,,,,,,,,,,,,,,,,,,,,,,,,,,,,,,,,,,,,,,,,,,,,,,,,,,,,,,,,
-1500,-800,-800,-800,-800,-800,-800,-800,-800,-800,-800,-800,-800,-800,-800,-800,-800,-1500,,,,,,,,,,,,,,,,,,,,,,,,,,,,,,,,,,,,,,,,
-600,-600,-600,-600,-600,-600,-600,-600,-800,-800,-600,-600,-600,-600,-600,-600,-600,-600,,,,,,,,,,,,,,,,,,,,,,,,,,,,,,,,,,,,,,,,
-400,-400,-400,-400,-400,-400,-400,-400,-400,-400,-400,-400,-400,-400,-400,-400,-400,-400,,,,,,,,,,,,,,,,,,,,,,,,,,,,,,,,,,,,,,,,
-400,-400,-400,-400,-400,-400,-400,-400,-400,-400,-400,-400,-400,-400,-400,-400,-400,-400,,,,,,,,,,,,,,,,,,,,,,,,,,,,,,,,,,,,,,,,
-400,-400,-400,-400,-400,-400,-400,-400,-400,-400,-400,-400,-400,-400,-400,-400,-400,-400,,,,,,,,,,,,,,,,,,,,,,,,,,,,,,,,,,,,,,,,
-400,-400,-400,-400,-400,-400,-400,-400,-400,-400,-400,-400,-400,-400,-400,-400,-400,-400,,,,,,,,,,,,,,,,,,,,,,,,,,,,,,,,,,,,,,,,
-400,-400,-400,-400,-400,-400,-400,-400,-400,-400,-400,-400,-400,-400,-400,-400,-400,-400,,,,,,,,,,,,,,,,,,,,,,,,,,,,,,,,,,,,,,,,
-400,-400,-400,-400,-400,-400,-400,-400,-400,-400,-400,-400,-400,-400,-400,-400,-400,-400,,,,,,,,,,,,,,,,,,,,,,,,,,,,,,,,,,,,,,,,
-400,-400,-400,-400,-400,-400,-400,-400,-400,-400,-400,-400,-400,-400,-400,-400,-400,-400,,,,,,,,,,,,,,,,,,,,,,,,,,,,,,,,,,,,,,,,
-400,-400,-400,-400,-400,-400,-400,-400,-400,-400,-400,-400,-400,-400,-400,-400,-400,-400,,,,,,,,,,,,,,,,,,,,,,,,,,,,,,,,,,,,,,,,
-400,-400,-400,-400,-400,-400,-400,-400,-400,-400,-400,-400,-400,-400,-400,-400,-400,-400,,,,,,,,,,,,,,,,,,,,,,,,,,,,,,,,,,,,,,,,
-400,-400,-400,-400,-400,-400,-400,-400,-400,-400,-400,-400,-400,-400,-400,-400,-400,-400,,,,,,,,,,,,,,,,,,,,,,,,,,,,,,,,,,,,,,,,
-400,-400,-400,-400,-400,-400,-400,-400,-400,-400,-400,-400,-400,-400,-400,-400,-400,-400,,,,,,,,,,,,,,,,,,,,,,,,,,,,,,,,,,,,,,,,
-400,-400,-400,-400,-400,-400,-400,-400,-400,-400,-400,-400,-400,-400,-400,-400,-400,-400,,,,,,,,,,,,,,,,,,,,,,,,,,,,,,,,,,,,,,,,
-400,-400,-400,-400,-400,-400,-400,-400,-400,-400,-400,-400,-400,-400,-400,-400,-400,-400,,,,,,,,,,,,,,,,,,,,,,,,,,,,,,,,,,,,,,,,
-400,-400,-400,-400,-400,-400,-400,-400,-400,-400,-400,-400,-400,-400,-400,-400,-400,-400,,,,,,,,,,,,,,,,,,,,,,,,,,,,,,,,,,,,,,,,
-400,-400,-400,-400,-400,-400,-400,-400,-400,-400,-400,-400,-400,-400,-400,-400,-400,-400,,,,,,,,,,,,,,,,,,,,,,,,,,,,,,,,,,,,,,,,
-400,-400,-400,-400,-400,-400,-400,-400,-400,-400,-400,-400,-400,-400,-400,-400,-400,-400,,,,,,,,,,,,,,,,,,,,,,,,,,,,,,,,,,,,,,,,
-500,-400,-400,-400,-400,-400,-400,-400,-400,-400,-400,-400,-400,-400,-400,-400,-400,-400,,,,,,,,,,,,,,,,,,,,,,,,,,,,,,,,,,,,,,,,
-1000,-600,-500,-500,-500,-500,-500,-500,-500,-500,-500,-500,-500,-500,-500,-500,-500,-500,,,,,,,,,,,,,,,,,,,,,,,,,,,,,,,,,,,,,,,,
-400,-400,-400,-400,-400,-400,-400,-400,-400,-400,-400,-400,-400,-400,-400,-400,-400,-400,,,,,,,,,,,,,,,,,,,,,,,,,,,,,,,,,,,,,,,,
-400,-400,-400,-400,-400,-400,-400,-400,-400,-400,-400,-400,-400,-400,-400,-400,-400,-400,,,,,,,,,,,,,,,,,,,,,,,,,,,,,,,,,,,,,,,,
-400,-400,-400,-400,-400,-400,-400,-400,-400,-400,-400,-400,-400,-400,-400,-400,-400,-400,,,,,,,,,,,,,,,,,,,,,,,,,,,,,,,,,,,,,,,,
-400,-400,-400,-400,-400,-400,-400,-400,-400,-400,-400,-400,-400,-400,-400,-400,-400,-400,,,,,,,,,,,,,,,,,,,,,,,,,,,,,,,,,,,,,,,,
-400,-400,-400,-400,-400,-400,-400,-400,-400,-400,-400,-400,-400,-400,-400,-400,-400,-400,,,,,,,,,,,,,,,,,,,,,,,,,,,,,,,,,,,,,,,,
-400,-400,-400,-400,-400,-400,-400,-400,-400,-400,-400,-400,-400,-400,-400,-400,-400,-400,,,,,,,,,,,,,,,,,,,,,,,,,,,,,,,,,,,,,,,,
-400,-400,-400,-400,-400,-400,-400,-400,-400,-400,-400,-400,-400,-400,-400,-400,-400,-400,,,,,,,,,,,,,,,,,,,,,,,,,,,,,,,,,,,,,,,,
-400,-400,-400,-400,-400,-400,-400,-400,-400,-400,-400,-400,-400,-400,-400,-400,-400,-400,,,,,,,,,,,,,,,,,,,,,,,,,,,,,,,,,,,,,,,,
-400,-400,-400,-400,-400,-400,-400,-400,-400,-400,-400,-400,-400,-400,-400,-400,-400,-400,,,,,,,,,,,,,,,,,,,,,,,,,,,,,,,,,,,,,,,,
-400,-400,-400,-400,-400,-400,-400,-400,-400,-400,-400,-400,-400,-400,-400,-400,-400,-400,,,,,,,,,,,,,,,,,,,,,,,,,,,,,,,,,,,,,,,,
-400,-400,-400,-400,-400,-400,-400,-400,-400,-400,-400,-400,-400,-400,-400,-400,-400,-400,,,,,,,,,,,,,,,,,,,,,,,,,,,,,,,,,,,,,,,,
-400,-400,-400,-400,-400,-400,-400,-400,-400,-400,-400,-400,-400,-400,-400,-400,-400,-400,,,,,,,,,,,,,,,,,,,,,,,,,,,,,,,,,,,,,,,,
-400,-400,-400,-400,-400,-400,-400,-400,-400,-400,-400,-400,-400,-400,-400,-400,-400,-400,,,,,,,,,,,,,,,,,,,,,,,,,,,,,,,,,,,,,,,,
-400,-400,-400,-400,-400,-400,-400,-400,-400,-400,-400,-400,-400,-400,-400,-400,-400,-400,,,,,,,,,,,,,,,,,,,,,,,,,,,,,,,,,,,,,,,,
-400,-400,-400,-400,-400,-400,-400,-400,-400,-400,-400,-400,-400,-400,-400,-400,-400,-400,,,,,,,,,,,,,,,,,,,,,,,,,,,,,,,,,,,,,,,,
-400,-400,-400,-400,-400,-400,-400,-400,-400,-400,-400,-400,-400,-400,-400,-400,-400,-400,,,,,,,,,,,,,,,,,,,,,,,,,,,,,,,,,,,,,,,,
-400,-400,-400,-400,-400,-400,-400,-400,-400,-400,-400,-400,-400,-400,-400,-400,-400,-400,,,,,,,,,,,,,,,,,,,,,,,,,,,,,,,,,,,,,,,,
-600,-600,-600,-600,-600,-600,-600,-600,-600,-600,-600,-600,-600,-600,-600,-600,-600,-600,,,,,,,,,,,,,,,,,,,,,,,,,,,,,,,,,,,,,,,,
-1500,-700,-700,-700,-700,-700,-700,-700,-700,-700,-700,-700,-700,-700,-700,-700,-700,-1500,,,,,,,,,,,,,,,,,,,,,,,,,,,,,,,,,,,,,,,,
#,raw_col_delta_max,,,,,,,,,,,,,,,,,,,,,,,,,,,,,,,,,,,,,,,,,,,,,,,,,,,,,,,,
1500,500,500,500,500,500,500,800,800,800,500,500,500,500,500,500,1500,,,,,,,,,,,,,,,,,,,,,,,,,,,,,,,,,,,,,,,,,
500,500,500,500,500,500,500,800,800,800,500,500,500,500,500,500,500,,,,,,,,,,,,,,,,,,,,,,,,,,,,,,,,,,,,,,,,,
350,350,350,350,350,350,350,350,350,350,350,350,350,350,350,350,350,,,,,,,,,,,,,,,,,,,,,,,,,,,,,,,,,,,,,,,,,
350,350,350,350,350,350,350,350,350,350,350,350,350,350,350,350,350,,,,,,,,,,,,,,,,,,,,,,,,,,,,,,,,,,,,,,,,,
350,350,350,350,350,350,350,350,350,350,350,350,350,350,350,350,350,,,,,,,,,,,,,,,,,,,,,,,,,,,,,,,,,,,,,,,,,
350,350,350,350,350,350,350,350,350,350,350,350,350,350,350,350,350,,,,,,,,,,,,,,,,,,,,,,,,,,,,,,,,,,,,,,,,,
350,350,350,350,350,350,350,350,350,350,350,350,350,350,350,350,350,,,,,,,,,,,,,,,,,,,,,,,,,,,,,,,,,,,,,,,,,
350,350,350,350,350,350,350,350,350,350,350,350,350,350,350,350,350,,,,,,,,,,,,,,,,,,,,,,,,,,,,,,,,,,,,,,,,,
350,350,350,350,350,350,350,350,350,350,350,350,350,350,350,350,350,,,,,,,,,,,,,,,,,,,,,,,,,,,,,,,,,,,,,,,,,
350,350,350,350,350,350,350,350,350,350,350,350,350,350,350,350,350,,,,,,,,,,,,,,,,,,,,,,,,,,,,,,,,,,,,,,,,,
350,350,350,350,350,350,350,350,350,350,350,350,350,350,350,350,350,,,,,,,,,,,,,,,,,,,,,,,,,,,,,,,,,,,,,,,,,
350,350,350,350,350,350,350,350,350,350,350,350,350,350,350,350,350,,,,,,,,,,,,,,,,,,,,,,,,,,,,,,,,,,,,,,,,,
350,350,350,350,350,350,350,350,350,350,350,350,350,350,350,350,350,,,,,,,,,,,,,,,,,,,,,,,,,,,,,,,,,,,,,,,,,
350,350,350,350,350,350,350,350,350,350,350,350,350,350,350,350,350,,,,,,,,,,,,,,,,,,,,,,,,,,,,,,,,,,,,,,,,,
350,350,350,350,350,350,350,350,350,350,350,350,350,350,350,350,350,,,,,,,,,,,,,,,,,,,,,,,,,,,,,,,,,,,,,,,,,
350,350,350,350,350,350,350,350,350,350,350,350,350,350,350,350,350,,,,,,,,,,,,,,,,,,,,,,,,,,,,,,,,,,,,,,,,,
350,350,350,350,350,350,350,350,350,350,350,350,350,350,350,350,350,,,,,,,,,,,,,,,,,,,,,,,,,,,,,,,,,,,,,,,,,
350,350,350,350,350,350,350,350,350,350,350,350,350,350,350,350,350,,,,,,,,,,,,,,,,,,,,,,,,,,,,,,,,,,,,,,,,,
350,350,350,350,350,350,350,350,350,350,350,350,350,350,350,350,350,,,,,,,,,,,,,,,,,,,,,,,,,,,,,,,,,,,,,,,,,
500,350,350,350,350,350,350,350,350,350,350,350,350,350,350,350,350,,,,,,,,,,,,,,,,,,,,,,,,,,,,,,,,,,,,,,,,,
350,350,350,350,350,350,350,350,350,350,350,350,350,350,350,350,350,,,,,,,,,,,,,,,,,,,,,,,,,,,,,,,,,,,,,,,,,
350,350,350,350,350,350,350,350,350,350,350,350,350,350,350,350,350,,,,,,,,,,,,,,,,,,,,,,,,,,,,,,,,,,,,,,,,,
350,350,350,350,350,350,350,350,350,350,350,350,350,350,350,350,350,,,,,,,,,,,,,,,,,,,,,,,,,,,,,,,,,,,,,,,,,
350,350,350,350,350,350,350,350,350,350,350,350,350,350,350,350,350,,,,,,,,,,,,,,,,,,,,,,,,,,,,,,,,,,,,,,,,,
350,350,350,350,350,350,350,350,350,350,350,350,350,350,350,350,350,,,,,,,,,,,,,,,,,,,,,,,,,,,,,,,,,,,,,,,,,
350,350,350,350,350,350,350,350,350,350,350,350,350,350,350,350,350,,,,,,,,,,,,,,,,,,,,,,,,,,,,,,,,,,,,,,,,,
350,350,350,350,350,350,350,350,350,350,350,350,350,350,350,350,350,,,,,,,,,,,,,,,,,,,,,,,,,,,,,,,,,,,,,,,,,
350,350,350,350,350,350,350,350,350,350,350,350,350,350,350,350,350,,,,,,,,,,,,,,,,,,,,,,,,,,,,,,,,,,,,,,,,,
350,350,350,350,350,350,350,350,350,350,350,350,350,350,350,350,350,,,,,,,,,,,,,,,,,,,,,,,,,,,,,,,,,,,,,,,,,
350,350,350,350,350,350,350,350,350,350,350,350,350,350,350,350,350,,,,,,,,,,,,,,,,,,,,,,,,,,,,,,,,,,,,,,,,,
350,350,350,350,350,350,350,350,350,350,350,350,350,350,350,350,350,,,,,,,,,,,,,,,,,,,,,,,,,,,,,,,,,,,,,,,,,
350,350,350,350,350,350,350,350,350,350,350,350,350,350,350,350,350,,,,,,,,,,,,,,,,,,,,,,,,,,,,,,,,,,,,,,,,,
350,350,350,350,350,350,350,350,350,350,350,350,350,350,350,350,350,,,,,,,,,,,,,,,,,,,,,,,,,,,,,,,,,,,,,,,,,
350,350,350,350,350,350,350,350,350,350,350,350,350,350,350,350,350,,,,,,,,,,,,,,,,,,,,,,,,,,,,,,,,,,,,,,,,,
350,350,350,350,350,350,350,350,350,350,350,350,350,350,350,350,350,,,,,,,,,,,,,,,,,,,,,,,,,,,,,,,,,,,,,,,,,
350,350,350,350,350,350,350,350,350,350,350,350,350,350,350,350,350,,,,,,,,,,,,,,,,,,,,,,,,,,,,,,,,,,,,,,,,,
350,350,350,350,350,350,350,350,350,350,350,350,350,350,350,350,350,,,,,,,,,,,,,,,,,,,,,,,,,,,,,,,,,,,,,,,,,
350,350,350,350,350,350,350,350,350,350,350,350,350,350,350,350,350,,,,,,,,,,,,,,,,,,,,,,,,,,,,,,,,,,,,,,,,,
500,500,500,500,500,500,500,500,500,500,500,500,500,500,500,500,500,,,,,,,,,,,,,,,,,,,,,,,,,,,,,,,,,,,,,,,,,
1500,500,500,500,500,500,500,500,500,500,500,500,500,500,500,500,1500,,,,,,,,,,,,,,,,,,,,,,,,,,,,,,,,,,,,,,,,,
#,raw_col_delta_min,,,,,,,,,,,,,,,,,,,,,,,,,,,,,,,,,,,,,,,,,,,,,,,,,,,,,,,,
-1500,-500,-500,-500,-500,-500,-500,-800,-800,-800,-500,-500,-500,-500,-500,-500,-1500,,,,,,,,,,,,,,,,,,,,,,,,,,,,,,,,,,,,,,,,,
-500,-500,-500,-500,-500,-500,-500,-800,-800,-800,-500,-500,-500,-500,-500,-500,-500,,,,,,,,,,,,,,,,,,,,,,,,,,,,,,,,,,,,,,,,,
-350,-350,-350,-350,-350,-350,-350,-350,-350,-350,-350,-350,-350,-350,-350,-350,-350,,,,,,,,,,,,,,,,,,,,,,,,,,,,,,,,,,,,,,,,,
-350,-350,-350,-350,-350,-350,-350,-350,-350,-350,-350,-350,-350,-350,-350,-350,-350,,,,,,,,,,,,,,,,,,,,,,,,,,,,,,,,,,,,,,,,,
-350,-350,-350,-350,-350,-350,-350,-350,-350,-350,-350,-350,-350,-350,-350,-350,-350,,,,,,,,,,,,,,,,,,,,,,,,,,,,,,,,,,,,,,,,,
-350,-350,-350,-350,-350,-350,-350,-350,-350,-350,-350,-350,-350,-350,-350,-350,-350,,,,,,,,,,,,,,,,,,,,,,,,,,,,,,,,,,,,,,,,,
-350,-350,-350,-350,-350,-350,-350,-350,-350,-350,-350,-350,-350,-350,-350,-350,-350,,,,,,,,,,,,,,,,,,,,,,,,,,,,,,,,,,,,,,,,,
-350,-350,-350,-350,-350,-350,-350,-350,-350,-350,-350,-350,-350,-350,-350,-350,-350,,,,,,,,,,,,,,,,,,,,,,,,,,,,,,,,,,,,,,,,,
-350,-350,-350,-350,-350,-350,-350,-350,-350,-350,-350,-350,-350,-350,-350,-350,-350,,,,,,,,,,,,,,,,,,,,,,,,,,,,,,,,,,,,,,,,,
-350,-350,-350,-350,-350,-350,-350,-350,-350,-350,-350,-350,-350,-350,-350,-350,-350,,,,,,,,,,,,,,,,,,,,,,,,,,,,,,,,,,,,,,,,,
-350,-350,-350,-350,-350,-350,-350,-350,-350,-350,-350,-350,-350,-350,-350,-350,-350,,,,,,,,,,,,,,,,,,,,,,,,,,,,,,,,,,,,,,,,,
-350,-350,-350,-350,-350,-350,-350,-350,-350,-350,-350,-350,-350,-350,-350,-350,-350,,,,,,,,,,,,,,,,,,,,,,,,,,,,,,,,,,,,,,,,,
-350,-350,-350,-350,-350,-350,-350,-350,-350,-350,-350,-350,-350,-350,-350,-350,-350,,,,,,,,,,,,,,,,,,,,,,,,,,,,,,,,,,,,,,,,,
-350,-350,-350,-350,-350,-350,-350,-350,-350,-350,-350,-350,-350,-350,-350,-350,-350,,,,,,,,,,,,,,,,,,,,,,,,,,,,,,,,,,,,,,,,,
-350,-350,-350,-350,-350,-350,-350,-350,-350,-350,-350,-350,-350,-350,-350,-350,-350,,,,,,,,,,,,,,,,,,,,,,,,,,,,,,,,,,,,,,,,,
-350,-350,-350,-350,-350,-350,-350,-350,-350,-350,-350,-350,-350,-350,-350,-350,-350,,,,,,,,,,,,,,,,,,,,,,,,,,,,,,,,,,,,,,,,,
-350,-350,-350,-350,-350,-350,-350,-350,-350,-350,-350,-350,-350,-350,-350,-350,-350,,,,,,,,,,,,,,,,,,,,,,,,,,,,,,,,,,,,,,,,,
-350,-350,-350,-350,-350,-350,-350,-350,-350,-350,-350,-350,-350,-350,-350,-350,-350,,,,,,,,,,,,,,,,,,,,,,,,,,,,,,,,,,,,,,,,,
-350,-350,-350,-350,-350,-350,-350,-350,-350,-350,-350,-350,-350,-350,-350,-350,-350,,,,,,,,,,,,,,,,,,,,,,,,,,,,,,,,,,,,,,,,,
-500,-350,-350,-350,-350,-350,-350,-350,-350,-350,-350,-350,-350,-350,-350,-350,-350,,,,,,,,,,,,,,,,,,,,,,,,,,,,,,,,,,,,,,,,,
-350,-350,-350,-350,-350,-350,-350,-350,-350,-350,-350,-350,-350,-350,-350,-350,-350,,,,,,,,,,,,,,,,,,,,,,,,,,,,,,,,,,,,,,,,,
-350,-350,-350,-350,-350,-350,-350,-350,-350,-350,-350,-350,-350,-350,-350,-350,-350,,,,,,,,,,,,,,,,,,,,,,,,,,,,,,,,,,,,,,,,,
-350,-350,-350,-350,-350,-350,-350,-350,-350,-350,-350,-350,-350,-350,-350,-350,-350,,,,,,,,,,,,,,,,,,,,,,,,,,,,,,,,,,,,,,,,,
-350,-350,-350,-350,-350,-350,-350,-350,-350,-350,-350,-350,-350,-350,-350,-350,-350,,,,,,,,,,,,,,,,,,,,,,,,,,,,,,,,,,,,,,,,,
-350,-350,-350,-350,-350,-350,-350,-350,-350,-350,-350,-350,-350,-350,-350,-350,-350,,,,,,,,,,,,,,,,,,,,,,,,,,,,,,,,,,,,,,,,,
-350,-350,-350,-350,-350,-350,-350,-350,-350,-350,-350,-350,-350,-350,-350,-350,-350,,,,,,,,,,,,,,,,,,,,,,,,,,,,,,,,,,,,,,,,,
-350,-350,-350,-350,-350,-350,-350,-350,-350,-350,-350,-350,-350,-350,-350,-350,-350,,,,,,,,,,,,,,,,,,,,,,,,,,,,,,,,,,,,,,,,,
-350,-350,-350,-350,-350,-350,-350,-350,-350,-350,-350,-350,-350,-350,-350,-350,-350,,,,,,,,,,,,,,,,,,,,,,,,,,,,,,,,,,,,,,,,,
-350,-350,-350,-350,-350,-350,-350,-350,-350,-350,-350,-350,-350,-350,-350,-350,-350,,,,,,,,,,,,,,,,,,,,,,,,,,,,,,,,,,,,,,,,,
-350,-350,-350,-350,-350,-350,-350,-350,-350,-350,-350,-350,-350,-350,-350,-350,-350,,,,,,,,,,,,,,,,,,,,,,,,,,,,,,,,,,,,,,,,,
-350,-350,-350,-350,-350,-350,-350,-350,-350,-350,-350,-350,-350,-350,-350,-350,-350,,,,,,,,,,,,,,,,,,,,,,,,,,,,,,,,,,,,,,,,,
-350,-350,-350,-350,-350,-350,-350,-350,-350,-350,-350,-350,-350,-350,-350,-350,-350,,,,,,,,,,,,,,,,,,,,,,,,,,,,,,,,,,,,,,,,,
-350,-350,-350,-350,-350,-350,-350,-350,-350,-350,-350,-350,-350,-350,-350,-350,-350,,,,,,,,,,,,,,,,,,,,,,,,,,,,,,,,,,,,,,,,,
-350,-350,-350,-350,-350,-350,-350,-350,-350,-350,-350,-350,-350,-350,-350,-350,-350,,,,,,,,,,,,,,,,,,,,,,,,,,,,,,,,,,,,,,,,,
-350,-350,-350,-350,-350,-350,-350,-350,-350,-350,-350,-350,-350,-350,-350,-350,-350,,,,,,,,,,,,,,,,,,,,,,,,,,,,,,,,,,,,,,,,,
-350,-350,-350,-350,-350,-350,-350,-350,-350,-350,-350,-350,-350,-350,-350,-350,-350,,,,,,,,,,,,,,,,,,,,,,,,,,,,,,,,,,,,,,,,,
-350,-350,-350,-350,-350,-350,-350,-350,-350,-350,-350,-350,-350,-350,-350,-350,-350,,,,,,,,,,,,,,,,,,,,,,,,,,,,,,,,,,,,,,,,,
-350,-350,-350,-350,-350,-350,-350,-350,-350,-350,-350,-350,-350,-350,-350,-350,-350,,,,,,,,,,,,,,,,,,,,,,,,,,,,,,,,,,,,,,,,,
-500,-500,-500,-500,-500,-500,-500,-500,-500,-500,-500,-500,-500,-500,-500,-500,-500,,,,,,,,,,,,,,,,,,,,,,,,,,,,,,,,,,,,,,,,,
-1500,-500,-500,-500,-500,-500,-500,-500,-500,-500,-500,-500,-500,-500,-500,-500,-1500,,,,,,,,,,,,,,,,,,,,,,,,,,,,,,,,,,,,,,,,,
#,line_max,,,,,,,,,,,,,,,,,,,,,,,,,,,,,,,,,,,,,,,,,,,,,,,,,,,,,,,,
47411,47299,47901,47290,47614,47993,47638,47627,47715,47472,47329,47567,46872,46829,47639,47660,47463,46953,46647,47436,47374,47542,46252,48318,48212,47081,46994,46459,46340,47677,47753,47574,47446,48219,47451,46981,47004,46449,47505,48184,48067,47599,46497,46711,46476,46536,46510,46571,48204,48595,48370,48605,48088,47919,47860,48061,47057,46701
#,line_min,,,,,,,,,,,,,,,,,,,,,,,,,,,,,,,,,,,,,,,,,,,,,,,,,,,,,,,,
17984,17941,18169,17938,18061,18204,18070,18065,18099,18007,17952,18043,17779,17763,18070,18078,18003,17810,17694,17993,17970,18033,17544,18327,18287,17858,17825,17622,17577,18084,18113,18045,17997,18290,17999,17820,17829,17619,18019,18277,18232,18055,17637,17718,17629,17652,17642,17665,18284,18433,18347,18436,18240,18176,18154,18230,17849,17714
