#,version,,,,,,,,,,,,,,
2021,9,14,1,,,,,,,,,,,,
#,row_col_num,,,,,,,,,,,,,,
36,16,,,,,,,,,,,,,,
#,noise,,,,,,,,,,,,,,
-350,350,,,,,,,,,,,,,,
#,raw_max,,,,,,,,,,,,,,
12100,12100,12100,12100,12100,12100,12100,12100,12100,12100,12100,12100,12100,12100,12100,12100
12100,12100,12100,12100,12100,12100,12100,12100,12100,12100,12100,12100,12100,12100,12100,12100
12100,12100,12100,12100,12100,12100,12100,12100,12100,12100,12100,12100,12100,12100,12100,12100
12100,12100,12100,12100,12100,12100,12100,12100,12100,12100,12100,12100,12100,12100,12100,12100
12100,12100,12100,12100,12100,12100,12100,12100,12100,12100,12100,12100,12100,12100,12100,12100
12100,12100,12100,12100,12100,12100,12100,12100,12100,12100,12100,12100,12100,12100,12100,12100
12100,12100,12100,12100,12100,12100,12100,12100,12100,12100,12100,12100,12100,12100,12100,12100
12100,12100,12100,12100,12100,12100,12100,12100,12100,12100,12100,12100,12100,12100,12100,12100
12100,12100,12100,12100,12100,12100,12100,12100,12100,12100,12100,12100,12100,12100,12100,12100
12100,12100,12100,12100,12100,12100,12100,12100,12100,12100,12100,12100,12100,12100,12100,12100
12100,12100,12100,12100,12100,12100,12100,12100,12100,12100,12100,12100,12100,12100,12100,12100
12100,12100,12100,12100,12100,12100,12100,12100,12100,12100,12100,12100,12100,12100,12100,12100
12100,12100,12100,12100,12100,12100,12100,12100,12100,12100,12100,12100,12100,12100,12100,12100
12100,12100,12100,12100,12100,12100,12100,12100,12100,12100,12100,12100,12100,12100,12100,12100
12100,12100,12100,12100,12100,12100,12100,12100,12100,12100,12100,12100,12100,12100,12100,12100
12100,12100,12100,12100,12100,12100,12100,12100,12100,12100,12100,12100,12100,12100,12100,12100
12100,12100,12100,12100,12100,12100,12100,12100,12100,12100,12100,12100,12100,12100,12100,12100
12100,12100,12100,12100,12100,12100,12100,12100,12100,12100,12100,12100,12100,12100,12100,12100
12100,12100,12100,12100,12100,12100,12100,12100,12100,12100,12100,12100,12100,12100,12100,12100
12100,12100,12100,12100,12100,12100,12100,12100,12100,12100,12100,12100,12100,12100,12100,12100
12100,12100,12100,12100,12100,12100,12100,12100,12100,12100,12100,12100,12100,12100,12100,12100
12100,12100,12100,12100,12100,12100,12100,12100,12100,12100,12100,12100,12100,12100,12100,12100
12100,12100,12100,12100,12100,12100,12100,12100,12100,12100,12100,12100,12100,12100,12100,12100
12100,12100,12100,12100,12100,12100,12100,12100,12100,12100,12100,12100,12100,12100,12100,12100
12100,12100,12100,12100,12100,12100,12100,12100,12100,12100,12100,12100,12100,12100,12100,12100
12100,12100,12100,12100,12100,12100,12100,12100,12100,12100,12100,12100,12100,12100,12100,12100
12100,12100,12100,12100,12100,12100,12100,12100,12100,12100,12100,12100,12100,12100,12100,12100
12100,12100,12100,12100,12100,12100,12100,12100,12100,12100,12100,12100,12100,12100,12100,12100
12100,12100,12100,12100,12100,12100,12100,12100,12100,12100,12100,12100,12100,12100,12100,12100
12100,12100,12100,12100,12100,12100,12100,12100,12100,12100,12100,12100,12100,12100,12100,12100
12100,12100,12100,12100,12100,12100,12100,12100,12100,12100,12100,12100,12100,12100,12100,12100
12100,12100,12100,12100,12100,12100,12100,12100,12100,12100,12100,12100,12100,12100,12100,12100
12100,12100,12100,12100,12100,12100,12100,12100,12100,12100,12100,12100,12100,12100,12100,12100
12100,12100,12100,12100,12100,12100,12100,12100,12100,12100,12100,12100,12100,12100,12100,12100
12100,12100,12100,12100,12100,12100,12100,12100,12100,12100,12100,12100,12100,12100,12100,12100
12100,12100,12100,12100,12100,12100,12100,12100,12100,12100,12100,12100,12100,12100,12100,12100
#,raw_min,,,,,,,,,,,,,,
5000,5000,5000,5000,5000,5000,5000,5000,5000,5000,5000,5000,5000,5000,5000,5000
5000,5000,5000,5000,5000,5000,5000,5000,5000,5000,5000,5000,5000,5000,5000,5000
5000,5000,5000,5000,5000,5000,5000,5000,5000,5000,5000,5000,5000,5000,5000,5000
5000,5000,5000,5000,5000,5000,5000,5000,5000,5000,5000,5000,5000,5000,5000,5000
5000,5000,5000,5000,5000,5000,5000,5000,5000,5000,5000,5000,5000,5000,5000,5000
5000,5000,5000,5000,5000,5000,5000,5000,5000,5000,5000,5000,5000,5000,5000,5000
5000,5000,5000,5000,5000,5000,5000,5000,5000,5000,5000,5000,5000,5000,5000,5000
5000,5000,5000,5000,5000,5000,5000,5000,5000,5000,5000,5000,5000,5000,5000,5000
5000,5000,5000,5000,5000,5000,5000,5000,5000,5000,5000,5000,5000,5000,5000,5000
5000,5000,5000,5000,5000,5000,5000,5000,5000,5000,5000,5000,5000,5000,5000,5000
5000,5000,5000,5000,5000,5000,5000,5000,5000,5000,5000,5000,5000,5000,5000,5000
5000,5000,5000,5000,5000,5000,5000,5000,5000,5000,5000,5000,5000,5000,5000,5000
5000,5000,5000,5000,5000,5000,5000,5000,5000,5000,5000,5000,5000,5000,5000,5000
5000,5000,5000,5000,5000,5000,5000,5000,5000,5000,5000,5000,5000,5000,5000,5000
5000,5000,5000,5000,5000,5000,5000,5000,5000,5000,5000,5000,5000,5000,5000,5000
5000,5000,5000,5000,5000,5000,5000,5000,5000,5000,5000,5000,5000,5000,5000,5000
5000,5000,5000,5000,5000,5000,5000,5000,5000,5000,5000,5000,5000,5000,5000,5000
5000,5000,5000,5000,5000,5000,5000,5000,5000,5000,5000,5000,5000,5000,5000,5000
5000,5000,5000,5000,5000,5000,5000,5000,5000,5000,5000,5000,5000,5000,5000,5000
5000,5000,5000,5000,5000,5000,5000,5000,5000,5000,5000,5000,5000,5000,5000,5000
5000,5000,5000,5000,5000,5000,5000,5000,5000,5000,5000,5000,5000,5000,5000,5000
5000,5000,5000,5000,5000,5000,5000,5000,5000,5000,5000,5000,5000,5000,5000,5000
5000,5000,5000,5000,5000,5000,5000,5000,5000,5000,5000,5000,5000,5000,5000,5000
5000,5000,5000,5000,5000,5000,5000,5000,5000,5000,5000,5000,5000,5000,5000,5000
5000,5000,5000,5000,5000,5000,5000,5000,5000,5000,5000,5000,5000,5000,5000,5000
5000,5000,5000,5000,5000,5000,5000,5000,5000,5000,5000,5000,5000,5000,5000,5000
5000,5000,5000,5000,5000,5000,5000,5000,5000,5000,5000,5000,5000,5000,5000,5000
5000,5000,5000,5000,5000,5000,5000,5000,5000,5000,5000,5000,5000,5000,5000,5000
5000,5000,5000,5000,5000,5000,5000,5000,5000,5000,5000,5000,5000,5000,5000,5000
5000,5000,5000,5000,5000,5000,5000,5000,5000,5000,5000,5000,5000,5000,5000,5000
5000,5000,5000,5000,5000,5000,5000,5000,5000,5000,5000,5000,5000,5000,5000,5000
5000,5000,5000,5000,5000,5000,5000,5000,5000,5000,5000,5000,5000,5000,5000,5000
5000,5000,5000,5000,5000,5000,5000,5000,5000,5000,5000,5000,5000,5000,5000,5000
5000,5000,5000,5000,5000,5000,5000,5000,5000,5000,5000,5000,5000,5000,5000,5000
5000,5000,5000,5000,5000,5000,5000,5000,5000,5000,5000,5000,5000,5000,5000,5000
5000,5000,5000,5000,5000,5000,5000,5000,5000,5000,5000,5000,5000,5000,5000,5000
#,raw_row_delta_max,,,,,,,,,,,,,,
2200,2200,2200,2200,2200,2200,2200,2200,2200,2200,2200,2200,2200,2200,2200,2200
2200,2200,2200,2200,2200,2200,2200,2200,2200,2200,2200,2200,2200,2200,2200,2200
2200,2200,2200,2200,2200,2200,2200,2200,2200,2200,2200,2200,2200,2200,2200,2200
2200,2200,2200,2200,2200,2200,2200,2200,2200,2200,2200,2200,2200,2200,2200,2200
2200,2200,2200,2200,2200,2200,2200,2200,2200,2200,2200,2200,2200,2200,2200,2200
2200,2200,2200,2200,2200,2200,2200,2200,2200,2200,2200,2200,2200,2200,2200,2200
2200,2200,2200,2200,2200,2200,2200,2200,2200,2200,2200,2200,2200,2200,2200,2200
2200,2200,2200,2200,2200,2200,2200,2200,2200,2200,2200,2200,2200,2200,2200,2200
2200,2200,2200,2200,2200,2200,2200,2200,2200,2200,2200,2200,2200,2200,2200,2200
2200,2200,2200,2200,2200,2200,2200,2200,2200,2200,2200,2200,2200,2200,2200,2200
2200,2200,2200,2200,2200,2200,2200,2200,2200,2200,2200,2200,2200,2200,2200,2200
2200,2200,2200,2200,2200,2200,2200,2200,2200,2200,2200,2200,2200,2200,2200,2200
2200,2200,2200,2200,2200,2200,2200,2200,2200,2200,2200,2200,2200,2200,2200,2200
2200,2200,2200,2200,2200,2200,2200,2200,2200,2200,2200,2200,2200,2200,2200,2200
2200,2200,2200,2200,2200,2200,2200,2200,2200,2200,2200,2200,2200,2200,2200,2200
2200,2200,2200,2200,2200,2200,2200,2200,2200,2200,2200,2200,2200,2200,2200,2200
2200,2200,2200,2200,2200,2200,2200,2200,2200,2200,2200,2200,2200,2200,2200,2200
2200,2200,2200,2200,2200,2200,2200,2200,2200,2200,2200,2200,2200,2200,2200,2200
2200,2200,2200,2200,2200,2200,2200,2200,2200,2200,2200,2200,2200,2200,2200,2200
2200,2200,2200,2200,2200,2200,2200,2200,2200,2200,2200,2200,2200,2200,2200,2200
2200,2200,2200,2200,2200,2200,2200,2200,2200,2200,2200,2200,2200,2200,2200,2200
2200,2200,2200,2200,2200,2200,2200,2200,2200,2200,2200,2200,2200,2200,2200,2200
2200,2200,2200,2200,2200,2200,2200,2200,2200,2200,2200,2200,2200,2200,2200,2200
2200,2200,2200,2200,2200,2200,2200,2200,2200,2200,2200,2200,2200,2200,2200,2200
2200,2200,2200,2200,2200,2200,2200,2200,2200,2200,2200,2200,2200,2200,2200,2200
2200,2200,2200,2200,2200,2200,2200,2200,2200,2200,2200,2200,2200,2200,2200,2200
2200,2200,2200,2200,2200,2200,2200,2200,2200,2200,2200,2200,2200,2200,2200,2200
2200,2200,2200,2200,2200,2200,2200,2200,2200,2200,2200,2200,2200,2200,2200,2200
2200,2200,2200,2200,2200,2200,2200,2200,2200,2200,2200,2200,2200,2200,2200,2200
2200,2200,2200,2200,2200,2200,2200,2200,2200,2200,2200,2200,2200,2200,2200,2200
2200,2200,2200,2200,2200,2200,2200,2200,2200,2200,2200,2200,2200,2200,2200,2200
2200,2200,2200,2200,2200,2200,2200,2200,2200,2200,2200,2200,2200,2200,2200,2200
2200,2200,2200,2200,2200,2200,2200,2200,2200,2200,2200,2200,2200,2200,2200,2200
2200,2200,2200,2200,2200,2200,2200,2200,2200,2200,2200,2200,2200,2200,2200,2200
2200,2200,2200,2200,2200,2200,2200,2200,2200,2200,2200,2200,2200,2200,2200,2200
2200,2200,2200,2200,2200,2200,2200,2200,2200,2200,2200,2200,2200,2200,2200,2200
#,raw_row_delta_min,,,,,,,,,,,,,,
-2200,-2200,-2200,-2200,-2200,-2200,-2200,-2200,-2200,-2200,-2200,-2200,-2200,-2200,-2200,-2200
-2200,-2200,-2200,-2200,-2200,-2200,-2200,-2200,-2200,-2200,-2200,-2200,-2200,-2200,-2200,-2200
-2200,-2200,-2200,-2200,-2200,-2200,-2200,-2200,-2200,-2200,-2200,-2200,-2200,-2200,-2200,-2200
-2200,-2200,-2200,-2200,-2200,-2200,-2200,-2200,-2200,-2200,-2200,-2200,-2200,-2200,-2200,-2200
-2200,-2200,-2200,-2200,-2200,-2200,-2200,-2200,-2200,-2200,-2200,-2200,-2200,-2200,-2200,-2200
-2200,-2200,-2200,-2200,-2200,-2200,-2200,-2200,-2200,-2200,-2200,-2200,-2200,-2200,-2200,-2200
-2200,-2200,-2200,-2200,-2200,-2200,-2200,-2200,-2200,-2200,-2200,-2200,-2200,-2200,-2200,-2200
-2200,-2200,-2200,-2200,-2200,-2200,-2200,-2200,-2200,-2200,-2200,-2200,-2200,-2200,-2200,-2200
-2200,-2200,-2200,-2200,-2200,-2200,-2200,-2200,-2200,-2200,-2200,-2200,-2200,-2200,-2200,-2200
-2200,-2200,-2200,-2200,-2200,-2200,-2200,-2200,-2200,-2200,-2200,-2200,-2200,-2200,-2200,-2200
-2200,-2200,-2200,-2200,-2200,-2200,-2200,-2200,-2200,-2200,-2200,-2200,-2200,-2200,-2200,-2200
-2200,-2200,-2200,-2200,-2200,-2200,-2200,-2200,-2200,-2200,-2200,-2200,-2200,-2200,-2200,-2200
-2200,-2200,-2200,-2200,-2200,-2200,-2200,-2200,-2200,-2200,-2200,-2200,-2200,-2200,-2200,-2200
-2200,-2200,-2200,-2200,-2200,-2200,-2200,-2200,-2200,-2200,-2200,-2200,-2200,-2200,-2200,-2200
-2200,-2200,-2200,-2200,-2200,-2200,-2200,-2200,-2200,-2200,-2200,-2200,-2200,-2200,-2200,-2200
-2200,-2200,-2200,-2200,-2200,-2200,-2200,-2200,-2200,-2200,-2200,-2200,-2200,-2200,-2200,-2200
-2200,-2200,-2200,-2200,-2200,-2200,-2200,-2200,-2200,-2200,-2200,-2200,-2200,-2200,-2200,-2200
-2200,-2200,-2200,-2200,-2200,-2200,-2200,-2200,-2200,-2200,-2200,-2200,-2200,-2200,-2200,-2200
-2200,-2200,-2200,-2200,-2200,-2200,-2200,-2200,-2200,-2200,-2200,-2200,-2200,-2200,-2200,-2200
-2200,-2200,-2200,-2200,-2200,-2200,-2200,-2200,-2200,-2200,-2200,-2200,-2200,-2200,-2200,-2200
-2200,-2200,-2200,-2200,-2200,-2200,-2200,-2200,-2200,-2200,-2200,-2200,-2200,-2200,-2200,-2200
-2200,-2200,-2200,-2200,-2200,-2200,-2200,-2200,-2200,-2200,-2200,-2200,-2200,-2200,-2200,-2200
-2200,-2200,-2200,-2200,-2200,-2200,-2200,-2200,-2200,-2200,-2200,-2200,-2200,-2200,-2200,-2200
-2200,-2200,-2200,-2200,-2200,-2200,-2200,-2200,-2200,-2200,-2200,-2200,-2200,-2200,-2200,-2200
-2200,-2200,-2200,-2200,-2200,-2200,-2200,-2200,-2200,-2200,-2200,-2200,-2200,-2200,-2200,-2200
-2200,-2200,-2200,-2200,-2200,-2200,-2200,-2200,-2200,-2200,-2200,-2200,-2200,-2200,-2200,-2200
-2200,-2200,-2200,-2200,-2200,-2200,-2200,-2200,-2200,-2200,-2200,-2200,-2200,-2200,-2200,-2200
-2200,-2200,-2200,-2200,-2200,-2200,-2200,-2200,-2200,-2200,-2200,-2200,-2200,-2200,-2200,-2200
-2200,-2200,-2200,-2200,-2200,-2200,-2200,-2200,-2200,-2200,-2200,-2200,-2200,-2200,-2200,-2200
-2200,-2200,-2200,-2200,-2200,-2200,-2200,-2200,-2200,-2200,-2200,-2200,-2200,-2200,-2200,-2200
-2200,-2200,-2200,-2200,-2200,-2200,-2200,-2200,-2200,-2200,-2200,-2200,-2200,-2200,-2200,-2200
-2200,-2200,-2200,-2200,-2200,-2200,-2200,-2200,-2200,-2200,-2200,-2200,-2200,-2200,-2200,-2200
-2200,-2200,-2200,-2200,-2200,-2200,-2200,-2200,-2200,-2200,-2200,-2200,-2200,-2200,-2200,-2200
-2200,-2200,-2200,-2200,-2200,-2200,-2200,-2200,-2200,-2200,-2200,-2200,-2200,-2200,-2200,-2200
-2200,-2200,-2200,-2200,-2200,-2200,-2200,-2200,-2200,-2200,-2200,-2200,-2200,-2200,-2200,-2200
-2200,-2200,-2200,-2200,-2200,-2200,-2200,-2200,-2200,-2200,-2200,-2200,-2200,-2200,-2200,-2200
#,raw_col_delta_max,,,,,,,,,,,,,,
2200,2200,2200,2200,2200,2200,2200,2200,2200,2200,2200,2200,2200,2200,2200,2200
2200,2200,2200,2200,2200,2200,2200,2200,2200,2200,2200,2200,2200,2200,2200,2200
2200,2200,2200,2200,2200,2200,2200,2200,2200,2200,2200,2200,2200,2200,2200,2200
2200,2200,2200,2200,2200,2200,2200,2200,2200,2200,2200,2200,2200,2200,2200,2200
2200,2200,2200,2200,2200,2200,2200,2200,2200,2200,2200,2200,2200,2200,2200,2200
2200,2200,2200,2200,2200,2200,2200,2200,2200,2200,2200,2200,2200,2200,2200,2200
2200,2200,2200,2200,2200,2200,2200,2200,2200,2200,2200,2200,2200,2200,2200,2200
2200,2200,2200,2200,2200,2200,2200,2200,2200,2200,2200,2200,2200,2200,2200,2200
2200,2200,2200,2200,2200,2200,2200,2200,2200,2200,2200,2200,2200,2200,2200,2200
2200,2200,2200,2200,2200,2200,2200,2200,2200,2200,2200,2200,2200,2200,2200,2200
2200,2200,2200,2200,2200,2200,2200,2200,2200,2200,2200,2200,2200,2200,2200,2200
2200,2200,2200,2200,2200,2200,2200,2200,2200,2200,2200,2200,2200,2200,2200,2200
2200,2200,2200,2200,2200,2200,2200,2200,2200,2200,2200,2200,2200,2200,2200,2200
2200,2200,2200,2200,2200,2200,2200,2200,2200,2200,2200,2200,2200,2200,2200,2200
2200,2200,2200,2200,2200,2200,2200,2200,2200,2200,2200,2200,2200,2200,2200,2200
2200,2200,2200,2200,2200,2200,2200,2200,2200,2200,2200,2200,2200,2200,2200,2200
2200,2200,2200,2200,2200,2200,2200,2200,2200,2200,2200,2200,2200,2200,2200,2200
2200,2200,2200,2200,2200,2200,2200,2200,2200,2200,2200,2200,2200,2200,2200,2200
2200,2200,2200,2200,2200,2200,2200,2200,2200,2200,2200,2200,2200,2200,2200,2200
2200,2200,2200,2200,2200,2200,2200,2200,2200,2200,2200,2200,2200,2200,2200,2200
2200,2200,2200,2200,2200,2200,2200,2200,2200,2200,2200,2200,2200,2200,2200,2200
2200,2200,2200,2200,2200,2200,2200,2200,2200,2200,2200,2200,2200,2200,2200,2200
2200,2200,2200,2200,2200,2200,2200,2200,2200,2200,2200,2200,2200,2200,2200,2200
2200,2200,2200,2200,2200,2200,2200,2200,2200,2200,2200,2200,2200,2200,2200,2200
2200,2200,2200,2200,2200,2200,2200,2200,2200,2200,2200,2200,2200,2200,2200,2200
2200,2200,2200,2200,2200,2200,2200,2200,2200,2200,2200,2200,2200,2200,2200,2200
2200,2200,2200,2200,2200,2200,2200,2200,2200,2200,2200,2200,2200,2200,2200,2200
2200,2200,2200,2200,2200,2200,2200,2200,2200,2200,2200,2200,2200,2200,2200,2200
2200,2200,2200,2200,2200,2200,2200,2200,2200,2200,2200,2200,2200,2200,2200,2200
2200,2200,2200,2200,2200,2200,2200,2200,2200,2200,2200,2200,2200,2200,2200,2200
2200,2200,2200,2200,2200,2200,2200,2200,2200,2200,2200,2200,2200,2200,2200,2200
2200,2200,2200,2200,2200,2200,2200,2200,2200,2200,2200,2200,2200,2200,2200,2200
2200,2200,2200,2200,2200,2200,2200,2200,2200,2200,2200,2200,2200,2200,2200,2200
2200,2200,2200,2200,2200,2200,2200,2200,2200,2200,2200,2200,2200,2200,2200,2200
2200,2200,2200,2200,2200,2200,2200,2200,2200,2200,2200,2200,2200,2200,2200,2200
2200,2200,2200,2200,2200,2200,2200,2200,2200,2200,2200,2200,2200,2200,2200,2200
#,raw_col_delta_min,,,,,,,,,,,,,,
-2200,-2200,-2200,-2200,-2200,-2200,-2200,-2200,-2200,-2200,-2200,-2200,-2200,-2200,-2200,-2200
-2200,-2200,-2200,-2200,-2200,-2200,-2200,-2200,-2200,-2200,-2200,-2200,-2200,-2200,-2200,-2200
-2200,-2200,-2200,-2200,-2200,-2200,-2200,-2200,-2200,-2200,-2200,-2200,-2200,-2200,-2200,-2200
-2200,-2200,-2200,-2200,-2200,-2200,-2200,-2200,-2200,-2200,-2200,-2200,-2200,-2200,-2200,-2200
-2200,-2200,-2200,-2200,-2200,-2200,-2200,-2200,-2200,-2200,-2200,-2200,-2200,-2200,-2200,-2200
-2200,-2200,-2200,-2200,-2200,-2200,-2200,-2200,-2200,-2200,-2200,-2200,-2200,-2200,-2200,-2200
-2200,-2200,-2200,-2200,-2200,-2200,-2200,-2200,-2200,-2200,-2200,-2200,-2200,-2200,-2200,-2200
-2200,-2200,-2200,-2200,-2200,-2200,-2200,-2200,-2200,-2200,-2200,-2200,-2200,-2200,-2200,-2200
-2200,-2200,-2200,-2200,-2200,-2200,-2200,-2200,-2200,-2200,-2200,-2200,-2200,-2200,-2200,-2200
-2200,-2200,-2200,-2200,-2200,-2200,-2200,-2200,-2200,-2200,-2200,-2200,-2200,-2200,-2200,-2200
-2200,-2200,-2200,-2200,-2200,-2200,-2200,-2200,-2200,-2200,-2200,-2200,-2200,-2200,-2200,-2200
-2200,-2200,-2200,-2200,-2200,-2200,-2200,-2200,-2200,-2200,-2200,-2200,-2200,-2200,-2200,-2200
-2200,-2200,-2200,-2200,-2200,-2200,-2200,-2200,-2200,-2200,-2200,-2200,-2200,-2200,-2200,-2200
-2200,-2200,-2200,-2200,-2200,-2200,-2200,-2200,-2200,-2200,-2200,-2200,-2200,-2200,-2200,-2200
-2200,-2200,-2200,-2200,-2200,-2200,-2200,-2200,-2200,-2200,-2200,-2200,-2200,-2200,-2200,-2200
-2200,-2200,-2200,-2200,-2200,-2200,-2200,-2200,-2200,-2200,-2200,-2200,-2200,-2200,-2200,-2200
-2200,-2200,-2200,-2200,-2200,-2200,-2200,-2200,-2200,-2200,-2200,-2200,-2200,-2200,-2200,-2200
-2200,-2200,-2200,-2200,-2200,-2200,-2200,-2200,-2200,-2200,-2200,-2200,-2200,-2200,-2200,-2200
-2200,-2200,-2200,-2200,-2200,-2200,-2200,-2200,-2200,-2200,-2200,-2200,-2200,-2200,-2200,-2200
-2200,-2200,-2200,-2200,-2200,-2200,-2200,-2200,-2200,-2200,-2200,-2200,-2200,-2200,-2200,-2200
-2200,-2200,-2200,-2200,-2200,-2200,-2200,-2200,-2200,-2200,-2200,-2200,-2200,-2200,-2200,-2200
-2200,-2200,-2200,-2200,-2200,-2200,-2200,-2200,-2200,-2200,-2200,-2200,-2200,-2200,-2200,-2200
-2200,-2200,-2200,-2200,-2200,-2200,-2200,-2200,-2200,-2200,-2200,-2200,-2200,-2200,-2200,-2200
-2200,-2200,-2200,-2200,-2200,-2200,-2200,-2200,-2200,-2200,-2200,-2200,-2200,-2200,-2200,-2200
-2200,-2200,-2200,-2200,-2200,-2200,-2200,-2200,-2200,-2200,-2200,-2200,-2200,-2200,-2200,-2200
-2200,-2200,-2200,-2200,-2200,-2200,-2200,-2200,-2200,-2200,-2200,-2200,-2200,-2200,-2200,-2200
-2200,-2200,-2200,-2200,-2200,-2200,-2200,-2200,-2200,-2200,-2200,-2200,-2200,-2200,-2200,-2200
-2200,-2200,-2200,-2200,-2200,-2200,-2200,-2200,-2200,-2200,-2200,-2200,-2200,-2200,-2200,-2200
-2200,-2200,-2200,-2200,-2200,-2200,-2200,-2200,-2200,-2200,-2200,-2200,-2200,-2200,-2200,-2200
-2200,-2200,-2200,-2200,-2200,-2200,-2200,-2200,-2200,-2200,-2200,-2200,-2200,-2200,-2200,-2200
-2200,-2200,-2200,-2200,-2200,-2200,-2200,-2200,-2200,-2200,-2200,-2200,-2200,-2200,-2200,-2200
-2200,-2200,-2200,-2200,-2200,-2200,-2200,-2200,-2200,-2200,-2200,-2200,-2200,-2200,-2200,-2200
-2200,-2200,-2200,-2200,-2200,-2200,-2200,-2200,-2200,-2200,-2200,-2200,-2200,-2200,-2200,-2200
-2200,-2200,-2200,-2200,-2200,-2200,-2200,-2200,-2200,-2200,-2200,-2200,-2200,-2200,-2200,-2200
-2200,-2200,-2200,-2200,-2200,-2200,-2200,-2200,-2200,-2200,-2200,-2200,-2200,-2200,-2200,-2200
-2200,-2200,-2200,-2200,-2200,-2200,-2200,-2200,-2200,-2200,-2200,-2200,-2200,-2200,-2200,-2200
