{
    "enable":true,
    "extra_heap_MB":64,
    "supported_memory_GB":8,
    "low_memory_MB":1536,
    "long_pause_time_ms":5,
    "log_all_gc":false,
    "opcode_cache_enable": ["holi","mt6768","mt6877","kalama","taro","lahaina","mt6853","mt6833","bengal","parrot"]
}
