{
    "id": "warmMoments",
    "title_id": "story_template_title_love_each_other",
    "music": "Resource/music/out.aac",
    "resolution": [2520, 1080],
    "segments": [
        {
            "camera_id": 0,
            "duration": 2.7,
            "demo_offset": [0, 2.0],
            "shot_mode": "single_video",
            "audio_offset": 0,
            "algo_scripts": {
            },
            "camera_effects": {
            }
        },
        {
            "camera_id": 0,
            "duration": 2.6,
            "shot_mode": "dual_video_picture_in_picture",
            "demo_offset": [3.0, 5.3],
            "audio_offset": 3.0,
            "algo_scripts": {
            },
            "camera_effects": {
                "beauty": "5"
            }
        },
        {
            "camera_id": 0,
            "duration": 1.4,
            "shot_mode": "one_take_slow_mode",
            "demo_offset": [5.9, 7.3],
            "audio_offset": 5.9,
            "algo_scripts": {
            },
            "camera_effects": {
                "beauty": "5"
            }
        },
        {
            "camera_id": 0,
            "duration": 3.0,
            "shot_mode": "dual_back_video",
            "twins_video_status": "SWAP",
            "demo_offset": [8.0, 10.4],
            "audio_offset": 8.0,
            "algo_scripts": {
                "operation_mode": "front_rear_dual_view"
            },
            "camera_effects": {
                "beauty": "5"
            }
        },
		{
            "camera_id": 0,
            "duration": 2.7,
            "shot_mode": "dual_video",
            "twins_video_status": "NORMAL",
            "demo_offset": [11.0, 12.8],
            "audio_offset": 11.0,
            "algo_scripts": {
                "operation_mode": "front_rear_dual_view"
            },
            "camera_effects": {
                "beauty": "5"
            }
        },
        {
            "camera_id": 1,
            "duration": 3.2,
            "shot_mode": "single_video",
            "demo_offset": [13.3, 15.0],
            "audio_offset": 13.3,
            "algo_scripts": {
            },
            "camera_effects": {
                "beauty": "5"
            }
        }
    ]
}