{
	"include_cols": [
		"rtt",
		"dlinkPktNum",
		"dlinkPktLen",
		"uplinkPktNum",
		"uplinkPktLen",
		"dlinkRetransRate",
		"uplinkRetransRate",
		"sockNum",
		"synNum",
		"wifiTxLinkSpeed",
		"wifiRxLinkSpeed",
		"wifiRssi",
		"wifiUpLinkPkgLossRate"
	],
	"base_cols": [
		"dlinkPktLen",
		"sockNum",
		"wifiTxLinkSpeed"
	],
	"window_cols": [
		[
			"dlinkPktNum",
			6,
			"mean"
		],
		[
			"dlinkPktLen",
			6,
			"mean"
		],
		[
			"sockNum",
			6,
			"mean"
		],
		[
			"rtt",
			10,
			"mean"
		],
		[
			"dlinkPktLen",
			10,
			"mean"
		],
		[
			"uplinkRetransRate",
			10,
			"mean"
		],
		[
			"synNum",
			10,
			"mean"
		],
		[
			"wifiRssi",
			10,
			"mean"
		],
		[
			"wifiUpLinkPkgLossRate",
			10,
			"mean"
		],
		[
			"rtt",
			18,
			"mean"
		],
		[
			"dlinkPktNum",
			18,
			"mean"
		],
		[
			"dlinkPktLen",
			18,
			"mean"
		],
		[
			"uplinkPktLen",
			18,
			"mean"
		],
		[
			"dlinkRetransRate",
			18,
			"mean"
		],
		[
			"uplinkRetransRate",
			18,
			"mean"
		],
		[
			"sockNum",
			18,
			"mean"
		],
		[
			"synNum",
			18,
			"mean"
		],
		[
			"wifiTxLinkSpeed",
			18,
			"mean"
		],
		[
			"wifiRssi",
			18,
			"mean"
		],
		[
			"wifiUpLinkPkgLossRate",
			18,
			"mean"
		],
		[
			"rtt",
			15,
			"max"
		],
		[
			"dlinkPktNum",
			15,
			"max"
		],
		[
			"dlinkPktLen",
			15,
			"max"
		],
		[
			"uplinkPktNum",
			15,
			"max"
		],
		[
			"uplinkPktLen",
			15,
			"max"
		],
		[
			"dlinkRetransRate",
			15,
			"max"
		],
		[
			"uplinkRetransRate",
			15,
			"max"
		],
		[
			"sockNum",
			15,
			"max"
		],
		[
			"synNum",
			15,
			"max"
		],
		[
			"wifiRssi",
			15,
			"max"
		],
		[
			"wifiUpLinkPkgLossRate",
			15,
			"max"
		],
		[
			"rtt",
			10,
			"min"
		],
		[
			"dlinkPktLen",
			10,
			"min"
		],
		[
			"uplinkPktNum",
			10,
			"min"
		],
		[
			"uplinkPktLen",
			10,
			"min"
		],
		[
			"sockNum",
			10,
			"min"
		],
		[
			"wifiTxLinkSpeed",
			10,
			"min"
		],
		[
			"wifiRxLinkSpeed",
			10,
			"min"
		],
		[
			"rtt",
			18,
			"mad"
		],
		[
			"dlinkPktNum",
			18,
			"mad"
		],
		[
			"dlinkPktLen",
			18,
			"mad"
		],
		[
			"uplinkPktNum",
			18,
			"mad"
		],
		[
			"uplinkPktLen",
			18,
			"mad"
		],
		[
			"dlinkRetransRate",
			18,
			"mad"
		],
		[
			"uplinkRetransRate",
			18,
			"mad"
		],
		[
			"sockNum",
			18,
			"mad"
		],
		[
			"synNum",
			18,
			"mad"
		]
	]
}