{
  "strategies": [
    {
      "strategyName": "whitelistStrategy1",
      "strategyModelScope": [
        "JDY-*",
        "ALT-*",
        "LYN-*"
      ]
    },
    {
      "strategyName": "tabScalableStandardStrategy",
      "strategyModelScope": [
        "NDL-W09"
      ]
    }
  ],
  "strategyDescs": [
    {
      "name": "whitelistStrategy1",
      "desciption": {
        "whitelistStrategy": {
          "yoyoDisplayBiz": [
            {
              "yoyo": "recommend",
              "brain": "apprecobusiness",
              "awareness": "apprecommendplugin",
              "subBizs": [
                "AppRecoBusiness",
                "MultiModeRecoBusiness"
              ],
              "isVisible": "true",
              "defaultStaus": 1
            },
            {
              "yoyo": "calendar",
              "brain": "calendarbusiness",
              "awareness": "",
              "subBizs": [
                ""
              ],
              "isVisible": "true",
              "defaultStaus": 1
            },
            {
              "yoyo": "express",
              "brain": "expressbusiness",
              "awareness": "deliveryplugin",
              "subBizs": [
                ""
              ],
              "isVisible": "true",
              "defaultStaus": 1
            },
            {
              "yoyo": "repayment",
              "brain": "repayhelperbusiness",
              "awareness": "repaymentplugin",
              "subBizs": [
                ""
              ],
              "isVisible": "true",
              "defaultStaus": 1
            },
            {
              "yoyo": "copypush",
              "brain": "copyrecbusiness",
              "awareness": "translateplugin",
              "subBizs": [
                ""
              ],
              "isVisible": "true",
              "defaultStaus": 1
            },
            {
              "yoyo": "metro",
              "brain": "subwaybusiness",
              "awareness": "metroplugin",
              "subBizs": [
                ""
              ],
              "isVisible": "true",
              "defaultStaus": 1
            },
            {
              "yoyo": "travelReminder",
              "brain": "commutebusiness",
              "awareness": "",
              "subBizs": [
                ""
              ],
              "isVisible": "true",
              "defaultStaus": 1
            },
            {
              "yoyo": "train",
              "brain": "trainbusiness",
              "awareness": "trainplugin",
              "subBizs": [
                ""
              ],
              "isVisible": "true",
              "defaultStaus": 1
            },
            {
              "yoyo": "flight",
              "brain": "flighttravelbusiness",
              "awareness": "flightplugin",
              "subBizs": [
                ""
              ],
              "isVisible": "true",
              "defaultStaus": 1
            },
            {
              "yoyo": "third_business",
              "brain": "carctrlbusiness",
              "awareness": "",
              "subBizs": [
                ""
              ],
              "isVisible": "false",
              "defaultStaus": 0
            },
            {
              "yoyo": "taxi",
              "brain": "taxibusiness",
              "awareness": "",
              "subBizs": [
                ""
              ],
              "isVisible": "true",
              "defaultStaus": 1
            },
            {
              "yoyo": "Gallery",
              "brain": "",
              "awareness": "",
              "subBizs": [
                ""
              ],
              "isVisible": "true",
              "defaultStaus": 1
            }
          ],
          "notDisplayBiz": [
            {
              "brain": "scenebusiness",
              "awareness": "",
              "subBizs": [
                "scene_ad",
                "scene"
              ],
              "defaultStaus": 1
            },
            {
              "brain": "profilebusiness",
              "awareness": "",
              "subBizs": [
                ""
              ],
              "defaultStaus": 1
            },
            {
              "brain": "dikernelbusiness",
              "awareness": "",
              "subBizs": [
                ""
              ],
              "defaultStaus": 1
            },
            {
              "brain": "multintentbusiness",
              "awareness": "",
              "subBizs": [
                ""
              ],
              "defaultStaus": 1
            },
            {
              "brain": "cardsortedbusiness",
              "awareness": "",
              "subBizs": [
                ""
              ],
              "defaultStaus": 1
            },
            {
              "brain": "multifusionbusiness",
              "awareness": "",
              "subBizs": [
                ""
              ],
              "defaultStaus": 1
            },
            {
              "brain": "solutionsc1business",
              "awareness": "",
              "subBizs": [
                ""
              ],
              "defaultStaus": 1
            },
            {
              "brain": "kitbusiness",
              "awareness": "",
              "subBizs": [
                ""
              ],
              "defaultStaus": 1
            },
            {
              "brain": "",
              "awareness": "linkturboplugin",
              "subBizs": [
                ""
              ],
              "defaultStaus": 1
            },
            {
              "brain": "",
              "awareness": "collectaudioplugin",
              "subBizs": [
                ""
              ],
              "defaultStaus": 1
            },
            {
              "brain": "",
              "awareness": "nearbypoiplugin",
              "subBizs": [
                ""
              ],
              "defaultStaus": 1
            },
            {
              "brain": "",
              "awareness": "sceneplugin",
              "subBizs": [
                ""
              ],
              "defaultStaus": 1
            },
            {
              "brain": "",
              "awareness": "minorsplugin",
              "subBizs": [
                ""
              ],
              "defaultStaus": 1
            },
            {
              "brain": "",
              "awareness": "missedcallsplugin",
              "subBizs": [
                ""
              ],
              "defaultStaus": 1
            },
            {
              "brain": "",
              "awareness": "voiceassistantplugin",
              "subBizs": [
                ""
              ],
              "defaultStaus": 1
            },
            {
              "brain": "",
              "awareness": "aisecurityplugin",
              "subBizs": [
                ""
              ],
              "defaultStaus": 1
            },
            {
              "brain": "",
              "awareness": "hyperterminalplugin",
              "subBizs": [
                ""
              ],
              "defaultStaus": 1
            },
            {
              "brain": "",
              "awareness": "sceneserviceplugin",
              "subBizs": [
                ""
              ],
              "defaultStaus": 1
            }
          ],
          "yoyoWhitelistPkgs": [
            ""
          ],
          "brainWhitelistPkgs": [
            ""
          ],
          "awarenessWhitelistPkgs": [
            "com.hihonor.assistant",
            "com.hihonor.brain",
            "com.hihonor.systemserver",
            "com.android.systemui",
            "com.hihonor.hndockbar",
            "com.hihonor.audioaccessorymanager",
            "com.hihonor.camera",
            "com.hihonor.photos",
            "com.hihonor.parentcontrol",
            "com.hihonor.calendar",
            "com.hihonor.tips",
            "com.hihonor.magichome",
            "com.hihonor.android.thememanager",
            "com.hihonor.sceneservice",
            "com.hihonor.search",
            "com.hihonor.hiboard",
            "com.hihonor.magicvoice",
            "com.hihonor.smartiot",
            "com.hihonor.auto",
            "android",
            "com.hihonor.lbs",
            "com.honor.testkits",
            "com.hihonor.aipluginengine",
            "com.hihonor.awareness"
          ]
        }
      }
    },
    {
      "name": "tabScalableStandardStrategy",
      "desciption": {
        "whitelistStrategy": {
          "yoyoDisplayBiz": [
            {
              "yoyo": "recommend",
              "brain": "apprecobusiness",
              "awareness": "apprecommendplugin",
              "subBizs": [
                "AppRecoBusiness",
                "MultiModeRecoBusiness"
              ],
              "isVisible": "true",
              "defaultStaus": 1
            },
            {
              "yoyo": "calendar",
              "brain": "calendarbusiness",
              "awareness": "",
              "subBizs": [
                ""
              ],
              "isVisible": "true",
              "defaultStaus": 1
            },
            {
              "yoyo": "flashback",
              "brain": "flashbackbusiness",
              "awareness": "",
              "subBizs": [
                ""
              ],
              "isVisible": "true",
              "defaultStaus": 1
            },
            {
              "yoyo": "SplitScreen",
              "brain": "splitscreenbusiness",
              "awareness": "screensplitplugin",
              "subBizs": [
                ""
              ],
              "isVisible": "true",
              "defaultStaus": 1
            },
            {
              "yoyo": "copypush",
              "brain": "copyrecbusiness",
              "awareness": "translateplugin",
              "subBizs": [
                ""
              ],
              "isVisible": "false",
              "defaultStaus": 0
            },
            {
              "yoyo": "smartPhotoSwitch",
              "brain": "",
              "awareness": "",
              "subBizs": [
                ""
              ],
              "isVisible": "false",
              "defaultStaus": 0
            }
          ],
          "notDisplayBiz": [
            {
              "brain": "base",
              "awareness": "",
              "subBizs": [
                "OfflineAsm",
                "PluginPackageAssembler",
                "ServiceMgrAsm"
              ],
              "defaultStaus": 1
            },
            {
              "brain": "scenebusiness",
              "awareness": "",
              "subBizs": [
                "scene_ad",
                "scene"
              ],
              "defaultStaus": 1
            },
            {
              "brain": "profilebusiness",
              "awareness": "",
              "subBizs": [
                ""
              ],
              "defaultStaus": 1
            },
            {
              "brain": "dikernelbusiness",
              "awareness": "",
              "subBizs": [
                ""
              ],
              "defaultStaus": 1
            },
            {
              "brain": "multintentbusiness",
              "awareness": "",
              "subBizs": [
                ""
              ],
              "defaultStaus": 1
            },
            {
              "brain": "cardsortedbusiness",
              "awareness": "",
              "subBizs": [
                ""
              ],
              "defaultStaus": 1
            },
            {
              "brain": "multifusionbusiness",
              "awareness": "",
              "subBizs": [
                ""
              ],
              "defaultStaus": 1
            },
            {
              "brain": "solutionsc1business",
              "awareness": "",
              "subBizs": [
                ""
              ],
              "defaultStaus": 1
            },
            {
              "brain": "kitbusiness",
              "awareness": "",
              "subBizs": [
                ""
              ],
              "defaultStaus": 1
            },
            {
              "brain": "stdecisionbusiness",
              "awareness": "",
              "subBizs": [
                ""
              ],
              "defaultStaus": 1
            },
            {
              "brain": "",
              "awareness": "linkturboplugin",
              "subBizs": [
                ""
              ],
              "defaultStaus": 1
            },
            {
              "brain": "",
              "awareness": "collectaudioplugin",
              "subBizs": [
                ""
              ],
              "defaultStaus": 1
            },
            {
              "brain": "",
              "awareness": "nearbypoiplugin",
              "subBizs": [
                ""
              ],
              "defaultStaus": 1
            },
            {
              "brain": "",
              "awareness": "sceneplugin",
              "subBizs": [
                ""
              ],
              "defaultStaus": 1
            },
            {
              "brain": "",
              "awareness": "minorsplugin",
              "subBizs": [
                ""
              ],
              "defaultStaus": 1
            },
            {
              "brain": "",
              "awareness": "missedcallsplugin",
              "subBizs": [
                ""
              ],
              "defaultStaus": 1
            },
            {
              "brain": "",
              "awareness": "voiceassistantplugin",
              "subBizs": [
                ""
              ],
              "defaultStaus": 1
            },
            {
              "brain": "",
              "awareness": "aisecurityplugin",
              "subBizs": [
                ""
              ],
              "defaultStaus": 1
            },
            {
              "brain": "",
              "awareness": "hyperterminalplugin",
              "subBizs": [
                ""
              ],
              "defaultStaus": 1
            },
            {
              "brain": "",
              "awareness": "sceneserviceplugin",
              "subBizs": [
                ""
              ],
              "defaultStaus": 1
            }
          ],
          "yoyoWhitelistPkgs": [
            ""
          ],
          "brainWhitelistPkgs": [
            ""
          ],
          "awarenessWhitelistPkgs": [
            "com.hihonor.assistant",
            "com.hihonor.brain",
            "com.hihonor.systemserver",
            "com.android.systemui",
            "com.hihonor.hndockbar",
            "com.hihonor.audioaccessorymanager",
            "com.hihonor.camera",
            "com.hihonor.photos",
            "com.hihonor.parentcontrol",
            "com.hihonor.calendar",
            "com.hihonor.tips",
            "com.hihonor.magichome",
            "com.hihonor.android.thememanager",
            "com.hihonor.sceneservice",
            "com.hihonor.search",
            "com.hihonor.hiboard",
            "com.hihonor.magicvoice",
            "com.hihonor.smartiot",
            "com.hihonor.auto",
            "android",
            "com.hihonor.lbs",
            "com.honor.testkits",
            "com.hihonor.aipluginengine",
            "com.hihonor.systemmanager",
            "com.hihonor.awareness"
          ]
        }
      }
    }
  ]
}