﻿{
    "id": "LoveEachOther",
    "version": 100000,
    "name": "相亲相爱",
    "duration": 15000,
    "timeCreated": 1620784466000,
    "timeModified": 1622635326329,
    "preview": "preview/preview.jpg",
    "previewVideo": "preview/previewVideo.mp4",
    "canvas_config": {
        "ratio": "1080:2520",
        "width": 1080,
        "height": 2520
    },
    "editTracks": [
        {
            "id": "1vt",
            "type": "video",
            "editSegments": [
                {
                    "id": "1vt1vs",
                    "timeRangeInSource": {
                        "start": 0,
                        "duration": 2700
                    },
                    "timeRangeInTarget": {
                        "start": 0,
                        "duration": 2700
                    },
                    "playSpeed": 1.0,
                    "mirror": false,
                    "reverse": false,
                    "volume": 0,
                    "sizeCut": {
                        "scale": {
                            "x": 1,
                            "y": 1
                        },
                        "rotation": 0,
                        "transform": {
                            "x": 0,
                            "y": 0
                        },
                        "flip": {
                            "horizontal": false,
                            "vertical": false
                        },
                        "alpha": 1
                    },
                    "mainMaterialId": "1v_material_id",
					"attachedExtraMaterialRefs": ["1trs_material_id"],
                    "render_index": 1,
                    "attachInfo": {
                        "videoId": "",
                        "offset": 0
                    }
                },
                {
                    "id": "1vt2vs",
                    "timeRangeInSource": {
                        "start": 0,
                        "duration": 2600
                    },
                    "timeRangeInTarget": {
                        "start": 2300,
                        "duration": 2600
                    },
                    "playSpeed": 1.0,
                    "mirror": false,
                    "reverse": false,
                    "volume": 0,
                    "sizeCut": {
                        "scale": {
                            "x": 1,
                            "y": 1
                        },
                        "rotation": 0,
                        "transform": {
                            "x": 0,
                            "y": 0
                        },
                        "flip": {
                            "horizontal": false,
                            "vertical": false
                        },
                        "alpha": 1
                    },
                    "mainMaterialId": "2v_material_id",
					"attachedExtraMaterialRefs": ["1trs_material_id"],
                    "render_index": 1,
                    "attachInfo": {
                        "videoId": "",
                        "offset": 0
                    }
                },
                {
                    "id": "1vt3vs",
                    "timeRangeInSource": {
                        "start": 0,
                        "duration": 2800
                    },
                    "timeRangeInTarget": {
                        "start": 4500,
                        "duration": 2800
                    },
                    "playSpeed": 1.0,
                    "mirror": false,
                    "reverse": false,
                    "volume": 0,
                    "sizeCut": {
                        "scale": {
                            "x": 1,
                            "y": 1
                        },
                        "rotation": 0,
                        "transform": {
                            "x": 0,
                            "y": 0
                        },
                        "flip": {
                            "horizontal": false,
                            "vertical": false
                        },
                        "alpha": 1
                    },
                    "mainMaterialId": "3v_material_id",
					"attachedExtraMaterialRefs": ["1trs_material_id"],
                    "render_index": 1,
                    "attachInfo": {
                        "videoId": "",
                        "offset": 0
                    }
                },
                {
                    "id": "1vt4vs",
                    "timeRangeInSource": {
                        "start": 0,
                        "duration": 3000
                    },
                    "timeRangeInTarget": {
                        "start": 6900,
                        "duration": 3000
                    },
                    "playSpeed": 1.0,
                    "mirror": false,
                    "reverse": false,
                    "volume": 0,
                    "sizeCut": {
                        "scale": {
                            "x": 1,
                            "y": 1
                        },
                        "rotation": 0,
                        "transform": {
                            "x": 0,
                            "y": 0
                        },
                        "flip": {
                            "horizontal": false,
                            "vertical": false
                        },
                        "alpha": 1
                    },
                    "mainMaterialId": "4v_material_id",
					"attachedExtraMaterialRefs": ["1trs_material_id"],
                    "render_index": 1,
                    "attachInfo": {
                        "videoId": "",
                        "offset": 0
                    }
                },
				{
                    "id": "1vt5vs",
                    "timeRangeInSource": {
                        "start": 0,
                        "duration": 2700
                    },
                    "timeRangeInTarget": {
                        "start": 9500,
                        "duration": 2700
                    },
                    "playSpeed": 1.0,
                    "mirror": false,
                    "reverse": false,
                    "volume": 0,
                    "sizeCut": {
                        "scale": {
                            "x": 1,
                            "y": 1
                        },
                        "rotation": 0,
                        "transform": {
                            "x": 0,
                            "y": 0
                        },
                        "flip": {
                            "horizontal": false,
                            "vertical": false
                        },
                        "alpha": 1
                    },
                    "mainMaterialId": "5v_material_id",
                    "attachedExtraMaterialRefs": ["1trs_material_id"],
                    "render_index": 1,
                    "attachInfo": {
                        "videoId": "",
                        "offset": 0
                    }
                },
				{
                    "id": "1vt6vs",
                    "timeRangeInSource": {
                        "start": 0,
                        "duration": 3200
                    },
                    "timeRangeInTarget": {
                        "start": 11800,
                        "duration": 3200
                    },
                    "playSpeed": 1.0,
                    "mirror": false,
                    "reverse": false,
                    "volume": 0,
                    "sizeCut": {
                        "scale": {
                            "x": 1,
                            "y": 1
                        },
                        "rotation": 0,
                        "transform": {
                            "x": 0,
                            "y": 0
                        },
                        "flip": {
                            "horizontal": false,
                            "vertical": false
                        },
                        "alpha": 1
                    },
                    "mainMaterialId": "6v_material_id",
                    "attachedExtraMaterialRefs": [],
                    "render_index": 1,
                    "attachInfo": {
                        "videoId": "",
                        "offset": 0
                    }
                },
				{
				    "id": "1vmt1vms",
                    "timeRangeInSource": {
                        "start": 0,
                        "duration": 15000
                    },
                    "timeRangeInTarget": {
                        "start": 0,
                        "duration": 15000
                    },
                    "playSpeed": 1.0,
                    "mirror": false,
                    "reverse": false,
                    "volume": 0,
                    "sizeCut": {
                        "scale": {
                            "x": 1,
                            "y": 1
                        },
                        "rotation": 0,
                        "transform": {
                            "x": 0,
                            "y": 0
                        },
                        "flip": {
                            "horizontal": false,
                            "vertical": false
                        },
                        "alpha": 1
                    },
                    "mainMaterialId": "13v_material_id",
                    "attachedExtraMaterialRefs": [],
                    "render_index": -1,
                    "attachInfo": {
                        "videoId": "",
                        "offset": 0}
				}
            ],
            "flag": 0
        },
        {
            "id": "1at",
            "type": "audio",
            "editSegments": [
                {
                    "id": "1at1as",
                    "timeRangeInSource": {
                        "start": 0,
                        "duration": 15000
                    },
                    "timeRangeInTarget": {
                        "start": 0,
                        "duration": 15000
                    },
                    "playSpeed": 1.0,
                    "mirror": false,
                    "reverse": false,
                    "volume": 1,
                    "sizeCut": {
                        "scale": {
                            "x": 1,
                            "y": 1
                        },
                        "rotation": 0,
                        "transform": {
                            "x": 0,
                            "y": 0
                        },
                        "flip": {
                            "horizontal": false,
                            "vertical": false
                        },
                        "alpha": 1
                    },
                    "mainMaterialId": "1a_material_id",
                    "attachedExtraMaterialRefs": [],
                    "render_index": 1,
                    "attachInfo": {
                        "videoId": "",
                        "offset": 0
                    }
                }
            ],
            "flag": 0
        }
    ],
    "editMaterials": {
        "videos": [
            {
                "id": "1v_material_id",
                "type": "video",
                "duration": 0,
                "path": null,
                "width": 0,
                "height": 0,
                "category_name": null,
                "rotation": 0.0
            },
            {
                "id": "2v_material_id",
                "type": "video",
                "duration": 0,
                "path": null,
                "width": 0,
                "height": 0,
                "category_name": null,
                "rotation": 0.0
            },
            {
                "id": "3v_material_id",
                "type": "video",
                "duration": 0,
                "path": null,
                "width": 0,
                "height": 0,
                "category_name": null,
                "rotation": 0.0
            },
            {
                "id": "4v_material_id",
                "type": "video",
                "duration": 0,
                "path": null,
                "width": 0,
                "height": 0,
                "category_name": null,
                "rotation": 0.0
            },
			{
                "id": "5v_material_id",
                "type": "video",
                "duration": 0,
                "path": null,
                "width": 0,
                "height": 0,
                "category_name": null,
                "rotation": 0.0
            },
			{
                "id": "6v_material_id",
                "type": "video",
                "duration": 0,
                "path": null,
                "width": 0,
                "height": 0,
                "category_name": null,
                "rotation": 0.0
            },
			{
                "id": "13v_material_id",
                "type": "video_musk",
                "duration": 15000,
                "path": "com.hihonor.movietemplate/Resource/mask/title_portrait.mp4",
                "width": 1080,
                "height": 2520,
                "category_name": null,
                "rotation": 0.0
            }
        ],
        "audios": [
            {
                "id": "1a_material_id",
                "type": "music",
                "duration": 15000,
                "path": "com.hihonor.movietemplate/Resource/music/out.aac",
                "name": "music_name"
            }
        ],
		"effects": [
            {
                "id": "color_fading_black",
                "type": "mask",
                "effect_id": "mask_res_1",
                "name": "effect_fading_black",
                "path": "/thepath",
                "value": 0,
                "category_name": ""
            }
		],
        "tail_leaders": [
            {
                "id": "1tl_material_id",
                "type": "tail_leader",
                "text": "",
                "index": 0,
                "start": 15000,
                "duration": 1000
            }
        ],
        "transitions": [
			{
                "id": "1trs_material_id",
                "type": "transition",
                "name": "叠化",
                "path": "/thepath",
                "duration": 400,
                "is_overlap": true,
                "resource_id": "transition_res_honor_local_overlap",
                "category_id": "2001"
            }
        ]
    }
}