{
    "day":{
        "fuse_iso":[300, 1200],
        "fuse_weight":[0.0,0.5,1.0],
        "skip_hdr_ghost_thres":0.12,
        "human_overexposed_thres":0.8,
        "face_exposure_coeff":0.75,
        "cloth_exposure_coeff":0.60,
        "deep_denoise_enable": false,
        "day_moving_or_shaking_threshold":0.14
    },
    "night":{
        "lange":{
            "above_lux400_brighten_coeff": 2.0,
            "above_lux400_brighten_saturated_threshold": 10.0
        },
        "maggie":{
            "above_lux400_brighten_coeff": 2.0,
            "above_lux400_brighten_saturated_threshold": 10.0
        },
        "night_moving_or_shaking_threshold":0.30
    }
}
