{
    "EngineConfig" : {
        "AlgConfig" : [
            {"Text" : "小艺小艺", "AlgType" : 2},
            {"Text" : "你好悠悠", "AlgType" : 2},
            {"Text" : "Default", "AlgType" : 0}
        ],
        "EnableAutoLearn" : true,
        "EnableSecondChance" : true,
        "EnablePcmEncrypt" : true,
        "Version" : "<Version> Honor_VPR_3.0_20190628",
        "AlgSwSnrThreshold" : -10000.0,
        "AlgSwEnergyThreshold" : 0.0,
        "AlgSwStrategy" : 0,
        "AlgModelInSafeZone" : true
    },
    "SecondChance" : {
        "TimeDuration" : 20,
        "TimeElapseFromEnroll" : 86400
    },
    "AutoLearnerConfig" : {
        "Gmm" : {
            "SnrThresholdForPcmFilter" : 10.0,
            "TestPcmOnCurModelUpperLimit" : 10000000.0,
            "TestPcmOnCurModelThreshold" : 1.0,
            "TestPcmOnOriModelThreshold" : 0.6,
            "EnrollPcmOnNewModelThreshold" : 1.0,
            "TestPcmUpdateDuration" : 30,
            "PcmConfigNumForVerify" : 5,
            "HighPcmConfigNumForTrain" : 10,
            "LowPcmConfigNumForTrain" : 0,
            "ModelConfigNum" : 1,
            "ModelUpdateDuration" : 0,
            "PcmFilterStrategy" : 0,
            "ScoreStrategy" : 0,
            "SupportTexts" : ["小艺小艺"],
            "EnablePcmEncrypt" : true
        },
        "Xvector" : {
            "SnrThresholdForPcmFilter" : 10.0,
            "TestPcmOnCurModelUpperLimit" : 60.0,
            "TestPcmOnCurModelThreshold" : 25.0,
            "TestPcmOnOriModelThreshold" : 25.0,
            "ModelRedundanceRatioThreshold" : 60.0,
            "EnrollPcmOnNewModelThreshold" : 0.0,
            "ModelRedundanceRatio" : 0.5,
            "TestPcmUpdateDuration" : 0,
            "PcmConfigNumForVerify" : 0,
            "HighPcmConfigNumForTrain" : 0,
            "LowPcmConfigNumForTrain" : 3,
            "ModelConfigNum" : 10,
            "ModelUpdateDuration" : 0,
            "PcmFilterStrategy" : 1,
            "ScoreStrategy" : 1,
            "SupportTexts" : ["小艺小艺","你好悠悠"],
            "EnablePcmEncrypt" : true
        }
    },
    "ModelConfig" : {
        "Gmm" : [
            {
                "Text" : "小艺小艺",
                "UbmModelName" : "vpr_model_03.pb",
                "SnrThreshold" : [18.0],
                "SecondChanceDelta" : 0.0,
                "SecondChanceThreshold" : 0.0,
                "UserEventDelta" : [
                    [0.0, 0.0, 0.0],
                    [0.0, 0.0, 0.0]
                ],
                "EnrollModelThreshold" : [
                    [0.3, 0.2, 0.0],
                    [0.7, 0.6, 0.5]
                ],
                "LearnModelThreshold" : [
                    [0.3, 0.2, 0.0],
                    [0.7, 0.6, 0.5]
                ]
            },
            {
                "Text" : "你好悠悠",
                "UbmModelName" : "vpr_model_03.pb",
                "SnrThreshold" : [18.0],
                "SecondChanceDelta" : 0.0,
                "SecondChanceThreshold" : 0.0,
                "UserEventDelta" : [
                    [0.0, 0.0, 0.0],
                    [0.0, 0.0, 0.0]
                ],
                "EnrollModelThreshold" : [
                    [0.6, 0.35, 0.0],
                    [1.4, 1.15, 1.0]
                ],
                "LearnModelThreshold" : [
                    [0.6, 0.35, 0.0],
                    [1.4, 1.15, 1.0]
                ]
            },
            {
                "Text" : "Default",
                "UbmModelName" : "vpr_model.pb",
                "SnrThreshold" : [18.0],
                "SecondChanceDelta" : 0.0,
                "SecondChanceThreshold" : 0.0,
                "UserEventDelta" : [
                    [0.0, 0.0, 0.0],
                    [0.0, 0.0, 0.0]
                ],
                "EnrollModelThreshold" : [
                    [0.2, 0.1, -0.1],
                    [0.6, 0.5, 0.4]
                ],
                "LearnModelThreshold" : [
                    [0.2, 0.1, -0.1],
                    [0.6, 0.5, 0.4]
                ]
            }
        ],
        "Xvector" : [
            {
                "Text" : "小艺小艺",
                "NnetComputeType" : 1,
                "NpuInitType" : 0,
                "NpuComputeAsyn" : true,
                "LdaModelName" : "vpr_model_04.pb",
                "PldaModelName" : "vpr_model_05.pb",
                "MeanVectorName" : "vpr_model_06.pb",
                "NnetModelName" : "vpr_model_07.pb",
                "CmvnWindowSize" : 300,
                "CmvnCenter" : true,
                "CmvnNormlize" : false,
                "VadEnergyThreshold" : 5.5,
                "VadEnergyMeanScale" : 0.5,
                "VadProportionThreshold" : 0.7,
                "VadFramesContext" : 5,
                "LdaDimension" : 280,
                "NormalizeRatio" : 2.0,
                "PldaSmoothCovariance" : 0.1,
                "SnrThreshold" : [5.0, 15.0],
                "SecondChanceDelta" : 0.0,
                "SecondChanceThreshold" : 0.0,
                "UserEventDelta" : [
                    [12.0, 15.0, 7.0],
                    [12.0, 14.2, 7.0],
                    [12.0, 12.2, 7.0]
                ],
                "EnrollModelThreshold" : [
                    [15.0, 10.0, -5.0],
                    [20.0, 15.0, 0.0],
                    [25.0, 20.0, 5.0]
                ],
                "LearnModelThreshold" : [
                    [15.0, 10.0, -5.0],
                    [20.0, 15.0, 0.0],
                    [25.0, 20.0, 5.0]
                ]

            },
	    {
                "Text" : "你好悠悠",
                "NnetComputeType" : 1,
                "NpuInitType" : 0,
                "NpuComputeAsyn" : true,
                "LdaModelName" : "vpr_model_04.pb",
                "PldaModelName" : "vpr_model_05.pb",
                "MeanVectorName" : "vpr_model_06.pb",
                "NnetModelName" : "vpr_model_07.pb",
                "CmvnWindowSize" : 300,
                "CmvnCenter" : true,
                "CmvnNormlize" : false,
                "VadEnergyThreshold" : 5.5,
                "VadEnergyMeanScale" : 0.5,
                "VadProportionThreshold" : 0.7,
                "VadFramesContext" : 5,
                "LdaDimension" : 280,
                "NormalizeRatio" : 2.0,
                "PldaSmoothCovariance" : 0.1,
                "SnrThreshold" : [5.0, 15.0],
                "SecondChanceDelta" : 0.0,
                "SecondChanceThreshold" : 0.0,
                "UserEventDelta" : [
                    [12.0, 15.0, 7.0],
                    [12.0, 13.2, 7.0],
                    [12.0, 12.2, 7.0]
                ],
                "EnrollModelThreshold" : [
                    [19.5, 12.0, -5.0],
                    [26.0, 18.0, 0.0],
                    [32.5, 26.0, 6.5]
                ],
                "LearnModelThreshold" : [
                    [19.5, 12.0, -5.0],
                    [26.0, 18.0, 0.0],
                    [32.5, 26.0, 6.5]
                ]
            }
        ],
        "GmmXvectorComposite" : [
            {
                "Text" : "小艺小艺",
                "SnrThreshold" : [5.0, 15.0],
                "SecondChanceDelta" : 0.1,
                "SecondChanceThreshold" : 0.1,
                "UserEventDelta" : [
                    [7.0, 7.0, 7.0],
                    [7.0, 7.0, 7.0],
                    [7.0, 7.0, 7.0]
                ],
                "EnrollModelThreshold" : [
                    [10.0, 0.0, -5.0],
                    [15.0, 5.0, 0.0],
                    [20.0, 12.0, 5.0]
                ],
                "LearnModelThreshold" : [
                    [10.0, 0.0, -5.0],
                    [15.0, 5.0, 0.0],
                    [20.0, 12.0, 5.0]
                ]
            }
        ]
    }
}