{
	"type":"HonorCarConnect",
	"subType":"generic",
	"params":[
		{
			"name":"feature_icce_enable",
			"type":"bool",
			"value":"false"
		},
		{
			"name":"smart_cabin_enable",
			"type":"bool",
			"value":"false"
		}
	],
	"compatibleversion":"1"
}