﻿{
  "type": "soothing",
  "duration": 15000,
  "name": "LoveEachOther",
  "id": "Soothing_15_1",
  "separationStep": 1200,
  "separationMinDuration": 5000,
  "separationMaxDuration": 10000,
  "transitions": [
    {
      "name": "叠化",
      "priority": 70,
      "pickCondition": -1,
      "horizon": true,
      "vertical": true
    },
    {
      "name": "模糊",
      "priority": 0,
      "pickCondition": -1,
      "horizon": true,
      "vertical": true
    },
    {
      "name": "融化",
      "priority": 0,
      "pickCondition": -1,
      "horizon": true,
      "vertical": true
    },
    {
      "name": "上移",
      "priority": 0,
      "pickCondition": 1,
      "horizon": true,
      "vertical": false
    },
    {
      "name": "下移",
      "priority": 0,
      "pickCondition": -1,
      "horizon": true,
      "vertical": true
    },
    {
      "name": "左移",
      "priority": 90,
      "pickCondition": 1,
      "horizon": false,
      "vertical": true
    },
    {
      "name": "右移",
      "priority": 90,
      "pickCondition": -1,
      "horizon": true,
      "vertical": true
    },
    {
      "name": "黑场",
      "priority": 30,
      "pickCondition": -1,
      "horizon": true,
      "vertical": true
    },
    {
      "name": "白场",
      "priority": 90,
      "pickCondition": 2,
      "horizon": true,
      "vertical": true
    },
    {
      "name": "放大",
      "priority": 70,
      "pickCondition": -1,
      "horizon": true,
      "vertical": true
    },
    {
      "name": "缩小",
      "priority": 70,
      "pickCondition": -1,
      "horizon": true,
      "vertical": true
    },
    {
      "name": "旋转",
      "priority": 0,
      "pickCondition": -1,
      "horizon": true,
      "vertical": true
    }
  ],
  "transitionMaxCount": 2,
  "filterId": "filter_res_13",
  "filterStrength": 0.3,
  "sticker": {},
  "borderId": "hand_account2",
  "specialEffect": [
    {
      "effectId": "sun_flower",
      "effectStart": 0
    },
    {
      "effectId": "colorful_heart",
      "effectStart": -1
    },
    {
      "effectId": "sunshine",
      "effectStart": -1
    }
  ],
  "tail": "honor_vlog"
}