{
    "imports" : [
        "/system_ext/lib64/libhwfilter_qcom.so"
    ],

    "filters" :
    [
        {
            "id" : "ppsource",
            "type" : "ppsource"
        },

        {
            "id" : "encoder",
            "type" : "qcom_filter_jpeg"
        },

        {
            "id" : "HwFaceSR",
            "type" : "HwFaceSR"
        },

        {
            "id" : "ColorEffectCap",
            "type" : "ColorEffectCap",
            "platform" : "qcom"
        },

        {
            "id" : "WatermarkV2",
            "type" : "WatermarkV2"
        },

        {
            "id" : "writer",
            "type" : "filewriter"
        },

        {
            "id" : "thumbnail",
            "type" : "quickthumbnail"
        },

        {
            "id" : "notifier",
            "type" : "thumbnail-notifier"
        },

        {
            "id" : "peek",
            "type" : "peek"
        },

        {
            "id" : "peekMeta",
            "type" : "peek"
        },
        {
            "id" : "HwExifPp",
            "type" : "HwExifPp"
        },
        {
            "id" : "HwGatherPp",
            "type" : "HwGatherPp",
            "jsonname" : "pipeline4rawmfWatermarkV2cap"
        }
    ],

    "connections" :
    [
        {
            "from" :
            {
                "filter" : "ppsource",
                "port" : "out0"
            },

            "to" :
            {
                "filter" : "peek",
                "port" : "in"
            }
        },

        {
            "from" :
            {
                "filter" : "peek",
                "port" : "out"
            },

            "to" :
            {
                "filter" : "HwGatherPp",
                "port" : "inMain"
            }
        },

        {
            "from" :
            {
                "filter" : "HwGatherPp",
                "port" : "OutDestyuv"
            },

            "to" :
            {
                "filter" : "HwFaceSR",
                "port" : "inMain"
            }
        },

        {
            "from" :
            {
                "filter" : "HwFaceSR",
                "port" : "OutDestyuv"
            },


            "to" :
            {
                "filter" : "ColorEffectCap",
                "port" : "inMain"
            }
        },

        {
            "from" :
            {
                "filter" : "ColorEffectCap",
                "port" : "OutDestyuv"
            },

            "to" :
            {
                "filter" : "WatermarkV2",
                "port" : "inMain"
            }
        },

        {
        "from" :
            {
                "filter" : "WatermarkV2",
                "port" : "OutDestyuv"
            },

            "to" :
            {
                "filter" : "HwExifPp",
                "port" : "inMain"
            }
        },
       {
            "from" :
            {
                "filter" : "HwExifPp",
                "port" : "OutDestyuv"
            },
            "to" :
            {
                "filter" : "encoder",
                "port" : "inMain"
            }
        },

        {
        "from" :
            {
                "filter" : "encoder",
                "port" : "jpeg"
            },

            "to" :
            {
                "filter" : "writer",
                "port" : "in"
            }
        },

        {
            "from" :
            {
                "filter" : "peek",
                "port" : "peek0"
            },

            "to" :
            {
                "filter" : "thumbnail",
                "port" : "inMain"
            }
        },

        {
            "from" :
            {
                "filter" : "thumbnail",
                "port" : "outThumbnail"
            },

            "to" :
            {
                "filter" : "notifier",
                "port" : "in"
            }
        },

        {
            "from" :
            {
                "filter" : "ppsource",
                "port" : "out_meta"
            },

            "to" :
            {
                "filter" : "peekMeta",
                "port" : "in"
            }
        },

        {
            "from" :
            {
                "filter" : "peekMeta",
                "port" : "out"
            },

            "to" :
            {
                "filter" : "HwGatherPp",
                "port" : "inMeta"
            }
        },

        {
            "from" :
            {
                "filter" : "HwGatherPp",
                "port" : "OutMeta"
            },

            "to" :
            {
                "filter" : "HwFaceSR",
                "port" : "inMeta"
            }
        },

        {
            "from" :
            {
                "filter" : "HwFaceSR",
                "port" : "OutMeta"
            },

            "to" :
            {
                "filter" : "ColorEffectCap",
                "port" : "inMeta"
            }
        },

        {
            "from" :
            {
                "filter" : "ColorEffectCap",
                "port" : "OutMeta"
            },

            "to" :
            {
                "filter" : "WatermarkV2",
                "port" : "inMeta"
            }
        },

       {
            "from" :
            {
                "filter" : "WatermarkV2",
                "port" : "OutMeta"
            },

            "to" :
            {
                "filter" : "HwExifPp",
                "port" : "inMeta"
            }
        },

        {
            "from" :
            {
                "filter" : "HwExifPp",
                "port" : "OutMeta"
            },
            "to" :
            {
                "filter" : "encoder",
                "port" : "inMeta"
            }
        },

        {
            "from" :
            {
                "filter" : "peekMeta",
                "port" : "peek0"
            },

            "to" :
            {
                "filter" : "thumbnail",
                "port" : "inMeta"
            }
        }
    ]
}

