{
  "beat": [
    0,256,1056,1696,2016,2240,3584,4000,4352,4704,5376,5536,5760,6304,6592,6880,7200,7616,7904,8064,8224,8576,9024,9184,9344,9504,10400,10816,11008,11232,11488,11840,12192,12640,12896,13088,13280,13440,13664,14016,14208,14432,14592,14880,15040,15264,15424,15584,15744,15904,16063,16256,16416,16608,16864,17056,17216,17376,17536,17792,18016,18240,18400,18624,18944,19136,19360,19520,19872,20064,20320,20512,20768,20960,21152,21344,21536,21760,22048,22272,22560,22720,22976,23168,23328,23584,23776,24000,24160,24320,24544,24768,24928,25152,25344,25504,25728,25920,26176,26368,26560,26816,27040,27200,27392,27552,27744,27936,28096,28416,28640,28832,29024,30038
    ],
  "beat_count": 114,
  "downbeat": [
    0,
    1696,
    3584,
    5376,
    7200,
    9024,
    10816,
    12640,
    14432,
    17376,
    19136,
    21152,
    23328,
    25504,
    27392,
    30038
    ],
  "downbeat_count": 16
}