{
  "beat": [
    0,352,512,1024,1280,1440,1632,2048,2528,2784,3008,3392,3616,3840,4096,4608,4832,5152,5472,5760,6080,6240,6400,6912,7328,7808,8192,8416,8800,9120,9312,9632,9952,10112,10624,10880,11040,11328,11488,11776,12096,12544,12960,13280,13696,14048,14464,14656,14880,15104,15456,15680,16256,16448,16928,17408,17760,17920,18080,18496,18720,18944,19232,19392,19712,19872,20160,20320,20480,20768,20960,21248,21696,22144,22432,22720,22880,23296,24000,24288,24512,24704,24960,25280,25568,25760,25952,26208,26496,26944,27104,27328,27520,27680,27936,28128,30038
    ],
  "beat_count": 97,
  "downbeat": [
    0,
    1024,
    3616,
    4832,
    6400,
    8416,
    10752,
    12096,
    13696,
    15680,
    17408,
    19232,
    20480,
    22720,
    24000,
    25760,
    27680,
    29952,
    30038
    ],
  "downbeat_count": 19
}