{
    "imports" : [
        "/system_ext/lib64/libhwfilter_qcom.so"
    ],

    "filters" :
    [
        {
            "id" : "ppsource",
            "type" : "ppsource"
        },

        {
            "id" : "encoder",
            "type" : "qcom_filter_jpeg"
        },

        {
            "id" : "RemosaicAdapter",
            "type" : "RemosaicAdapter"
         },

        {
            "id" : "SuperResolution",
            "type" : "SuperResolution"
         },

        {
            "id" : "ColorEffectCap",
            "type" : "ColorEffectCap",
            "platform" : "qcom"
        },

        {
            "id" : "Davinci",
            "type" : "Davinci"
        },

        {
            "id" : "writer",
            "type" : "filewriter"
        },

        {
            "id" : "thumbnail",
            "type" : "quickthumbnail"
        },

        {
            "id" : "notifier",
            "type" : "thumbnail-notifier"
        },

        {
            "id" : "forkCapture",
            "type" : "fork"
        },

        {
            "id" : "peekMeta",
            "type" : "peek"
        },
        {
            "id" : "HwExifPp",
            "type" : "HwExifPp"
        },
        {
            "id" : "HwGatherPp",
            "type" : "HwGatherPp",
            "jsonname" : "pipeline4capeffect"
        }
    ],

    "connections" :
    [
        {
            "from" :
            {
                "filter" : "ppsource",
                "port" : "out0"
            },

            "to" :
            {
                "filter" : "forkCapture",
                "port" : "in"
            }
        },

        {
            "from" :
            {
                "filter" : "forkCapture",
                "port" : "out0"
            },

            "to" :
            {
                "filter" : "HwGatherPp",
                "port" : "inMain"
            }
        },

        {
            "from" :
            {
                "filter" : "HwGatherPp",
                "port" : "OutDestyuv"
            },

            "to" :
            {
                "filter" : "RemosaicAdapter",
                "port" : "inMain"
            }
        },

        {
            "from" :
            {
                "filter" : "RemosaicAdapter",
                "port" : "OutDestyuv"
            },

            "to" :
            {
                "filter" : "ColorEffectCap",
                "port" : "inMain"
            }
        },

        {
            "from" :
            {
                "filter" : "ColorEffectCap",
                "port" : "OutDestyuv"
            },

            "to" :
            {
                "filter" : "Davinci",
                "port" : "inMain"
            }
        },

        {
            "from" :
            {
                "filter" : "Davinci",
                "port" : "OutDestyuv"
            },

            "to" :
            {
                "filter" : "SuperResolution",
                "port" : "inMain"
            }
        },

        {
        "from" :
            {
                "filter" : "SuperResolution",
                "port" : "OutDestyuv"
            },
            "to" :
            {
                "filter" : "HwExifPp",
                "port" : "inMain"
            }
        },

       {
            "from" :
            {
                "filter" : "HwExifPp",
                "port" : "OutDestyuv"
            },
            "to" :
            {
                "filter" : "encoder",
                "port" : "inMain"
            }
        },

        {
            "from" :
            {
                "filter" : "encoder",
                "port" : "jpeg"
            },

            "to" :
            {
                "filter" : "writer",
                "port" : "in"
            }
        },

        {
            "from" :
            {
                "filter" : "forkCapture",
                "port" : "out1"
            },

            "to" :
            {
                "filter" : "thumbnail",
                "port" : "inMain"
            }
        },

        {
            "from" :
            {
                "filter" : "thumbnail",
                "port" : "outThumbnail"
            },

            "to" :
            {
                "filter" : "notifier",
                "port" : "in"
            }
        },

        {
            "from" :
            {
                "filter" : "ppsource",
                "port" : "out_meta"
            },

            "to" :
            {
                "filter" : "peekMeta",
                "port" : "in"
            }
        },

        {
            "from" :
            {
                "filter" : "peekMeta",
                "port" : "out"
            },

            "to" :
            {
                "filter" : "HwGatherPp",
                "port" : "inMeta"
            }
        },
        {
            "from" :
            {
                "filter" : "HwGatherPp",
                "port" : "OutMeta"
            },

            "to" :
            {
                "filter" : "RemosaicAdapter",
                "port" : "inMeta"
            }
        },

        {
            "from" :
            {
                "filter" : "RemosaicAdapter",
                "port" : "OutMeta"
            },

            "to" :
            {
                "filter" : "ColorEffectCap",
                "port" : "inMeta"
            }
        },

        {
            "from" :
            {
                "filter" : "ColorEffectCap",
                "port" : "OutMeta"
            },

            "to" :
            {
                "filter" : "Davinci",
                "port" : "inMeta"
            }
        },

        {
            "from" :
            {
                "filter" : "Davinci",
                "port" : "OutMeta"
            },

            "to" :
            {
                "filter" : "SuperResolution",
                "port" : "inMeta"
            }
        },

       {
            "from" :
            {
                "filter" : "SuperResolution",
                "port" : "OutMeta"
            },
            "to" :
            {
                "filter" : "HwExifPp",
                "port" : "inMeta"
            }
        },

        {
            "from" :
            {
                "filter" : "HwExifPp",
                "port" : "OutMeta"
            },
            "to" :
            {
                "filter" : "encoder",
                "port" : "inMeta"
            }
        },

        {
            "from" :
            {
                "filter" : "peekMeta",
                "port" : "peek0"
            },

            "to" :
            {
                "filter" : "thumbnail",
                "port" : "inMeta"
            }
        }
    ]
}

