{
    "id": "visited",
    "title_id": "story_template_title_dual_view",
    "music": "Resource/music/out.aac",
	"resolution": [2520, 1080],
    "segments": [
        {
            "camera_id": 0,
            "duration": 4.75,
            "shot_mode": "dual_video",
            "twins_video_status": "NORMAL",
            "demo_offset": [0, 4.75],
            "audio_offset": 0,
            "algo_scripts": {
                "operation_mode": "panning",
                "operation_param": "50,50,50,50"
            },
            "camera_effects": {
                "beauty": "0"
            }
        },
        {
            "camera_id": 0,
            "duration": 5.7,
            "shot_mode": "dual_video",
            "twins_video_status": "NORMAL",
            "demo_offset": [3.85, 9.55],
            "audio_offset": 3.85,
            "algo_scripts": {
                "operation_mode": "panning",
                "operation_param": "50,50,50,50"
            },
            "camera_effects": {
                "beauty": "0"
            }
        },
        {
            "camera_id": 0,
            "duration": 4.95,
            "shot_mode": "dual_video",
            "twins_video_status": "NORMAL",
            "demo_offset": [8.65, 13.6],
            "audio_offset": 8.65,
            "algo_scripts": {
                "operation_mode": "panning",
                "operation_param": "50,50,50,50"
            },
            "camera_effects": {
                "beauty": "0"
            }
        }
    ]
}