﻿{
  "type": "rhythm",
  "duration": 20000,
  "name": "Drums",
  "id": "Rhythm_20_1",
  "separationStep": 1150,
  "separationMinDuration": 4000,
  "separationMaxDuration": 8000,
  "transitions": [
    {
      "name": "叠化",
      "priority": 10,
      "pickCondition": -1,
      "horizon": true,
      "vertical": true
    },
    {
      "name": "模糊",
      "priority": 0,
      "pickCondition": -1,
      "horizon": true,
      "vertical": true
    },
    {
      "name": "融化",
      "priority": 0,
      "pickCondition": -1,
      "horizon": true,
      "vertical": true
    },
    {
      "name": "上移",
      "priority": 0,
      "pickCondition": -1,
      "horizon": true,
      "vertical": true
    },
    {
      "name": "下移",
      "priority": 0,
      "pickCondition": -1,
      "horizon": true,
      "vertical": true
    },
    {
      "name": "左移",
      "priority": 70,
      "pickCondition": -1,
      "horizon": true,
      "vertical": true
    },
    {
      "name": "右移",
      "priority": 70,
      "pickCondition": -1,
      "horizon": true,
      "vertical": true
    },
    {
      "name": "黑场",
      "priority": 70,
      "pickCondition": -1,
      "horizon": true,
      "vertical": true
    },
    {
      "name": "白场",
      "priority": 50,
      "pickCondition": -1,
      "horizon": true,
      "vertical": true
    },
    {
      "name": "放大",
      "priority": 90,
      "pickCondition": -1,
      "horizon": true,
      "vertical": true
    },
    {
      "name": "缩小",
      "priority": 90,
      "pickCondition": 2,
      "horizon": true,
      "vertical": true
    },
    {
      "name": "旋转",
      "priority": 90,
      "pickCondition": 1,
      "horizon": true,
      "vertical": true
    }
  ],
  "transitionMaxCount": 3,
  "filterId": "filter_res_19",
  "filterStrength": 0.3,
  "sticker": {
    "id": "never",
    "scaleHorizon": 0.4,
    "scaleVertical": 0.8,
    "locationHorizonX": 0,
    "locationHorizonY": 0,
    "locationVerticalX": 0,
    "locationVerticalY": 0,
    "beginTime": 0
  },
  "borderId": "",
  "specialEffect": [
    {
      "effectId": "burst",
      "effectStart": 0
    },
    {
      "effectId": "graphics",
      "effectStart": -1
    },
    {
      "effectId": "graphics",
      "effectStart": -1
    }
  ],
  "tail": "honor_vlog"
}