{
  "Attributes": [
    {
      "Name": "LowCapacityCPUs",
      "Controller": "cpuset",
      "File": "background/cpus"
    },
    {
      "Name": "HighCapacityCPUs",
      "Controller": "cpuset",
      "File": "foreground/cpus"
    },
    {
      "Name": "MaxCapacityCPUs",
      "Controller": "cpuset",
      "File": "top-app/cpus"
    },
    {
      "Name": "MemStats",
      "Controller": "memory",
      "File": "memory.stat"
    },
    {
      "Name": "MemLimit",
      "Controller": "memory",
      "File": "memory.limit_in_bytes",
      "FileV2": "memory.max"
    },
    {
      "Name": "MemSoftLimit",
      "Controller": "memory",
      "File": "memory.soft_limit_in_bytes",
      "FileV2": "memory.low"
    },
    {
      "Name": "MemSwappiness",
      "Controller": "memory",
      "File": "memory.swappiness"
    },
    {
      "Name": "MemUsage",
      "Controller": "memory",
      "File": "memory.usage_in_bytes"
    },
    {
      "Name": "MemAndSwapUsage",
      "Controller": "memory",
      "File": "memory.memsw.usage_in_bytes"
    },
    {
      "Name": "MemPressureLevel",
      "Controller": "memory",
      "File": "memory.pressure_level"
    },
    {
      "Name": "MemCgroupEventControl",
      "Controller": "memory",
      "File": "cgroup.event_control"
    },
    {
      "Name": "UClampMin",
      "Controller": "cpu",
      "File": "cpu.uclamp.min"
    },
    {
      "Name": "UClampMax",
      "Controller": "cpu",
      "File": "cpu.uclamp.max"
    },
    {
      "Name": "UClampLatencySensitive",
      "Controller": "cpu",
      "File": "cpu.uclamp.latency_sensitive"
    },
    {
      "Name": "FreezerState",
      "Controller": "freezer",
      "File": "cgroup.freeze"
    }
  ],

  "Profiles": [
    {
      "Name": "HighEnergySaving",
      "Actions": [
        {
          "Name": "JoinCgroup",
          "Params":
          {
            "Controller": "cpu",
            "Path": "background"
          }
        }
      ]
    },
    {
      "Name": "Frozen",
      "Actions": [
        {
          "Name": "SetAttribute",
          "Params":
          {
            "Name": "FreezerState",
            "Value": "1"
          }
        }
      ]
    },
    {
      "Name": "Unfrozen",
      "Actions": [
        {
          "Name": "SetAttribute",
          "Params":
          {
            "Name": "FreezerState",
            "Value": "0"
          }
        }
      ]
    },
    {
      "Name": "NormalPerformance",
      "Actions": [
        {
          "Name": "JoinCgroup",
          "Params":
          {
            "Controller": "cpu",
            "Path": "system"
          }
        }
      ]
    },
    {
      "Name": "ServicePerformance",
      "Actions": [
        {
          "Name": "JoinCgroup",
          "Params":
          {
            "Controller": "cpu",
            "Path": "system-background"
          }
        }
      ]
    },
    {
      "Name": "HighPerformance",
      "Actions": [
        {
          "Name": "JoinCgroup",
          "Params":
          {
            "Controller": "cpu",
            "Path": "foreground"
          }
        }
      ]
    },
    {
      "Name": "MaxPerformance",
      "Actions": [
        {
          "Name": "JoinCgroup",
          "Params":
          {
            "Controller": "cpu",
            "Path": "top-app"
          }
        }
      ]
    },
    {
      "Name": "RealtimePerformance",
      "Actions": [
        {
          "Name": "JoinCgroup",
          "Params":
          {
            "Controller": "cpu",
            "Path": "rt"
          }
        }
      ]
    },
    {
      "Name": "CameraServicePerformance",
      "Actions": [
        {
          "Name": "JoinCgroup",
          "Params":
          {
            "Controller": "cpu",
            "Path": "camera-daemon"
          }
        }
      ]
    },
    {
      "Name": "NNApiHALPerformance",
      "Actions": [
        {
          "Name": "JoinCgroup",
          "Params":
          {
            "Controller": "cpu",
            "Path": "nnapi-hal"
          }
        }
      ]
    },
    {
      "Name": "Dex2oatPerformance",
      "Actions": [
        {
          "Name": "JoinCgroup",
          "Params":
          {
            "Controller": "cpu",
            "Path": "dex2oat"
          }
        }
      ]
    },
    {
      "Name": "CpuPolicySpread",
      "Actions": [
        {
          "Name": "SetAttribute",
          "Params":
          {
            "Name": "UClampLatencySensitive",
            "Value": "1"
          }
        }
      ]
    },
    {
      "Name": "CpuPolicyPack",
      "Actions": [
        {
          "Name": "SetAttribute",
          "Params":
          {
            "Name": "UClampLatencySensitive",
            "Value": "0"
          }
        }
      ]
    },

    {
      "Name": "VrKernelCapacity",
      "Actions": [
        {
          "Name": "JoinCgroup",
          "Params":
          {
            "Controller": "cpuset",
            "Path": ""
          }
        }
      ]
    },
    {
      "Name": "VrServiceCapacityLow",
      "Actions": [
        {
          "Name": "JoinCgroup",
          "Params":
          {
            "Controller": "cpuset",
            "Path": "system/background"
          }
        }
      ]
    },
    {
      "Name": "VrServiceCapacityNormal",
      "Actions": [
        {
          "Name": "JoinCgroup",
          "Params":
          {
            "Controller": "cpuset",
            "Path": "system"
          }
        }
      ]
    },
    {
      "Name": "VrServiceCapacityHigh",
      "Actions": [
        {
          "Name": "JoinCgroup",
          "Params":
          {
            "Controller": "cpuset",
            "Path": "system/performance"
          }
        }
      ]
    },
    {
      "Name": "VrProcessCapacityLow",
      "Actions": [
        {
          "Name": "JoinCgroup",
          "Params":
          {
            "Controller": "cpuset",
            "Path": "application/background"
          }
        }
      ]
    },
    {
      "Name": "VrProcessCapacityNormal",
      "Actions": [
        {
          "Name": "JoinCgroup",
          "Params":
          {
            "Controller": "cpuset",
            "Path": "application"
          }
        }
      ]
    },
    {
      "Name": "VrProcessCapacityHigh",
      "Actions": [
        {
          "Name": "JoinCgroup",
          "Params":
          {
            "Controller": "cpuset",
            "Path": "application/performance"
          }
        }
      ]
    },

    {
      "Name": "ProcessCapacityLow",
      "Actions": [
        {
          "Name": "JoinCgroup",
          "Params":
          {
            "Controller": "cpuset",
            "Path": "background"
          }
        }
      ]
    },
    {
      "Name": "ProcessCapacityNormal",
      "Actions": [
        {
          "Name": "JoinCgroup",
          "Params":
          {
            "Controller": "cpuset",
            "Path": ""
          }
        }
      ]
    },
    {
      "Name": "ProcessCapacityHigh",
      "Actions": [
        {
          "Name": "JoinCgroup",
          "Params":
          {
            "Controller": "cpuset",
            "Path": "foreground"
          }
        }
      ]
    },
    {
      "Name": "ProcessCapacityMax",
      "Actions": [
        {
          "Name": "JoinCgroup",
          "Params":
          {
            "Controller": "cpuset",
            "Path": "top-app"
          }
        }
      ]
    },

    {
      "Name": "ServiceCapacityLow",
      "Actions": [
        {
          "Name": "JoinCgroup",
          "Params":
          {
            "Controller": "cpuset",
            "Path": "system-background"
          }
        }
      ]
    },
    {
      "Name": "ServiceCapacityRestricted",
      "Actions": [
        {
          "Name": "JoinCgroup",
          "Params":
          {
            "Controller": "cpuset",
            "Path": "restricted"
          }
        }
      ]
    },

    {
      "Name": "CameraServiceCapacity",
      "Actions": [
        {
          "Name": "JoinCgroup",
          "Params":
          {
            "Controller": "cpuset",
            "Path": "camera-daemon"
          }
        }
      ]
    },
    {
      "Name": "TimerSlackHigh",
      "Actions": [
        {
          "Name": "SetTimerSlack",
          "Params":
          {
            "Slack": "40000000"
          }
        }
      ]
    },
    {
      "Name": "TimerSlackNormal",
      "Actions": [
        {
          "Name": "SetTimerSlack",
          "Params":
          {
            "Slack": "50000"
          }
        }
      ]
    },

    {
      "Name": "HWCMainPolicy_CPUSET",
      "Actions": [
        {
          "Name": "JoinCgroup",
          "Params":
          {
            "Controller": "cpuset",
            "Path": "graphics"
          }
        }
      ]
    },
    {
      "Name": "HWCMainPolicy_CPU",
      "Actions": [
        {
          "Name": "JoinCgroup",
          "Params":
          {
            "Controller": "cpu",
            "Path": "graphics"
          }
        }
      ]
    },
    {
      "Name": "SFMainPolicy_CPUSET",
      "Actions": [
        {
          "Name": "JoinCgroup",
          "Params":
          {
            "Controller": "cpuset",
            "Path": "graphics"
          }
        }
      ]
    },
    {
      "Name": "SFMainPolicy_CPU",
      "Actions": [
        {
          "Name": "JoinCgroup",
          "Params":
          {
            "Controller": "cpu",
            "Path": "graphics"
          }
        }
      ]
    },
    {
      "Name": "SFRenderEnginePolicy_CPUSET",
      "Actions": [
        {
          "Name": "JoinCgroup",
          "Params":
          {
            "Controller": "cpuset",
            "Path": "graphics"
          }
        }
      ]
    },
    {
      "Name": "SFRenderEnginePolicy_CPU",
      "Actions": [
        {
          "Name": "JoinCgroup",
          "Params":
          {
            "Controller": "cpu",
            "Path": "graphics"
          }
        }
      ]
    },
    {
      "Name": "HighForegroundPolicy_CPUSET",
      "Actions": [
        {
          "Name": "JoinCgroup",
          "Params":
          {
            "Controller": "cpuset",
            "Path": "high-fg"
          }
        }
      ]
    },
    {
      "Name": "HighForegroundPolicy_CPU",
      "Actions": [
        {
          "Name": "JoinCgroup",
          "Params":
          {
            "Controller": "cpu",
            "Path": "foreground"
          }
        }
      ]
    },
    {
      "Name": "LowForegroundPolicy_CPUSET",
      "Actions": [
        {
          "Name": "JoinCgroup",
          "Params":
          {
            "Controller": "cpuset",
            "Path": "low-fg"
          }
        }
      ]
    },
    {
      "Name": "LowForegroundPolicy_CPU",
      "Actions": [
        {
          "Name": "JoinCgroup",
          "Params":
          {
            "Controller": "cpu",
            "Path": "foreground"
          }
        }
      ]
    },
    {
      "Name": "AudioGroupPolicy_CPUSET",
      "Actions": [
        {
          "Name": "JoinCgroup",
          "Params":
          {
            "Controller": "cpuset",
            "Path": "audio"
          }
        }
      ]
    },
    {
      "Name": "AudioGroupPolicy_CPU",
      "Actions": [
        {
          "Name": "JoinCgroup",
          "Params":
          {
            "Controller": "cpu",
            "Path": "audio"
          }
        }
      ]
    },
    {
      "Name": "PerfBoost",
      "Actions": [
        {
          "Name": "SetClamps",
          "Params":
          {
            "Boost": "50%",
            "Clamp": "0"
          }
        }
      ]
    },
    {
      "Name": "PerfClamp",
      "Actions": [
        {
          "Name": "SetClamps",
          "Params":
          {
            "Boost": "0",
            "Clamp": "30%"
          }
        }
      ]
    },

    {
      "Name": "LowMemoryUsage",
      "Actions": [
        {
          "Name": "SetAttribute",
          "Params":
          {
            "Name": "MemSoftLimit",
            "Value": "16MB"
          }
        },
        {
          "Name": "SetAttribute",
          "Params":
          {
            "Name": "MemSwappiness",
            "Value": "150"

          }
        }
      ]
    },
    {
      "Name": "HighMemoryUsage",
      "Actions": [
        {
          "Name": "SetAttribute",
          "Params":
          {
            "Name": "MemSoftLimit",
            "Value": "512MB"
          }
        },
        {
          "Name": "SetAttribute",
          "Params":
          {
            "Name": "MemSwappiness",
            "Value": "100"
          }
        }
      ]
    },
    {
      "Name": "SystemMemoryProcess",
      "Actions": [
        {
          "Name": "JoinCgroup",
          "Params":
          {
            "Controller": "memory",
            "Path": "system"
          }
        }
      ]
    },
    {
      "Name": "FreezerThawed",
      "Actions": [
        {
          "Name": "SetAttribute",
          "Params":
          {
            "Name": "FreezerState",
            "Value": "THAWED"
          }
        }
      ]
    },
    {
      "Name": "FreezerFrozen",
      "Actions": [
        {
          "Name": "SetAttribute",
          "Params":
          {
            "Name": "FreezerState",
            "Value": "FROZEN"
          }
        }
      ]
    },
    {
      "Name": "KbgEnergySaving",
      "Actions" : [
        {
          "Name" : "JoinCgroup",
          "Params" :
          {
            "Controller": "schedtune",
            "Path": "key-background"
          }
        }
      ]
    },
    {
      "Name": "ProcessCapacityKbg",
      "Actions" : [
        {
          "Name" : "JoinCgroup",
          "Params" :
          {
            "Controller": "cpuset",
            "Path": "key-background"
          }
        }
      ]
    },
    {
      "Name": "BoostPerformance",
      "Actions" : [
        {
          "Name" : "JoinCgroup",
          "Params" :
          {
            "Controller": "cpu",
            "Path": "boost"
          }
        }
      ]
    },
    {
      "Name": "ProcessCapacityBoost",
      "Actions" : [
        {
          "Name" : "JoinCgroup",
          "Params" :
          {
            "Controller": "cpuset",
            "Path": "boost"
          }
        }
      ]
    },
    {
      "Name": "VipPerformance",
      "Actions" : [
        {
          "Name" : "JoinCgroup",
          "Params" :
          {
            "Controller": "cpu",
            "Path": "vip"
          }
        }
      ]
    },
    {
      "Name": "ProcessCapacityVip",
      "Actions" : [
        {
          "Name" : "JoinCgroup",
          "Params" :
          {
            "Controller": "cpuset",
            "Path": "vip"
          }
        }
      ]
    },
    {
      "Name": "BlkioBg",
      "Actions" : [
        {
          "Name" : "JoinCgroup",
          "Params" :
          {
            "Controller": "blkio",
            "Path": "background"
          }
        }
      ]
    },
    {
      "Name": "BlkioFg",
      "Actions" : [
        {
          "Name" : "JoinCgroup",
          "Params" :
          {
            "Controller": "blkio",
            "Path": "foreground"
          }
        }
      ]
    },
    {
      "Name": "BlkioKbg",
      "Actions" : [
        {
          "Name" : "JoinCgroup",
          "Params" :
          {
            "Controller": "blkio",
            "Path": "key-background"
          }
        }
      ]
    },
    {
      "Name": "BlkioSbg",
      "Actions" : [
        {
          "Name" : "JoinCgroup",
          "Params" :
          {
            "Controller": "blkio",
            "Path": "system-background"
          }
        }
      ]
    },
    {
      "Name": "BlkioTapp",
      "Actions" : [
        {
          "Name" : "JoinCgroup",
          "Params" :
          {
            "Controller": "blkio",
            "Path": "top-app"
          }
        }
      ]
    },
    {
      "Name": "CRTCMainPolicy_CPUSET",
      "Actions": [
        {
          "Name": "JoinCgroup",
          "Params":
          {
            "Controller": "cpuset",
            "Path": "graphics"
          }
        }
      ]
    },
    {
      "Name": "CRTCMainPolicy_CPU",
      "Actions": [
        {
          "Name": "JoinCgroup",
          "Params":
          {
            "Controller": "cpu",
            "Path": "graphics"
          }
        }
      ]
    }
  ],

  "AggregateProfiles": [
    {
      "Name": "SCHED_SP_DEFAULT",
      "Profiles": [ "TimerSlackNormal", "BlkioSbg" ]
    },
    {
      "Name": "SCHED_SP_BACKGROUND",
      "Profiles": [ "HighEnergySaving", "BlkioBg", "TimerSlackHigh"]
    },
    {
      "Name": "SCHED_SP_FOREGROUND",
      "Profiles": [ "HighPerformance", "BlkioFg", "TimerSlackNormal" ]
    },
    {
      "Name": "SCHED_SP_TOP_APP",
      "Profiles": [ "MaxPerformance", "BlkioTapp", "TimerSlackNormal" ]
    },
    {
      "Name": "SCHED_SP_SYSTEM",
      "Profiles": [ "ServicePerformance", "BlkioSbg", "TimerSlackNormal" ]
    },
    {
      "Name": "SCHED_SP_COMPUTE",
      "Profiles": [ "HighPerformance", "ProcessCapacityHigh", "BlkioSbg", "TimerSlackNormal" ]
    },
    {
      "Name": "SCHED_SP_RT_APP",
      "Profiles": [ "RealtimePerformance", "BlkioTapp", "TimerSlackNormal" ]
    },
    {
      "Name": "CPUSET_SP_DEFAULT",
      "Profiles": [ "TimerSlackNormal", "BlkioSbg" ]
    },
    {
      "Name": "CPUSET_SP_BACKGROUND",
      "Profiles": [ "HighEnergySaving", "ProcessCapacityLow", "BlkioBg", "TimerSlackHigh" ]
    },
    {
      "Name": "CPUSET_SP_FOREGROUND",
      "Profiles": [ "HighPerformance", "ProcessCapacityHigh", "BlkioFg", "TimerSlackNormal" ]
    },
    {
      "Name": "CPUSET_SP_TOP_APP",
      "Profiles": [ "MaxPerformance", "ProcessCapacityMax", "BlkioTapp", "TimerSlackNormal" ]
    },
    {
      "Name": "CPUSET_SP_SYSTEM",
      "Profiles": [ "ServiceCapacityLow", "BlkioSbg", "TimerSlackNormal" ]
    },
    {
      "Name": "CPUSET_SP_RESTRICTED",
      "Profiles": [ "ServiceCapacityRestricted", "BlkioKbg", "TimerSlackNormal" ]
    },
    {
      "Name": "CPUSET_SP_KEY_BACKGROUND",
      "Profiles": [ "KbgEnergySaving", "ProcessCapacityKbg", "BlkioKbg", "TimerSlackNormal" ]
    },
    {
      "Name": "CPUSET_SP_BOOST",
      "Profiles": [ "BoostPerformance", "ProcessCapacityBoost", "BlkioTapp", "TimerSlackNormal" ]
    },
    {
      "Name": "CPUSET_SP_VIP",
      "Profiles": [ "VipPerformance", "ProcessCapacityVip", "BlkioTapp", "TimerSlackNormal" ]
    },
    {
      "Name": "CPUSET_SP_HIGH_FG",
      "Profiles": [ "HighForegroundPolicy_CPUSET", "HighForegroundPolicy_CPU", "BlkioFg", "TimerSlackNormal" ]
    },
    {
      "Name": "CPUSET_SP_LOW_FG",
      "Profiles": [ "LowForegroundPolicy_CPUSET", "LowForegroundPolicy_CPU", "BlkioFg", "TimerSlackNormal" ]
    },
    {
      "Name": "HWCMainPolicy",
      "Profiles": [ "HWCMainPolicy_CPUSET", "HWCMainPolicy_CPU", "TimerSlackNormal" ]
    },
    {
      "Name": "SFMainPolicy",
      "Profiles": [ "SFMainPolicy_CPUSET", "SFMainPolicy_CPU", "TimerSlackNormal" ]
    },
    {
      "Name": "SFRenderEnginePolicy",
      "Profiles": [ "SFRenderEnginePolicy_CPUSET", "SFRenderEnginePolicy_CPU", "TimerSlackNormal" ]
    },
    {
      "Name": "AudioGroupPolicy",
      "Profiles": [ "AudioGroupPolicy_CPUSET", "AudioGroupPolicy_CPU", "TimerSlackNormal" ]
    },
        {
      "Name": "AudioDefaultPolicy",
      "Profiles": [ "HighPerformance", "ProcessCapacityHigh", "TimerSlackNormal" ]
    },
    {
      "Name": "CRTCMainPolicy",
      "Profiles": [ "CRTCMainPolicy_CPUSET", "CRTCMainPolicy_CPU", "TimerSlackNormal" ]
    },
    {
      "Name": "Dex2OatBootComplete",
      "Profiles": [ "Dex2oatPerformance", "BlkioFg", "TimerSlackHigh" ]
    },
    {
      "Name": "Dex2OatBackground",
      "Profiles": [ "Dex2OatBootComplete" ]
    },
    {
      "Name": "OtaProfiles",
      "Profiles": [ "ServiceCapacityLow", "BlkioSbg", "HighEnergySaving" ]
    }
  ]
}
