﻿{
    "id": "hntemplate_rhythm",
    "version": 100000,
    "name": "节奏",
    "duration": 12800,
    "timeCreated": 1587956099851,
    "timeModified": 1588045904884,
    "preview": "preview/preview.jpg",
    "previewVideo": "preview/previewVideo.mp4",
    "canvas_config": {
        "ratio": "1080:2520",
        "width": 1080,
        "height": 2520
    },
    "editTracks": [
        {
            "id": "1vt",
            "type": "video",
            "editSegments": [
                {
                    "id": "1vt1vs",
                    "timeRangeInSource": {
                        "start": 0,
                        "duration": 2500
                    },
                    "timeRangeInTarget": {
                        "start": 0,
                        "duration": 2500
                    },
                    "playSpeed": 1.0,
                    "mirror": false,
                    "reverse": false,
                    "volume": 0,
                    "sizeCut": {
                        "scale": {
                            "x": 1,
                            "y": 1
                        },
                        "rotation": 0,
                        "transform": {
                            "x": 0,
                            "y": 0
                        },
                        "flip": {
                            "horizontal": false,
                            "vertical": false
                        },
                        "alpha": 1
                    },
                    "mainMaterialId": "1v_material_id",
                    "attachedExtraMaterialRefs": ["1trs_material_id"],
                    "render_index": 1,
                    "attachInfo": {
                        "videoId": "",
                        "offset": 0
                    }
                },
                {
                    "id": "1vt2vs",
                    "timeRangeInSource": {
                        "start": 0,
                        "duration": 3500
                    },
                    "timeRangeInTarget": {
                        "start": 2000,
                        "duration": 3500
                    },
                    "playSpeed": 1.0,
                    "mirror": false,
                    "reverse": false,
                    "volume": 0,
                    "sizeCut": {
                        "scale": {
                            "x": 1,
                            "y": 1
                        },
                        "rotation": 0,
                        "transform": {
                            "x": 0,
                            "y": 0
                        },
                        "flip": {
                            "horizontal": false,
                            "vertical": false
                        },
                        "alpha": 1
                    },
                    "mainMaterialId": "2v_material_id",
                    "attachedExtraMaterialRefs": ["1trs_material_id"],
                    "render_index": 1,
                    "attachInfo": {
                        "videoId": "",
                        "offset": 0
                    }
                },
                {
                    "id": "1vt3vs",
                    "timeRangeInSource": {
                        "start": 0,
                        "duration": 2000
                    },
                    "timeRangeInTarget": {
                        "start": 5000,
                        "duration": 2000
                    },
                    "playSpeed": 1.0,
                    "mirror": false,
                    "reverse": false,
                    "volume": 0,
                    "sizeCut": {
                        "scale": {
                            "x": 1,
                            "y": 1
                        },
                        "rotation": 0,
                        "transform": {
                            "x": 0,
                            "y": 0
                        },
                        "flip": {
                            "horizontal": false,
                            "vertical": false
                        },
                        "alpha": 1
                    },
                    "mainMaterialId": "3v_material_id",
                    "attachedExtraMaterialRefs": ["1trs_material_id"],
                    "render_index": 1,
                    "attachInfo": {
                        "videoId": "",
                        "offset": 0
                    }
                },
                {
                    "id": "1vt4vs",
                    "timeRangeInSource": {
                        "start": 0,
                        "duration": 4500
                    },
                    "timeRangeInTarget": {
                        "start": 6500,
                        "duration": 4500
                    },
                    "playSpeed": 1.0,
                    "mirror": false,
                    "reverse": false,
                    "volume": 0,
                    "sizeCut": {
                        "scale": {
                            "x": 1,
                            "y": 1
                        },
                        "rotation": 0,
                        "transform": {
                            "x": 0,
                            "y": 0
                        },
                        "flip": {
                            "horizontal": false,
                            "vertical": false
                        },
                        "alpha": 1
                    },
                    "mainMaterialId": "4v_material_id",
                    "attachedExtraMaterialRefs": ["1trs_material_id"],
                    "render_index": 1,
                    "attachInfo": {
                        "videoId": "",
                        "offset": 0
                    }
                },
                {
                    "id": "1vt5vs",
                    "timeRangeInSource": {
                        "start": 0,
                        "duration": 1500
                    },
                    "timeRangeInTarget": {
                        "start": 10500,
                        "duration": 1500
                    },
                    "playSpeed": 1.0,
                    "mirror": false,
                    "reverse": false,
                    "volume": 0,
                    "sizeCut": {
                        "scale": {
                            "x": 1,
                            "y": 1
                        },
                        "rotation": 0,
                        "transform": {
                            "x": 0,
                            "y": 0
                        },
                        "flip": {
                            "horizontal": false,
                            "vertical": false
                        },
                        "alpha": 1
                    },
                    "mainMaterialId": "5v_material_id",
                    "attachedExtraMaterialRefs": [],
                    "render_index": 1,
                    "attachInfo": {
                        "videoId": "",
                        "offset": 0
                    }
                },
				{
                    "id": "1vmt1vms",
                    "timeRangeInSource": {
                        "start": 0,
                        "duration": 12800
                    },
                    "timeRangeInTarget": {
                        "start": 0,
                        "duration": 12800
                    },
                    "playSpeed": 1.0,
                    "mirror": false,
                    "reverse": false,
                    "volume": 0,
                    "sizeCut": {
                        "scale": {
                            "x": 1,
                            "y": 1
                        },
                        "rotation": 0,
                        "transform": {
                            "x": 0,
                            "y": 0
                        },
                        "flip": {
                            "horizontal": false,
                            "vertical": false
                        },
                        "alpha": 1
                    },
                    "mainMaterialId": "13v_material_id",
                    "attachedExtraMaterialRefs": [],
                    "render_index": -1,
                    "attachInfo": {
                        "videoId": "",
                        "offset": 0
                    }
                }
            ],
            "flag": 0
        },
        {
            "id": "1at",
            "type": "audio",
            "editSegments": [
                {
                    "id": "1at1as",
                    "timeRangeInSource": {
                        "start": 0,
                        "duration": 12800
                    },
                    "timeRangeInTarget": {
                        "start": 0,
                        "duration": 12800
                    },
                    "playSpeed": 1.0,
                    "mirror": false,
                    "reverse": false,
                    "volume": 1,
                    "sizeCut": {
                        "scale": {
                            "x": 1,
                            "y": 1
                        },
                        "rotation": 0,
                        "transform": {
                            "x": 0,
                            "y": 0
                        },
                        "flip": {
                            "horizontal": false,
                            "vertical": false
                        },
                        "alpha": 1
                    },
                    "mainMaterialId": "1a_material_id",
                    "attachedExtraMaterialRefs": [],
                    "render_index": 1,
                    "attachInfo": {
                        "videoId": "",
                        "offset": 0
                    }
                }
            ],
            "flag": 0
        },
        {
            "id": "1mk",
            "type": "mask",
            "editSegments": [
                {
                    "id": "1mt1ms",
                    "timeRangeInSource": {
                        "start": 0,
                        "duration": 0
                    },
                    "timeRangeInTarget": {
                        "start": 12000,
                        "duration": 800
                    },
                    "playSpeed": 1.0,
                    "mirror": false,
                    "reverse": false,
                    "volume": 0,
                    "sizeCut": {
                        "scale": {
                            "x": 1,
                            "y": 1
                        },
                        "rotation": 0,
                        "transform": {
                            "x": 0,
                            "y": 0
                        },
                        "flip": {
                            "horizontal": false,
                            "vertical": false
                        },
                        "alpha": 1
                    },
                    "mainMaterialId": "color_fading_black",
                    "attachedExtraMaterialRefs": [],
                    "render_index": 1,
                    "attachInfo": {
                        "videoId": "1v",
                        "offset": 0
                    }
                }
            ],
            "flag": 0
        }
    ],
    "editMaterials": {
        "videos": [
            {
                "id": "1v_material_id",
                "type": "video",
                "duration": 0,
                "path": null,
                "width": 0,
                "height": 0,
                "category_name": null,
                "rotation": 0.0
            },
            {
                "id": "2v_material_id",
                "type": "video",
                "duration": 0,
                "path": null,
                "width": 0,
                "height": 0,
                "category_name": null,
                "rotation": 0.0
            },
            {
                "id": "3v_material_id",
                "type": "video",
                "duration": 0,
                "path": null,
                "width": 0,
                "height": 0,
                "category_name": null,
                "rotation": 0.0
            },
            {
                "id": "4v_material_id",
                "type": "video",
                "duration": 0,
                "path": null,
                "width": 0,
                "height": 0,
                "category_name": null,
                "rotation": 0.0
            },
            {
                "id": "5v_material_id",
                "type": "video",
                "duration": 0,
                "path": null,
                "width": 0,
                "height": 0,
                "category_name": null,
                "rotation": 0.0
            },
            {
                "id": "13v_material_id",
                "type": "video_musk",
                "duration": 12800,
                "path": "com.hihonor.movietemplate/Resource/mask/title_portrait.mp4",
                "width": 1080,
                "height": 2520,
                "category_name": null,
                "rotation": 0.0
            }
        ],
        "audios": [
            {
                "id": "1a_material_id",
                "type": "music",
                "duration": 12800,
                "path": "com.hihonor.movietemplate/Resource/music/out.aac",
                "name": "music_name"
            }
        ],
        "effects": [
            {
                "id": "color_fading_black",
                "type": "mask",
                "effect_id": "mask_res_1",
                "name": "effect_fading_black",
                "path": "/thepath",
                "value": 0,
                "category_name": ""
            }],
        "tail_leaders": [
            {
                "id": "1tl_material_id",
                "type": "tail_leader",
                "text": "",
                "index": 0,
                "start": 12800,
                "duration": 1000
            }
        ],
        "transitions": [
            {
                "id": "1trs_material_id",
                "type": "transition",
                "name": "叠化",
                "path": "/thepath",
                "duration": 500,
                "is_overlap": true,
                "resource_id": ""
            }
        ]
    }
}