{
  "flags": [
    {
      "flag_declaration": {
        "name": "RELEASE_ACONFIG_FLAG_DEFAULT_PERMISSION",
        "namespace": "android_UNKNOWN",
        "description": "The default permission for all flags",
        "value": {
          "Val": {
            "StringValue": "READ_WRITE"
          }
        },
        "workflow": 3,
        "containers": [
          "product",
          "system",
          "system_ext",
          "vendor"
        ]
      },
      "value": {
        "Val": {
          "StringValue": "READ_ONLY"
        }
      }
    },
    {
      "flag_declaration": {
        "name": "RELEASE_ACONFIG_VALUE_SETS",
        "namespace": "android_UNKNOWN",
        "description": "Aconfig value sets assembled by release-config",
        "value": {
          "Val": {
            "UnspecifiedValue": false
          }
        },
        "workflow": 3,
        "containers": [
          "system",
          "system_ext",
          "product",
          "vendor"
        ]
      },
      "value": {
        "Val": {
          "StringValue": "aconfig_value_set-platform_build_release-root aconfig_value_set-platform_build_release-ap3a aconfig_value_set-platform_vendor_google_release-ap3a aconfig_value_set-platform_build_release-ap4a aconfig_value_set-platform_vendor_google_release-ap4a"
        }
      }
    },
    {
      "flag_declaration": {
        "name": "RELEASE_AIDL_USE_UNFROZEN",
        "namespace": "android_UNKNOWN",
        "description": "Enables the use of the unfrozen versions of AIDL interfaces. When this is `False` the libraries of the latest unfrozen version of a stable interface will behave like the last frozen version. When this is `True` the libraries behave like the lastest unfrozen version like they always have.",
        "value": {
          "Val": {
            "BoolValue": true
          }
        },
        "workflow": 1,
        "containers": [
          "product",
          "system",
          "system_ext",
          "vendor"
        ]
      },
      "value": {
        "Val": {
          "BoolValue": false
        }
      }
    },
    {
      "flag_declaration": {
        "name": "RELEASE_APEX_BOOT_JARS_PREBUILT_EXCLUDED_LIST",
        "namespace": "android_UNKNOWN",
        "description": "jars need to be excluded from Apex Boot Jars for targets with mainline prebuilts enabled.",
        "value": {
          "Val": {
            "StringValue": ""
          }
        },
        "workflow": 3,
        "containers": [
          "product",
          "system",
          "system_ext",
          "vendor"
        ]
      },
      "value": {
        "Val": {
          "StringValue": "com.android.mediaprovider:framework-photopicker"
        }
      }
    },
    {
      "flag_declaration": {
        "name": "RELEASE_APEX_CONTRIBUTIONS_ADBD",
        "namespace": "android_UNKNOWN",
        "description": "The contributions made by apexes (source or prebuilts) to the rest of the build.",
        "value": {
          "Val": {
            "UnspecifiedValue": false
          }
        },
        "workflow": 3,
        "containers": [
          "product",
          "system",
          "system_ext",
          "vendor"
        ]
      },
      "value": {
        "Val": {
          "StringValue": "adbd.google.contributions.prebuilt"
        }
      }
    },
    {
      "flag_declaration": {
        "name": "RELEASE_APEX_CONTRIBUTIONS_ADSERVICES",
        "namespace": "android_UNKNOWN",
        "description": "",
        "value": {
          "Val": {
            "UnspecifiedValue": false
          }
        },
        "workflow": 3,
        "containers": [
          "product",
          "system",
          "system_ext",
          "vendor"
        ]
      },
      "value": {
        "Val": {
          "StringValue": "adservices.google.contributions.prebuilt"
        }
      }
    },
    {
      "flag_declaration": {
        "name": "RELEASE_APEX_CONTRIBUTIONS_APPSEARCH",
        "namespace": "android_UNKNOWN",
        "description": "",
        "value": {
          "Val": {
            "UnspecifiedValue": false
          }
        },
        "workflow": 3,
        "containers": [
          "product",
          "system",
          "system_ext",
          "vendor"
        ]
      },
      "value": {
        "Val": {
          "StringValue": "appsearch.google.contributions.prebuilt"
        }
      }
    },
    {
      "flag_declaration": {
        "name": "RELEASE_APEX_CONTRIBUTIONS_ART",
        "namespace": "android_UNKNOWN",
        "description": "",
        "value": {
          "Val": {
            "UnspecifiedValue": false
          }
        },
        "workflow": 3,
        "containers": [
          "product",
          "system",
          "system_ext",
          "vendor"
        ]
      },
      "value": {
        "Val": {
          "StringValue": "art.google.contributions.prebuilt"
        }
      }
    },
    {
      "flag_declaration": {
        "name": "RELEASE_APEX_CONTRIBUTIONS_BLUETOOTH",
        "namespace": "android_UNKNOWN",
        "description": "",
        "value": {
          "Val": {
            "UnspecifiedValue": false
          }
        },
        "workflow": 3,
        "containers": [
          "product",
          "system",
          "system_ext",
          "vendor"
        ]
      },
      "value": {
        "Val": {
          "StringValue": "bluetooth.google.contributions.prebuilt"
        }
      }
    },
    {
      "flag_declaration": {
        "name": "RELEASE_APEX_CONTRIBUTIONS_CAPTIVEPORTALLOGIN",
        "namespace": "android_UNKNOWN",
        "description": "",
        "value": {
          "Val": {
            "UnspecifiedValue": false
          }
        },
        "workflow": 3,
        "containers": [
          "product",
          "system",
          "system_ext",
          "vendor"
        ]
      },
      "value": {
        "Val": {
          "StringValue": "captiveportallogin.google.contributions.prebuilt"
        }
      }
    },
    {
      "flag_declaration": {
        "name": "RELEASE_APEX_CONTRIBUTIONS_CELLBROADCAST",
        "namespace": "android_UNKNOWN",
        "description": "",
        "value": {
          "Val": {
            "UnspecifiedValue": false
          }
        },
        "workflow": 3,
        "containers": [
          "product",
          "system",
          "system_ext",
          "vendor"
        ]
      },
      "value": {
        "Val": {
          "StringValue": "cellbroadcast.google.contributions.prebuilt"
        }
      }
    },
    {
      "flag_declaration": {
        "name": "RELEASE_APEX_CONTRIBUTIONS_CONFIGINFRASTRUCTURE",
        "namespace": "android_UNKNOWN",
        "description": "",
        "value": {
          "Val": {
            "UnspecifiedValue": false
          }
        },
        "workflow": 3,
        "containers": [
          "product",
          "system",
          "system_ext",
          "vendor"
        ]
      },
      "value": {
        "Val": {
          "StringValue": "configinfrastructure.google.contributions.prebuilt"
        }
      }
    },
    {
      "flag_declaration": {
        "name": "RELEASE_APEX_CONTRIBUTIONS_CONNECTIVITY",
        "namespace": "android_UNKNOWN",
        "description": "",
        "value": {
          "Val": {
            "UnspecifiedValue": false
          }
        },
        "workflow": 3,
        "containers": [
          "product",
          "system",
          "system_ext",
          "vendor"
        ]
      },
      "value": {
        "Val": {
          "StringValue": "connectivity.google.contributions.prebuilt"
        }
      }
    },
    {
      "flag_declaration": {
        "name": "RELEASE_APEX_CONTRIBUTIONS_CONSCRYPT",
        "namespace": "android_UNKNOWN",
        "description": "",
        "value": {
          "Val": {
            "UnspecifiedValue": false
          }
        },
        "workflow": 3,
        "containers": [
          "product",
          "system",
          "system_ext",
          "vendor"
        ]
      },
      "value": {
        "Val": {
          "StringValue": "conscrypt.google.contributions.prebuilt"
        }
      }
    },
    {
      "flag_declaration": {
        "name": "RELEASE_APEX_CONTRIBUTIONS_CRASHRECOVERY",
        "namespace": "android_UNKNOWN",
        "description": "",
        "value": {
          "Val": {
            "UnspecifiedValue": false
          }
        },
        "workflow": 3,
        "containers": [
          "product",
          "system",
          "system_ext",
          "vendor"
        ]
      },
      "value": {
        "Val": null
      }
    },
    {
      "flag_declaration": {
        "name": "RELEASE_APEX_CONTRIBUTIONS_DEVICELOCK",
        "namespace": "android_UNKNOWN",
        "description": "",
        "value": {
          "Val": {
            "UnspecifiedValue": false
          }
        },
        "workflow": 3,
        "containers": [
          "product",
          "system",
          "system_ext",
          "vendor"
        ]
      },
      "value": {
        "Val": null
      }
    },
    {
      "flag_declaration": {
        "name": "RELEASE_APEX_CONTRIBUTIONS_DOCUMENTSUIGOOGLE",
        "namespace": "android_UNKNOWN",
        "description": "",
        "value": {
          "Val": {
            "UnspecifiedValue": false
          }
        },
        "workflow": 3,
        "containers": [
          "product",
          "system",
          "system_ext",
          "vendor"
        ]
      },
      "value": {
        "Val": {
          "StringValue": "documentsui.google.contributions.prebuilt"
        }
      }
    },
    {
      "flag_declaration": {
        "name": "RELEASE_APEX_CONTRIBUTIONS_EXTSERVICES",
        "namespace": "android_UNKNOWN",
        "description": "",
        "value": {
          "Val": {
            "UnspecifiedValue": false
          }
        },
        "workflow": 3,
        "containers": [
          "product",
          "system",
          "system_ext",
          "vendor"
        ]
      },
      "value": {
        "Val": {
          "StringValue": "extservices.google.contributions.prebuilt"
        }
      }
    },
    {
      "flag_declaration": {
        "name": "RELEASE_APEX_CONTRIBUTIONS_HEALTHFITNESS",
        "namespace": "android_UNKNOWN",
        "description": "",
        "value": {
          "Val": {
            "UnspecifiedValue": false
          }
        },
        "workflow": 3,
        "containers": [
          "product",
          "system",
          "system_ext",
          "vendor"
        ]
      },
      "value": {
        "Val": {
          "StringValue": "healthfitness.google.contributions.prebuilt"
        }
      }
    },
    {
      "flag_declaration": {
        "name": "RELEASE_APEX_CONTRIBUTIONS_IPSEC",
        "namespace": "android_UNKNOWN",
        "description": "",
        "value": {
          "Val": {
            "UnspecifiedValue": false
          }
        },
        "workflow": 3,
        "containers": [
          "product",
          "system",
          "system_ext",
          "vendor"
        ]
      },
      "value": {
        "Val": {
          "StringValue": "ipsec.google.contributions.prebuilt"
        }
      }
    },
    {
      "flag_declaration": {
        "name": "RELEASE_APEX_CONTRIBUTIONS_MEDIA",
        "namespace": "android_UNKNOWN",
        "description": "",
        "value": {
          "Val": {
            "UnspecifiedValue": false
          }
        },
        "workflow": 3,
        "containers": [
          "product",
          "system",
          "system_ext",
          "vendor"
        ]
      },
      "value": {
        "Val": {
          "StringValue": "media.google.contributions.prebuilt"
        }
      }
    },
    {
      "flag_declaration": {
        "name": "RELEASE_APEX_CONTRIBUTIONS_MEDIAPROVIDER",
        "namespace": "android_UNKNOWN",
        "description": "",
        "value": {
          "Val": {
            "UnspecifiedValue": false
          }
        },
        "workflow": 3,
        "containers": [
          "product",
          "system",
          "system_ext",
          "vendor"
        ]
      },
      "value": {
        "Val": {
          "StringValue": "mediaprovider.google.contributions.prebuilt"
        }
      }
    },
    {
      "flag_declaration": {
        "name": "RELEASE_APEX_CONTRIBUTIONS_MODULE_METADATA",
        "namespace": "android_UNKNOWN",
        "description": "",
        "value": {
          "Val": {
            "UnspecifiedValue": false
          }
        },
        "workflow": 3,
        "containers": [
          "product",
          "system",
          "system_ext",
          "vendor"
        ]
      },
      "value": {
        "Val": {
          "StringValue": "modulemetadata.google.contributions.prebuilt"
        }
      }
    },
    {
      "flag_declaration": {
        "name": "RELEASE_APEX_CONTRIBUTIONS_NETWORKSTACKGOOGLE",
        "namespace": "android_UNKNOWN",
        "description": "",
        "value": {
          "Val": {
            "UnspecifiedValue": false
          }
        },
        "workflow": 3,
        "containers": [
          "product",
          "system",
          "system_ext",
          "vendor"
        ]
      },
      "value": {
        "Val": {
          "StringValue": "networkstack.google.contributions.prebuilt"
        }
      }
    },
    {
      "flag_declaration": {
        "name": "RELEASE_APEX_CONTRIBUTIONS_NEURALNETWORKS",
        "namespace": "android_UNKNOWN",
        "description": "",
        "value": {
          "Val": {
            "UnspecifiedValue": false
          }
        },
        "workflow": 3,
        "containers": [
          "product",
          "system",
          "system_ext",
          "vendor"
        ]
      },
      "value": {
        "Val": {
          "StringValue": "neuralnetworks.google.contributions.prebuilt"
        }
      }
    },
    {
      "flag_declaration": {
        "name": "RELEASE_APEX_CONTRIBUTIONS_ONDEVICEPERSONALIZATION",
        "namespace": "android_UNKNOWN",
        "description": "",
        "value": {
          "Val": {
            "UnspecifiedValue": false
          }
        },
        "workflow": 3,
        "containers": [
          "product",
          "system",
          "system_ext",
          "vendor"
        ]
      },
      "value": {
        "Val": {
          "StringValue": "ondevicepersonalization.google.contributions.prebuilt"
        }
      }
    },
    {
      "flag_declaration": {
        "name": "RELEASE_APEX_CONTRIBUTIONS_PERMISSION",
        "namespace": "android_UNKNOWN",
        "description": "",
        "value": {
          "Val": {
            "UnspecifiedValue": false
          }
        },
        "workflow": 3,
        "containers": [
          "product",
          "system",
          "system_ext",
          "vendor"
        ]
      },
      "value": {
        "Val": {
          "StringValue": "permission.google.contributions.prebuilt"
        }
      }
    },
    {
      "flag_declaration": {
        "name": "RELEASE_APEX_CONTRIBUTIONS_PRIMARY_LIBS",
        "namespace": "android_UNKNOWN",
        "description": "flag to enable prebuilts for primary libs module (DCLA)",
        "value": {
          "Val": {
            "UnspecifiedValue": false
          }
        },
        "workflow": 3,
        "containers": [
          "system"
        ]
      },
      "value": {
        "Val": {
          "StringValue": "primarylibs.google.contributions.prebuilt"
        }
      }
    },
    {
      "flag_declaration": {
        "name": "RELEASE_APEX_CONTRIBUTIONS_REMOTEKEYPROVISIONING",
        "namespace": "android_UNKNOWN",
        "description": "",
        "value": {
          "Val": {
            "UnspecifiedValue": false
          }
        },
        "workflow": 3,
        "containers": [
          "product",
          "system",
          "system_ext",
          "vendor"
        ]
      },
      "value": {
        "Val": {
          "StringValue": "rkpd.google.contributions.prebuilt"
        }
      }
    },
    {
      "flag_declaration": {
        "name": "RELEASE_APEX_CONTRIBUTIONS_RESOLV",
        "namespace": "android_UNKNOWN",
        "description": "",
        "value": {
          "Val": {
            "UnspecifiedValue": false
          }
        },
        "workflow": 3,
        "containers": [
          "product",
          "system",
          "system_ext",
          "vendor"
        ]
      },
      "value": {
        "Val": {
          "StringValue": "resolv.google.contributions.prebuilt"
        }
      }
    },
    {
      "flag_declaration": {
        "name": "RELEASE_APEX_CONTRIBUTIONS_SCHEDULING",
        "namespace": "android_UNKNOWN",
        "description": "",
        "value": {
          "Val": {
            "UnspecifiedValue": false
          }
        },
        "workflow": 3,
        "containers": [
          "product",
          "system",
          "system_ext",
          "vendor"
        ]
      },
      "value": {
        "Val": {
          "StringValue": "scheduling.google.contributions.prebuilt"
        }
      }
    },
    {
      "flag_declaration": {
        "name": "RELEASE_APEX_CONTRIBUTIONS_SDKEXTENSIONS",
        "namespace": "android_UNKNOWN",
        "description": "",
        "value": {
          "Val": {
            "UnspecifiedValue": false
          }
        },
        "workflow": 3,
        "containers": [
          "product",
          "system",
          "system_ext",
          "vendor"
        ]
      },
      "value": {
        "Val": {
          "StringValue": "sdkextensions.google.contributions.prebuilt"
        }
      }
    },
    {
      "flag_declaration": {
        "name": "RELEASE_APEX_CONTRIBUTIONS_STATSD",
        "namespace": "android_UNKNOWN",
        "description": "",
        "value": {
          "Val": {
            "UnspecifiedValue": false
          }
        },
        "workflow": 3,
        "containers": [
          "product",
          "system",
          "system_ext",
          "vendor"
        ]
      },
      "value": {
        "Val": {
          "StringValue": "statsd.google.contributions.prebuilt"
        }
      }
    },
    {
      "flag_declaration": {
        "name": "RELEASE_APEX_CONTRIBUTIONS_SWCODEC",
        "namespace": "android_UNKNOWN",
        "description": "",
        "value": {
          "Val": {
            "UnspecifiedValue": false
          }
        },
        "workflow": 3,
        "containers": [
          "product",
          "system",
          "system_ext",
          "vendor"
        ]
      },
      "value": {
        "Val": {
          "StringValue": "swcodec.google.contributions.prebuilt"
        }
      }
    },
    {
      "flag_declaration": {
        "name": "RELEASE_APEX_CONTRIBUTIONS_TELEMETRY_TVP",
        "namespace": "android_UNKNOWN",
        "description": "flag to enable prebuilts for mainline telemetry tvp",
        "value": {
          "Val": {
            "UnspecifiedValue": false
          }
        },
        "workflow": 3,
        "containers": [
          "system"
        ]
      },
      "value": {
        "Val": null
      }
    },
    {
      "flag_declaration": {
        "name": "RELEASE_APEX_CONTRIBUTIONS_TZDATA",
        "namespace": "android_UNKNOWN",
        "description": "",
        "value": {
          "Val": {
            "UnspecifiedValue": false
          }
        },
        "workflow": 3,
        "containers": [
          "product",
          "system",
          "system_ext",
          "vendor"
        ]
      },
      "value": {
        "Val": {
          "StringValue": "tzdata.google.contributions.prebuilt"
        }
      }
    },
    {
      "flag_declaration": {
        "name": "RELEASE_APEX_CONTRIBUTIONS_UWB",
        "namespace": "android_UNKNOWN",
        "description": "",
        "value": {
          "Val": {
            "UnspecifiedValue": false
          }
        },
        "workflow": 3,
        "containers": [
          "product",
          "system",
          "system_ext",
          "vendor"
        ]
      },
      "value": {
        "Val": {
          "StringValue": "uwb.google.contributions.prebuilt"
        }
      }
    },
    {
      "flag_declaration": {
        "name": "RELEASE_APEX_CONTRIBUTIONS_WIFI",
        "namespace": "android_UNKNOWN",
        "description": "",
        "value": {
          "Val": {
            "UnspecifiedValue": false
          }
        },
        "workflow": 3,
        "containers": [
          "product",
          "system",
          "system_ext",
          "vendor"
        ]
      },
      "value": {
        "Val": {
          "StringValue": "wifi.google.contributions.prebuilt"
        }
      }
    },
    {
      "flag_declaration": {
        "name": "RELEASE_AVATAR_PICKER_APP",
        "namespace": "android_UNKNOWN",
        "description": "Move User avatar picker from SettingsLib to preinstalled app.",
        "value": {
          "Val": {
            "BoolValue": false
          }
        },
        "workflow": 1,
        "containers": [
          "product",
          "system",
          "system_ext",
          "vendor"
        ]
      },
      "value": {
        "Val": {
          "BoolValue": true
        }
      }
    },
    {
      "flag_declaration": {
        "name": "RELEASE_AVF_ALLOW_PREINSTALLED_APPS",
        "namespace": "android_UNKNOWN",
        "description": "Enables acces to the AVF APIs to pre-installed apps.",
        "value": {
          "Val": {
            "BoolValue": false
          }
        },
        "workflow": 1,
        "containers": [
          "system"
        ]
      },
      "value": {
        "Val": {
          "BoolValue": true
        }
      }
    },
    {
      "flag_declaration": {
        "name": "RELEASE_AVF_ENABLE_DEVICE_ASSIGNMENT",
        "namespace": "android_UNKNOWN",
        "description": "Enables assigning hardware devices to the guest VMs. If this flag is enabled, then RELEASE_AVF_ENABLE_MICRODROID_VENDOR_MODULES must also be enabled.",
        "value": {
          "Val": {
            "BoolValue": false
          }
        },
        "workflow": 1,
        "containers": [
          "product",
          "system",
          "system_ext",
          "vendor"
        ]
      },
      "value": {
        "Val": {
          "BoolValue": true
        }
      }
    },
    {
      "flag_declaration": {
        "name": "RELEASE_AVF_ENABLE_DICE_CHANGES",
        "namespace": "android_UNKNOWN",
        "description": "Enables new DICE functionality in Microdroid VMs.",
        "value": {
          "Val": {
            "BoolValue": false
          }
        },
        "workflow": 1,
        "containers": [
          "product",
          "system",
          "system_ext",
          "vendor"
        ]
      },
      "value": {
        "Val": {
          "BoolValue": true
        }
      }
    },
    {
      "flag_declaration": {
        "name": "RELEASE_AVF_ENABLE_EARLY_VM",
        "namespace": "android_UNKNOWN",
        "description": "Adds supports for VMs in the early boot, before /data mount.",
        "value": {
          "Val": {
            "BoolValue": false
          }
        },
        "workflow": 1,
        "containers": [
          "system"
        ]
      },
      "value": {
        "Val": {
          "BoolValue": false
        }
      }
    },
    {
      "flag_declaration": {
        "name": "RELEASE_AVF_ENABLE_LLPVM_CHANGES",
        "namespace": "android_UNKNOWN",
        "description": "Enables new llPvm functionality in Microdroid VMs.",
        "value": {
          "Val": {
            "BoolValue": false
          }
        },
        "workflow": 1,
        "containers": [
          "product",
          "system",
          "system_ext",
          "vendor"
        ]
      },
      "value": {
        "Val": {
          "BoolValue": true
        }
      }
    },
    {
      "flag_declaration": {
        "name": "RELEASE_AVF_ENABLE_MICROFUCHSIA",
        "namespace": "android_UNKNOWN",
        "description": "Allows microfuchsia to run on AVF.",
        "value": {
          "Val": {
            "BoolValue": false
          }
        },
        "workflow": 1,
        "containers": [
          "system"
        ]
      },
      "value": {
        "Val": {
          "BoolValue": false
        }
      }
    },
    {
      "flag_declaration": {
        "name": "RELEASE_AVF_ENABLE_MULTI_TENANT_MICRODROID_VM",
        "namespace": "android_UNKNOWN",
        "description": "Enables running multiple payloads in the same Microdroid VM instance.",
        "value": {
          "Val": {
            "BoolValue": false
          }
        },
        "workflow": 1,
        "containers": [
          "system"
        ]
      },
      "value": {
        "Val": {
          "BoolValue": true
        }
      }
    },
    {
      "flag_declaration": {
        "name": "RELEASE_AVF_ENABLE_NETWORK",
        "namespace": "android_UNKNOWN",
        "description": "Adds supports for network functionality in VMs.",
        "value": {
          "Val": {
            "BoolValue": false
          }
        },
        "workflow": 1,
        "containers": [
          "system"
        ]
      },
      "value": {
        "Val": {
          "BoolValue": false
        }
      }
    },
    {
      "flag_declaration": {
        "name": "RELEASE_AVF_ENABLE_REMOTE_ATTESTATION",
        "namespace": "android_UNKNOWN",
        "description": "Enables pVM remote attestation in Microdroid VM.",
        "value": {
          "Val": {
            "BoolValue": false
          }
        },
        "workflow": 1,
        "containers": [
          "product",
          "system",
          "system_ext",
          "vendor"
        ]
      },
      "value": {
        "Val": {
          "BoolValue": true
        }
      }
    },
    {
      "flag_declaration": {
        "name": "RELEASE_AVF_ENABLE_TPU_ASSIGNABLE_DEVICE",
        "namespace": "android_UNKNOWN",
        "description": "Adds userspace support for assigning TPU device to pVMs",
        "value": {
          "Val": {
            "BoolValue": false
          }
        },
        "workflow": 1,
        "containers": [
          "system"
        ]
      },
      "value": {
        "Val": {
          "BoolValue": false
        }
      }
    },
    {
      "flag_declaration": {
        "name": "RELEASE_AVF_ENABLE_VENDOR_MODULES",
        "namespace": "android_UNKNOWN",
        "description": "Enables loading vendor modules (both kernel \u0026 userspace) in Microdroid VM.",
        "value": {
          "Val": {
            "BoolValue": false
          }
        },
        "workflow": 1,
        "containers": [
          "product",
          "system",
          "system_ext",
          "vendor"
        ]
      },
      "value": {
        "Val": {
          "BoolValue": true
        }
      }
    },
    {
      "flag_declaration": {
        "name": "RELEASE_AVF_ENABLE_VIRT_CPUFREQ",
        "namespace": "android_UNKNOWN",
        "description": "Enables Virtual Cpufreq support in Microdroid VM.",
        "value": {
          "Val": {
            "BoolValue": false
          }
        },
        "workflow": 1,
        "containers": [
          "product",
          "system",
          "system_ext",
          "vendor"
        ]
      },
      "value": {
        "Val": {
          "BoolValue": true
        }
      }
    },
    {
      "flag_declaration": {
        "name": "RELEASE_AVF_ENABLE_WIDEVINE_PVM",
        "namespace": "android_UNKNOWN",
        "description": "Adds supports for Widevine pVM",
        "value": {
          "Val": {
            "BoolValue": false
          }
        },
        "workflow": 1,
        "containers": [
          "system"
        ]
      },
      "value": {
        "Val": {
          "BoolValue": false
        }
      }
    },
    {
      "flag_declaration": {
        "name": "RELEASE_AVF_IMPROVE_DEBUGGABLE_VMS",
        "namespace": "android_UNKNOWN",
        "description": "Improvements to debuggable VMs (e.g. tracing in guest VMs, earlycon)",
        "value": {
          "Val": {
            "BoolValue": false
          }
        },
        "workflow": 1,
        "containers": [
          "system"
        ]
      },
      "value": {
        "Val": {
          "BoolValue": false
        }
      }
    },
    {
      "flag_declaration": {
        "name": "RELEASE_AVF_MICRODROID_KERNEL_VERSION",
        "namespace": "android_UNKNOWN",
        "description": "Specify which Microdroid kernel version to use for Microdroid VMs.",
        "value": {
          "Val": {
            "UnspecifiedValue": false
          }
        },
        "workflow": 2,
        "containers": [
          "system"
        ]
      },
      "value": {
        "Val": {
          "StringValue": "android15_66"
        }
      }
    },
    {
      "flag_declaration": {
        "name": "RELEASE_AVF_SUPPORT_CUSTOM_VM_WITH_PARAVIRTUALIZED_DEVICES",
        "namespace": "android_UNKNOWN",
        "description": "Enable running custom VMs with paravirtualized devices.",
        "value": {
          "Val": {
            "BoolValue": false
          }
        },
        "workflow": 1,
        "containers": [
          "product",
          "system",
          "system_ext",
          "vendor"
        ]
      },
      "value": {
        "Val": {
          "BoolValue": false
        }
      }
    },
    {
      "flag_declaration": {
        "name": "RELEASE_AVF_SUPPORT_LONG_RUNNING_VMS",
        "namespace": "android_UNKNOWN",
        "description": "Improves support for long running VMs",
        "value": {
          "Val": {
            "BoolValue": false
          }
        },
        "workflow": 1,
        "containers": [
          "system"
        ]
      },
      "value": {
        "Val": {
          "BoolValue": false
        }
      }
    },
    {
      "flag_declaration": {
        "name": "RELEASE_BASE_OS_AKITA",
        "namespace": "android_UNKNOWN",
        "description": "Use this flag to set ro.build.version.base_os or ro.build.version.emergency_base_os for AKITArelease build. The value is set to the last approved build for the device. This is required for the SMR/EMR build to be recognized by the Partner Approvals portal.",
        "value": {
          "Val": {
            "StringValue": ""
          }
        },
        "workflow": 3,
        "containers": [
          "product",
          "system",
          "system_ext",
          "vendor"
        ]
      },
      "value": {
        "Val": {
          "StringValue": ""
        }
      }
    },
    {
      "flag_declaration": {
        "name": "RELEASE_BASE_OS_BLUEJAY",
        "namespace": "android_UNKNOWN",
        "description": "Use this flag to set ro.build.version.base_os or ro.build.version.emergency_base_os for BLUEJAYrelease build. The value is set to the last approved build for the device. This is required for the SMR/EMR build to be recognized by the Partner Approvals portal.",
        "value": {
          "Val": {
            "StringValue": ""
          }
        },
        "workflow": 3,
        "containers": [
          "product",
          "system",
          "system_ext",
          "vendor"
        ]
      },
      "value": {
        "Val": {
          "StringValue": ""
        }
      }
    },
    {
      "flag_declaration": {
        "name": "RELEASE_BASE_OS_CHEETAH",
        "namespace": "android_UNKNOWN",
        "description": "Use this flag to set ro.build.version.base_os or ro.build.version.emergency_base_os for CHEETAHrelease build. The value is set to the last approved build for the device. This is required for the SMR/EMR build to be recognized by the Partner Approvals portal.",
        "value": {
          "Val": {
            "StringValue": ""
          }
        },
        "workflow": 3,
        "containers": [
          "product",
          "system",
          "system_ext",
          "vendor"
        ]
      },
      "value": {
        "Val": {
          "StringValue": ""
        }
      }
    },
    {
      "flag_declaration": {
        "name": "RELEASE_BASE_OS_FELIX",
        "namespace": "android_UNKNOWN",
        "description": "Use this flag to set ro.build.version.base_os or ro.build.version.emergency_base_os for FELIXrelease build. The value is set to the last approved build for the device. This is required for the SMR/EMR build to be recognized by the Partner Approvals portal.",
        "value": {
          "Val": {
            "StringValue": ""
          }
        },
        "workflow": 3,
        "containers": [
          "product",
          "system",
          "system_ext",
          "vendor"
        ]
      },
      "value": {
        "Val": {
          "StringValue": ""
        }
      }
    },
    {
      "flag_declaration": {
        "name": "RELEASE_BASE_OS_HUSKY",
        "namespace": "android_UNKNOWN",
        "description": "Use this flag to set ro.build.version.base_os or ro.build.version.emergency_base_os for HUSKYrelease build. The value is set to the last approved build for the device. This is required for the SMR/EMR build to be recognized by the Partner Approvals portal.",
        "value": {
          "Val": {
            "StringValue": ""
          }
        },
        "workflow": 3,
        "containers": [
          "product",
          "system",
          "system_ext",
          "vendor"
        ]
      },
      "value": {
        "Val": {
          "StringValue": ""
        }
      }
    },
    {
      "flag_declaration": {
        "name": "RELEASE_BASE_OS_LYNX",
        "namespace": "android_UNKNOWN",
        "description": "Use this flag to set ro.build.version.base_os or ro.build.version.emergency_base_os for LYNXrelease build. The value is set to the last approved build for the device. This is required for the SMR/EMR build to be recognized by the Partner Approvals portal.",
        "value": {
          "Val": {
            "StringValue": ""
          }
        },
        "workflow": 3,
        "containers": [
          "product",
          "system",
          "system_ext",
          "vendor"
        ]
      },
      "value": {
        "Val": {
          "StringValue": ""
        }
      }
    },
    {
      "flag_declaration": {
        "name": "RELEASE_BASE_OS_ORIOLE",
        "namespace": "android_UNKNOWN",
        "description": "Use this flag to set ro.build.version.base_os or ro.build.version.emergency_base_os for ORIOLErelease build. The value is set to the last approved build for the device. This is required for the SMR/EMR build to be recognized by the Partner Approvals portal.",
        "value": {
          "Val": {
            "StringValue": ""
          }
        },
        "workflow": 3,
        "containers": [
          "product",
          "system",
          "system_ext",
          "vendor"
        ]
      },
      "value": {
        "Val": {
          "StringValue": ""
        }
      }
    },
    {
      "flag_declaration": {
        "name": "RELEASE_BASE_OS_PANTHER",
        "namespace": "android_UNKNOWN",
        "description": "Use this flag to set ro.build.version.base_os or ro.build.version.emergency_base_os for PANTHERrelease build. The value is set to the last approved build for the device. This is required for the SMR/EMR build to be recognized by the Partner Approvals portal.",
        "value": {
          "Val": {
            "StringValue": ""
          }
        },
        "workflow": 3,
        "containers": [
          "product",
          "system",
          "system_ext",
          "vendor"
        ]
      },
      "value": {
        "Val": {
          "StringValue": ""
        }
      }
    },
    {
      "flag_declaration": {
        "name": "RELEASE_BASE_OS_RAVEN",
        "namespace": "android_UNKNOWN",
        "description": "Use this flag to set ro.build.version.base_os or ro.build.version.emergency_base_os for RAVENrelease build. The value is set to the last approved build for the device. This is required for the SMR/EMR build to be recognized by the Partner Approvals portal.",
        "value": {
          "Val": {
            "StringValue": ""
          }
        },
        "workflow": 3,
        "containers": [
          "product",
          "system",
          "system_ext",
          "vendor"
        ]
      },
      "value": {
        "Val": {
          "StringValue": ""
        }
      }
    },
    {
      "flag_declaration": {
        "name": "RELEASE_BASE_OS_SHIBA",
        "namespace": "android_UNKNOWN",
        "description": "Use this flag to set ro.build.version.base_os or ro.build.version.emergency_base_os for SHIBArelease build. The value is set to the last approved build for the device. This is required for the SMR/EMR build to be recognized by the Partner Approvals portal.",
        "value": {
          "Val": {
            "StringValue": ""
          }
        },
        "workflow": 3,
        "containers": [
          "product",
          "system",
          "system_ext",
          "vendor"
        ]
      },
      "value": {
        "Val": {
          "StringValue": ""
        }
      }
    },
    {
      "flag_declaration": {
        "name": "RELEASE_BASE_OS_TANGORPRO",
        "namespace": "android_UNKNOWN",
        "description": "Use this flag to set ro.build.version.base_os or ro.build.version.emergency_base_os for TANGORPRO release build. The value is set to the last approved build for the device. This is required for the SMR/EMR build to be recognized by the Partner Approvals portal.",
        "value": {
          "Val": {
            "StringValue": ""
          }
        },
        "workflow": 3,
        "containers": [
          "product",
          "system",
          "system_ext",
          "vendor"
        ]
      },
      "value": {
        "Val": {
          "StringValue": ""
        }
      }
    },
    {
      "flag_declaration": {
        "name": "RELEASE_BINDER_DEATH_RECIPIENT_WEAK_FROM_JNI",
        "namespace": "android_UNKNOWN",
        "description": "If enabled, DeathRecipient is not strongly referenced from JNI.",
        "value": {
          "Val": {
            "BoolValue": false
          }
        },
        "workflow": 1,
        "containers": [
          "product",
          "system",
          "system_ext",
          "vendor"
        ]
      },
      "value": {
        "Val": {
          "BoolValue": true
        }
      }
    },
    {
      "flag_declaration": {
        "name": "RELEASE_BOARD_API_LEVEL",
        "namespace": "android_UNKNOWN",
        "description": "The API level of current vendor API surface. It has YYYYMM format.",
        "value": {
          "Val": {
            "StringValue": ""
          }
        },
        "workflow": 3,
        "containers": [
          "product",
          "system",
          "system_ext",
          "vendor"
        ]
      },
      "value": {
        "Val": {
          "StringValue": "202404"
        }
      }
    },
    {
      "flag_declaration": {
        "name": "RELEASE_BOARD_API_LEVEL_FROZEN",
        "namespace": "android_UNKNOWN",
        "description": "Set to True to freeze the board API level with vendor FRC",
        "value": {
          "Val": {
            "BoolValue": false
          }
        },
        "workflow": 1,
        "containers": [
          "product",
          "system",
          "system_ext",
          "vendor"
        ]
      },
      "value": {
        "Val": {
          "BoolValue": true
        }
      }
    },
    {
      "flag_declaration": {
        "name": "RELEASE_BPF_ENABLE_LIBBPF",
        "namespace": "android_UNKNOWN",
        "description": "Enables Libbpf support in bpfloader.",
        "value": {
          "Val": {
            "UnspecifiedValue": false
          }
        },
        "workflow": 1,
        "containers": [
          "system"
        ]
      },
      "value": {
        "Val": null
      }
    },
    {
      "flag_declaration": {
        "name": "RELEASE_BUILD_FLAGS_IN_PROTOBUF",
        "namespace": "android_UNKNOWN",
        "description": "Enable protobuf version of build flag processing. When true, the canonical source of truth for build flags is in the protobuf version of the data.",
        "value": {
          "Val": {
            "BoolValue": true
          }
        },
        "workflow": 1,
        "containers": [
          "product",
          "system",
          "system_ext",
          "vendor"
        ]
      },
      "value": {
        "Val": {
          "BoolValue": true
        }
      }
    },
    {
      "flag_declaration": {
        "name": "RELEASE_BUILD_OBJECT_SIZE_SANITIZER",
        "namespace": "android_platform_llvm_and_toolchains",
        "description": "Enable object-size sanitizer",
        "value": {
          "Val": {
            "BoolValue": false
          }
        },
        "workflow": 1,
        "containers": [
          "product",
          "system",
          "system_ext",
          "vendor"
        ]
      },
      "value": {
        "Val": {
          "BoolValue": false
        }
      }
    },
    {
      "flag_declaration": {
        "name": "RELEASE_CRASHRECOVERY_FILE_MOVE",
        "namespace": "android_UNKNOWN",
        "description": "If true, then files are moved from platform to apex",
        "value": {
          "Val": {
            "BoolValue": false
          }
        },
        "workflow": 1,
        "containers": [
          "product",
          "system",
          "system_ext",
          "vendor"
        ]
      },
      "value": {
        "Val": {
          "BoolValue": false
        }
      }
    },
    {
      "flag_declaration": {
        "name": "RELEASE_CRASHRECOVERY_MODULE",
        "namespace": "android_UNKNOWN",
        "description": "If true, then crashrecovery module is enabled as an apex",
        "value": {
          "Val": {
            "BoolValue": false
          }
        },
        "workflow": 1,
        "containers": [
          "product",
          "system",
          "system_ext",
          "vendor"
        ]
      },
      "value": {
        "Val": {
          "BoolValue": false
        }
      }
    },
    {
      "flag_declaration": {
        "name": "RELEASE_CREATE_ACONFIG_STORAGE_FILE",
        "namespace": "android_UNKNOWN",
        "description": "Enable build system to create new aconfig storage files.",
        "value": {
          "Val": {
            "BoolValue": false
          }
        },
        "workflow": 1,
        "containers": [
          "product",
          "system",
          "system_ext",
          "vendor"
        ]
      },
      "value": {
        "Val": {
          "BoolValue": false
        }
      }
    },
    {
      "flag_declaration": {
        "name": "RELEASE_DEFAULT_MODULE_BUILD_FROM_SOURCE",
        "namespace": "android_UNKNOWN",
        "description": "The behavior for the tree wrt building mainline modules or using prebuilts",
        "value": {
          "Val": {
            "BoolValue": true
          }
        },
        "workflow": 1,
        "containers": [
          "product",
          "system",
          "system_ext",
          "vendor"
        ]
      },
      "value": {
        "Val": {
          "BoolValue": true
        }
      }
    },
    {
      "flag_declaration": {
        "name": "RELEASE_DEPRECATE_VNDK",
        "namespace": "android_UNKNOWN",
        "description": "feature flag to deprecate VNDK",
        "value": {
          "Val": {
            "BoolValue": true
          }
        },
        "workflow": 1,
        "containers": [
          "product",
          "system",
          "system_ext",
          "vendor"
        ]
      },
      "value": {
        "Val": {
          "BoolValue": true
        }
      }
    },
    {
      "flag_declaration": {
        "name": "RELEASE_DISABLE_VERIFY_OVERLAPS_CHECK",
        "namespace": "android_UNKNOWN",
        "description": "Disable verify_overlaps check for mainline prebuilts. Only used in non-AOSP builds.",
        "value": {
          "Val": {
            "BoolValue": false
          }
        },
        "workflow": 1,
        "containers": [
          "product",
          "system",
          "system_ext",
          "vendor"
        ]
      },
      "value": {
        "Val": {
          "BoolValue": true
        }
      }
    },
    {
      "flag_declaration": {
        "name": "RELEASE_ENABLE_ANGLE_AS_DEFAULT_GLES_DRIVER_PIXEL",
        "namespace": "android_UNKNOWN",
        "description": "Set ANGLE as the system default GLES driver",
        "value": {
          "Val": {
            "UnspecifiedValue": false
          }
        },
        "workflow": 3,
        "containers": [
          "system"
        ]
      },
      "value": {
        "Val": null
      }
    },
    {
      "flag_declaration": {
        "name": "RELEASE_ENABLE_COMPOSE_IN_LAUNCHER",
        "namespace": "launcher",
        "description": "b/346290823: Flag to enable Jetpack Compose dependencies in Launcher.",
        "value": {
          "Val": {
            "BoolValue": false
          }
        },
        "workflow": 1,
        "containers": [
          "system"
        ]
      },
      "value": {
        "Val": {
          "BoolValue": false
        }
      }
    },
    {
      "flag_declaration": {
        "name": "RELEASE_GOOGLE_ENABLE_HSUM_EXPERIMENTAL",
        "namespace": "android_UNKNOWN",
        "description": "Control experimental rollout of HSUM feature on certain devices like TangorPro or Cheetah for testing only.",
        "value": {
          "Val": {
            "BoolValue": false
          }
        },
        "workflow": 1,
        "containers": [
          "product",
          "system",
          "system_ext",
          "vendor"
        ]
      },
      "value": {
        "Val": {
          "BoolValue": false
        }
      }
    },
    {
      "flag_declaration": {
        "name": "RELEASE_HARDWARE_BLUETOOTH_RANGING_SERVICE",
        "namespace": "android_UNKNOWN",
        "description": "Enables Bluetooth Ranging Service",
        "value": {
          "Val": {
            "BoolValue": true
          }
        },
        "workflow": 1,
        "containers": [
          "product",
          "system",
          "system_ext",
          "vendor"
        ]
      },
      "value": {
        "Val": {
          "BoolValue": true
        }
      }
    },
    {
      "flag_declaration": {
        "name": "RELEASE_HIDDEN_API_EXPORTABLE_STUBS",
        "namespace": "android_UNKNOWN",
        "description": "b/319697968: Flag to determine the dependency of hiddenapi to the stubs that contain all flagged apis (\"everything\" stubs), or to the stubs that contain only the enabled flagged apis (\"exportable\" stubs).",
        "value": {
          "Val": {
            "BoolValue": false
          }
        },
        "workflow": 1,
        "containers": [
          "product",
          "system",
          "system_ext",
          "vendor"
        ]
      },
      "value": {
        "Val": {
          "BoolValue": true
        }
      }
    },
    {
      "flag_declaration": {
        "name": "RELEASE_IS_EMR",
        "namespace": "android_UNKNOWN",
        "description": "Set this flag to true to mark a release build as EMR (Emergency Maintenance Release).",
        "value": {
          "Val": {
            "BoolValue": false
          }
        },
        "workflow": 3,
        "containers": [
          "product",
          "system",
          "system_ext",
          "vendor"
        ]
      },
      "value": {
        "Val": {
          "BoolValue": false
        }
      }
    },
    {
      "flag_declaration": {
        "name": "RELEASE_IS_SMR",
        "namespace": "android_UNKNOWN",
        "description": "Set this flag to true to mark a release build as SMR (Security Maintenance Release).",
        "value": {
          "Val": {
            "BoolValue": false
          }
        },
        "workflow": 3,
        "containers": [
          "product",
          "system",
          "system_ext",
          "vendor"
        ]
      },
      "value": {
        "Val": {
          "BoolValue": false
        }
      }
    },
    {
      "flag_declaration": {
        "name": "RELEASE_LARGE_SYSTEM_PROPERTY_NODE",
        "namespace": "android_UNKNOWN",
        "description": "Allow system property storage node to be 1M to accomodate aconfig flags.",
        "value": {
          "Val": {
            "BoolValue": false
          }
        },
        "workflow": 1,
        "containers": [
          "product",
          "system",
          "system_ext",
          "vendor"
        ]
      },
      "value": {
        "Val": {
          "BoolValue": false
        }
      }
    },
    {
      "flag_declaration": {
        "name": "RELEASE_LIBBINDER_CLIENT_CACHE",
        "namespace": "system_performance",
        "description": "Enables caching in libbinder for client side when it is True.",
        "value": {
          "Val": {
            "BoolValue": false
          }
        },
        "workflow": 1,
        "containers": [
          "system"
        ]
      },
      "value": {
        "Val": {
          "BoolValue": false
        }
      }
    },
    {
      "flag_declaration": {
        "name": "RELEASE_LIBPOWER_NO_LOCK_BINDER_TXN",
        "namespace": "android_UNKNOWN",
        "description": "b/343527537: Flag to defer acquiring libpower lock until after binder transaction to optimize wake lock acquisition.",
        "value": {
          "Val": {
            "UnspecifiedValue": false
          }
        },
        "workflow": 1,
        "containers": [
          "system"
        ]
      },
      "value": {
        "Val": {
          "BoolValue": true
        }
      }
    },
    {
      "flag_declaration": {
        "name": "RELEASE_MAINLINE_MODULE_PREBUILT_VERSION",
        "namespace": "android_UNKNOWN",
        "description": "The version of mainline prebuilts used when prebuilts are enabled.",
        "value": {
          "Val": {
            "StringValue": "mainline_module_prebuilt_nightly"
          }
        },
        "workflow": 2,
        "containers": [
          "product",
          "system",
          "system_ext",
          "vendor"
        ]
      },
      "value": {
        "Val": {
          "StringValue": "mainline_module_prebuilt_nightly"
        }
      }
    },
    {
      "flag_declaration": {
        "name": "RELEASE_MOVE_PDFRENDERER_TO_MODULE",
        "namespace": "android_UNKNOWN",
        "description": "If true, then files are moved from platform to apex",
        "value": {
          "Val": {
            "BoolValue": false
          }
        },
        "workflow": 1,
        "containers": [
          "product",
          "system",
          "system_ext",
          "vendor"
        ]
      },
      "value": {
        "Val": {
          "BoolValue": false
        }
      }
    },
    {
      "flag_declaration": {
        "name": "RELEASE_NDK_ABI_MONITORED",
        "namespace": "android_UNKNOWN",
        "description": "Enables ABI monitoring of NDK libraries.",
        "value": {
          "Val": {
            "BoolValue": false
          }
        },
        "workflow": 1,
        "containers": [
          "product",
          "system",
          "system_ext",
          "vendor"
        ]
      },
      "value": {
        "Val": {
          "BoolValue": false
        }
      }
    },
    {
      "flag_declaration": {
        "name": "RELEASE_PACKAGE_EMOJI_FONT_VERSION",
        "namespace": "android_UNKNOWN",
        "description": "Version of the emoji font file.",
        "value": {
          "Val": {
            "StringValue": "2.042"
          }
        },
        "workflow": 2,
        "containers": [
          "system"
        ]
      },
      "value": {
        "Val": {
          "StringValue": "2.042"
        }
      }
    },
    {
      "flag_declaration": {
        "name": "RELEASE_PACKAGE_FLAG_EMOJI_FONT_VERSION",
        "namespace": "android_UNKNOWN",
        "description": "Version of the flag emoji font file.",
        "value": {
          "Val": {
            "StringValue": "2.034"
          }
        },
        "workflow": 2,
        "containers": [
          "system"
        ]
      },
      "value": {
        "Val": {
          "StringValue": "2.042"
        }
      }
    },
    {
      "flag_declaration": {
        "name": "RELEASE_PACKAGE_HEBREW_FONT_VERSION",
        "namespace": "android_UNKNOWN",
        "description": "Version of the Hebrew font file.",
        "value": {
          "Val": {
            "StringValue": "1.04"
          }
        },
        "workflow": 2,
        "containers": [
          "system"
        ]
      },
      "value": {
        "Val": {
          "StringValue": "1.04"
        }
      }
    },
    {
      "flag_declaration": {
        "name": "RELEASE_PACKAGE_HENTAIGANA_FONT",
        "namespace": "android_UNKNOWN",
        "description": "This flag will control of including Japanese variant (Hentaigana) font.",
        "value": {
          "Val": {
            "BoolValue": false
          }
        },
        "workflow": 1,
        "containers": [
          "system"
        ]
      },
      "value": {
        "Val": {
          "BoolValue": true
        }
      }
    },
    {
      "flag_declaration": {
        "name": "RELEASE_PACKAGE_LIBANDROID_RUNTIME_PUNCH_HOLES",
        "namespace": "android_UNKNOWN",
        "description": "b/301631861: Flag to enable punching holes in apks and shared libs",
        "value": {
          "Val": {
            "BoolValue": false
          }
        },
        "workflow": 1,
        "containers": [
          "product",
          "system",
          "system_ext",
          "vendor"
        ]
      },
      "value": {
        "Val": {
          "BoolValue": true
        }
      }
    },
    {
      "flag_declaration": {
        "name": "RELEASE_PACKAGE_LIBSQLITE3",
        "namespace": "android_UNKNOWN",
        "description": "The sqlite release.",
        "value": {
          "Val": {
            "StringValue": "3420000"
          }
        },
        "workflow": 2,
        "containers": [
          "system"
        ]
      },
      "value": {
        "Val": {
          "StringValue": "3440300"
        }
      }
    },
    {
      "flag_declaration": {
        "name": "RELEASE_PACKAGE_MESSAGEQUEUE_IMPLEMENTATION",
        "namespace": "system_performance",
        "description": "Which MessageQueue implementation to use.",
        "value": {
          "Val": {
            "StringValue": "LegacyMessageQueue/MessageQueue.java"
          }
        },
        "workflow": 2,
        "containers": [
          "product",
          "system",
          "system_ext",
          "vendor"
        ]
      },
      "value": {
        "Val": {
          "StringValue": "LegacyMessageQueue/MessageQueue.java"
        }
      }
    },
    {
      "flag_declaration": {
        "name": "RELEASE_PACKAGE_NFC_STACK",
        "namespace": "android_UNKNOWN",
        "description": "b/292140387: Flag to switch to the new NFC apex",
        "value": {
          "Val": {
            "StringValue": "NfcNci"
          }
        },
        "workflow": 2,
        "containers": [
          "system"
        ]
      },
      "value": {
        "Val": {
          "StringValue": "com.android.nfcservices"
        }
      }
    },
    {
      "flag_declaration": {
        "name": "RELEASE_PACKAGE_PROFILING_MODULE",
        "namespace": "android_UNKNOWN",
        "description": "Flag will control the release of the Profiling module apex.",
        "value": {
          "Val": {
            "BoolValue": false
          }
        },
        "workflow": 1,
        "containers": [
          "product",
          "system",
          "system_ext",
          "vendor"
        ]
      },
      "value": {
        "Val": {
          "BoolValue": true
        }
      }
    },
    {
      "flag_declaration": {
        "name": "RELEASE_PACKAGE_SOUND_PICKER",
        "namespace": "android_UNKNOWN",
        "description": "This flag will control the rollout of new versions of the SoundPicker app.",
        "value": {
          "Val": {
            "StringValue": "SoundPicker"
          }
        },
        "workflow": 2,
        "containers": [
          "product",
          "system",
          "system_ext",
          "vendor"
        ]
      },
      "value": {
        "Val": {
          "StringValue": "SoundPicker"
        }
      }
    },
    {
      "flag_declaration": {
        "name": "RELEASE_PACKAGE_TZDATA_MODULE",
        "namespace": "android_UNKNOWN",
        "description": "tzdata to be installed to the system image.",
        "value": {
          "Val": {
            "StringValue": "com.android.tzdata"
          }
        },
        "workflow": 2,
        "containers": [
          "product",
          "system",
          "system_ext",
          "vendor"
        ]
      },
      "value": {
        "Val": {
          "StringValue": "com.android.tzdata"
        }
      }
    },
    {
      "flag_declaration": {
        "name": "RELEASE_PACKAGE_VARIABLE_NOTO_SANS_CJK",
        "namespace": "android_UNKNOWN",
        "description": "True for using variable font of the NotoSansCJK",
        "value": {
          "Val": {
            "BoolValue": false
          }
        },
        "workflow": 1,
        "containers": [
          "system"
        ]
      },
      "value": {
        "Val": {
          "BoolValue": true
        }
      }
    },
    {
      "flag_declaration": {
        "name": "RELEASE_PACKAGE_VIRTUAL_CAMERA",
        "namespace": "android_UNKNOWN",
        "description": "The name of the virtual camera package to add to the system partition.",
        "value": {
          "Val": {
            "StringValue": ""
          }
        },
        "workflow": 2,
        "containers": [
          "system"
        ]
      },
      "value": {
        "Val": {
          "StringValue": "virtual_camera"
        }
      }
    },
    {
      "flag_declaration": {
        "name": "RELEASE_PACKAGE_WEAR_PERSONAL_SAFETY",
        "namespace": "android_UNKNOWN",
        "description": "Control which version of the Wear Personal Safety APK is installed.",
        "value": {
          "Val": {
            "UnspecifiedValue": false
          }
        },
        "workflow": 2,
        "containers": [
          "system"
        ]
      },
      "value": {
        "Val": {
          "StringValue": "2024.08.08.664949293.3-release-wear"
        }
      }
    },
    {
      "flag_declaration": {
        "name": "RELEASE_PACKAGE_WEAR_SYSUI",
        "namespace": "wear_sysui",
        "description": "Control which version of the Google SysUI apk is installed.",
        "value": {
          "Val": {
            "UnspecifiedValue": false
          }
        },
        "workflow": 2,
        "containers": [
          "system"
        ]
      },
      "value": {
        "Val": {
          "StringValue": "5.4.14.687014996"
        }
      }
    },
    {
      "flag_declaration": {
        "name": "RELEASE_PACKAGE_WEAR_TTS",
        "namespace": "android_UNKNOWN",
        "description": "Control which version of the Wear Text-to-speech apk is installed.",
        "value": {
          "Val": {
            "UnspecifiedValue": false
          }
        },
        "workflow": 2,
        "containers": [
          "system"
        ]
      },
      "value": {
        "Val": {
          "StringValue": "210484003"
        }
      }
    },
    {
      "flag_declaration": {
        "name": "RELEASE_PIXEL_ADAPTIVE_HAPTICS_ENABLED",
        "namespace": "android_UNKNOWN",
        "description": "Using this flag to control the presence of Pixel Adaptive Haptics module in PersistentBackgroundServices for SYSTEM_EXT and preloaded_nanoapps for VENDOR.",
        "value": {
          "Val": {
            "BoolValue": false
          }
        },
        "workflow": 1,
        "containers": [
          "product",
          "system",
          "system_ext",
          "vendor"
        ]
      },
      "value": {
        "Val": {
          "BoolValue": true
        }
      }
    },
    {
      "flag_declaration": {
        "name": "RELEASE_PLATFORM_MIN_SUPPORTED_TARGET_SDK_VERSION",
        "namespace": "android_UNKNOWN",
        "description": "Used to set minimum supported target sdk version. Apps targeting sdk version lower than the set value will result in a warning being shown when any activity from the app is started.",
        "value": {
          "Val": {
            "StringValue": "28"
          }
        },
        "workflow": 3,
        "containers": [
          "system"
        ]
      },
      "value": {
        "Val": {
          "StringValue": "28"
        }
      }
    },
    {
      "flag_declaration": {
        "name": "RELEASE_PLATFORM_SDK_EXTENSION_VERSION",
        "namespace": "android_UNKNOWN",
        "description": "The sdk extension version of this release configuration.",
        "value": {
          "Val": {
            "StringValue": "12"
          }
        },
        "workflow": 3,
        "containers": [
          "product",
          "system",
          "system_ext",
          "vendor"
        ]
      },
      "value": {
        "Val": {
          "StringValue": "15"
        }
      }
    },
    {
      "flag_declaration": {
        "name": "RELEASE_PLATFORM_SDK_VERSION",
        "namespace": "android_UNKNOWN",
        "description": "The SDK version of the platform, e.g. 34 for UDC. This should only be increased when the API is finalized and the codename is set to rel, not during development.",
        "value": {
          "Val": {
            "StringValue": "34"
          }
        },
        "workflow": 3,
        "containers": [
          "product",
          "system",
          "system_ext",
          "vendor"
        ]
      },
      "value": {
        "Val": {
          "StringValue": "35"
        }
      }
    },
    {
      "flag_declaration": {
        "name": "RELEASE_PLATFORM_SECURITY_PATCH",
        "namespace": "android_UNKNOWN",
        "description": "Used to indicate the security patch that has been applied to the device. It must signify that the build includes all security patches issued up through the designated Android Public Security Bulletin. It must be of the form \"YYYY-MM-DD\" on production devices. It must match one of the Android Security Patch Level strings of the Public Security Bulletins. If there is no $PLATFORM_SECURITY_PATCH set, keep it empty.",
        "value": {
          "Val": {
            "StringValue": "2023-12-05"
          }
        },
        "workflow": 3,
        "containers": [
          "product",
          "system",
          "system_ext",
          "vendor"
        ]
      },
      "value": {
        "Val": {
          "StringValue": "2024-12-05"
        }
      }
    },
    {
      "flag_declaration": {
        "name": "RELEASE_PLATFORM_VERSION",
        "namespace": "android_UNKNOWN",
        "description": "The platform version. This is the 4 letter code, e.g. UD1A, UPB1, ZP1A, etc.",
        "value": {
          "Val": {
            "StringValue": "ZP1A"
          }
        },
        "workflow": 3,
        "containers": [
          "product",
          "system",
          "system_ext",
          "vendor"
        ]
      },
      "value": {
        "Val": {
          "StringValue": "AP4A"
        }
      }
    },
    {
      "flag_declaration": {
        "name": "RELEASE_PLATFORM_VERSION_ALL_CODENAMES",
        "namespace": "android_UNKNOWN",
        "description": "A comma separated list of all codenames that are in preview. This variable is sort of a lie for historical reasons and only includes codenames up to and including the currently active codename",
        "value": {
          "Val": {
            "StringValue": "VanillaIceCream"
          }
        },
        "workflow": 3,
        "containers": [
          "product",
          "system",
          "system_ext",
          "vendor"
        ]
      },
      "value": {
        "Val": {
          "StringValue": "REL"
        }
      }
    },
    {
      "flag_declaration": {
        "name": "RELEASE_PLATFORM_VERSION_ALL_PREVIEW_CODENAMES",
        "namespace": "android_UNKNOWN",
        "description": "A comma separated list of all preview codenames the platform will accept apps built against",
        "value": {
          "Val": {
            "StringValue": "VanillaIceCream"
          }
        },
        "workflow": 3,
        "containers": [
          "product",
          "system",
          "system_ext",
          "vendor"
        ]
      },
      "value": {
        "Val": {
          "StringValue": "REL"
        }
      }
    },
    {
      "flag_declaration": {
        "name": "RELEASE_PLATFORM_VERSION_CODENAME",
        "namespace": "android_UNKNOWN",
        "description": "Set to REL for production platform builds, otherwise the codename string, e.g. UpsideDownCake or VanillaIceCream",
        "value": {
          "Val": {
            "StringValue": "VanillaIceCream"
          }
        },
        "workflow": 3,
        "containers": [
          "product",
          "system",
          "system_ext",
          "vendor"
        ]
      },
      "value": {
        "Val": {
          "StringValue": "REL"
        }
      }
    },
    {
      "flag_declaration": {
        "name": "RELEASE_PLATFORM_VERSION_KNOWN_CODENAMES",
        "namespace": "android_UNKNOWN",
        "description": "A comma separated list of all known codenames. For REL (finalized) configurations, it has to only contain finalized codenames.",
        "value": {
          "Val": {
            "StringValue": "Base,Base11,Cupcake,Donut,Eclair,Eclair01,EclairMr1,Froyo,Gingerbread,GingerbreadMr1,Honeycomb,HoneycombMr1,HoneycombMr2,IceCreamSandwich,IceCreamSandwichMr1,JellyBean,JellyBeanMr1,JellyBeanMr2,Kitkat,KitkatWatch,Lollipop,LollipopMr1,M,N,NMr1,O,OMr1,P,Q,R,S,Sv2,Tiramisu,UpsideDownCake,VanillaIceCream"
          }
        },
        "workflow": 3,
        "containers": [
          "product",
          "system",
          "system_ext",
          "vendor"
        ]
      },
      "value": {
        "Val": {
          "StringValue": "Base,Base11,Cupcake,Donut,Eclair,Eclair01,EclairMr1,Froyo,Gingerbread,GingerbreadMr1,Honeycomb,HoneycombMr1,HoneycombMr2,IceCreamSandwich,IceCreamSandwichMr1,JellyBean,JellyBeanMr1,JellyBeanMr2,Kitkat,KitkatWatch,Lollipop,LollipopMr1,M,N,NMr1,O,OMr1,P,Q,R,S,Sv2,Tiramisu,UpsideDownCake,VanillaIceCream"
        }
      }
    },
    {
      "flag_declaration": {
        "name": "RELEASE_PLATFORM_VERSION_LAST_STABLE",
        "namespace": "android_UNKNOWN",
        "description": "The last stable version name of the platform that was released.  During development, this stays at that previous version, while the codename indicates further work based on the previous version.",
        "value": {
          "Val": {
            "StringValue": "14"
          }
        },
        "workflow": 3,
        "containers": [
          "product",
          "system",
          "system_ext",
          "vendor"
        ]
      },
      "value": {
        "Val": {
          "StringValue": "15"
        }
      }
    },
    {
      "flag_declaration": {
        "name": "RELEASE_PLATFORM_VNDK_VERSION",
        "namespace": "android_UNKNOWN",
        "description": "The PLATFORM_VNDK_VERSION will be set to this version when the PLATFORM_VERSION_CODENAME is REL. This VNDK version flag will be removed when the VNDK is deprecated",
        "value": {
          "Val": {
            "StringValue": "35"
          }
        },
        "workflow": 3,
        "containers": [
          "product",
          "system",
          "system_ext",
          "vendor"
        ]
      },
      "value": {
        "Val": {
          "StringValue": "35"
        }
      }
    },
    {
      "flag_declaration": {
        "name": "RELEASE_RANGING_STACK",
        "namespace": "android_UNKNOWN",
        "description": "b/331206299: Flag to add new generic ranging API surface",
        "value": {
          "Val": {
            "UnspecifiedValue": false
          }
        },
        "workflow": 1,
        "containers": [
          "system"
        ]
      },
      "value": {
        "Val": null
      }
    },
    {
      "flag_declaration": {
        "name": "RELEASE_READ_FROM_NEW_STORAGE",
        "namespace": "android_UNKNOWN",
        "description": "Control if we should read from new storage.",
        "value": {
          "Val": {
            "BoolValue": false
          }
        },
        "workflow": 1,
        "containers": [
          "product",
          "system",
          "system_ext",
          "vendor"
        ]
      },
      "value": {
        "Val": {
          "BoolValue": false
        }
      }
    },
    {
      "flag_declaration": {
        "name": "RELEASE_READ_FROM_NEW_STORAGE_CC",
        "namespace": "android_UNKNOWN",
        "description": "Enable reading from new storage from C/C++ aconfig flag codegen.",
        "value": {
          "Val": {
            "BoolValue": false
          }
        },
        "workflow": 1,
        "containers": [
          "system"
        ]
      },
      "value": {
        "Val": {
          "BoolValue": false
        }
      }
    },
    {
      "flag_declaration": {
        "name": "RELEASE_REMOVE_LEGACY_EMOJI_FONT",
        "namespace": "android_UNKNOWN",
        "description": "feature flag for removing legacy emoji font from system image.",
        "value": {
          "Val": {
            "BoolValue": false
          }
        },
        "workflow": 1,
        "containers": [
          "system"
        ]
      },
      "value": {
        "Val": {
          "StringValue": "True"
        }
      }
    },
    {
      "flag_declaration": {
        "name": "RELEASE_SELINUX_DATA_DATA_IGNORE",
        "namespace": "android_UNKNOWN",
        "description": "Ignore /data/data relabelling in libselinux.",
        "value": {
          "Val": {
            "BoolValue": false
          }
        },
        "workflow": 1,
        "containers": [
          "product",
          "system",
          "system_ext",
          "vendor"
        ]
      },
      "value": {
        "Val": {
          "BoolValue": true
        }
      }
    },
    {
      "flag_declaration": {
        "name": "RELEASE_SM_OPEN_DECLARED_PASSTHROUGH_HAL",
        "namespace": "android_UNKNOWN",
        "description": "feature flag for a new API to open declared passthrough HAL",
        "value": {
          "Val": {
            "BoolValue": false
          }
        },
        "workflow": 1,
        "containers": [
          "product",
          "system",
          "system_ext",
          "vendor"
        ]
      },
      "value": {
        "Val": {
          "BoolValue": false
        }
      }
    },
    {
      "flag_declaration": {
        "name": "RELEASE_SUPERVISION_SERVICE",
        "namespace": "supervision",
        "description": "Include SupervisionService in the build",
        "value": {
          "Val": {
            "UnspecifiedValue": false
          }
        },
        "workflow": 1,
        "containers": [
          "system"
        ]
      },
      "value": {
        "Val": null
      }
    },
    {
      "flag_declaration": {
        "name": "RELEASE_TEST_DEVICE_BUILD_RELEASE",
        "namespace": "gantry",
        "description": "This flag is only used by the dbr team for testing build flag automation in Gantry",
        "value": {
          "Val": {
            "UnspecifiedValue": false
          }
        },
        "workflow": 2,
        "containers": [
          "product",
          "system",
          "system_ext",
          "vendor"
        ]
      },
      "value": {
        "Val": null
      }
    },
    {
      "flag_declaration": {
        "name": "RELEASE_UNLOCKED_STORAGE_API",
        "namespace": "android_UNKNOWN",
        "description": "flag to enable the unlocked-only storage API's SEPolicy rules",
        "value": {
          "Val": {
            "BoolValue": false
          }
        },
        "workflow": 1,
        "containers": [
          "product",
          "system",
          "system_ext",
          "vendor"
        ]
      },
      "value": {
        "Val": {
          "BoolValue": false
        }
      }
    },
    {
      "flag_declaration": {
        "name": "RELEASE_UPROBESTATS_MODULE",
        "namespace": "android_UNKNOWN",
        "description": "If true, then uprobestats module is enabled as an apex",
        "value": {
          "Val": {
            "BoolValue": false
          }
        },
        "workflow": 1,
        "containers": [
          "product",
          "system",
          "system_ext",
          "vendor"
        ]
      },
      "value": {
        "Val": {
          "BoolValue": false
        }
      }
    },
    {
      "flag_declaration": {
        "name": "RELEASE_USB_UDC_SYSFS_SELINUX_POLICY_ENABLED",
        "namespace": "system_sw_usb",
        "description": "Guard the reference to selinux sysfs_udc type introduced in aosp/3163782 for board API 202504.",
        "value": {
          "Val": {
            "BoolValue": false
          }
        },
        "workflow": 1,
        "containers": [
          "vendor",
          "system"
        ]
      },
      "value": {
        "Val": {
          "BoolValue": false
        }
      }
    },
    {
      "flag_declaration": {
        "name": "RELEASE_USE_OPTIMIZED_RESOURCE_SHRINKING_BY_DEFAULT",
        "namespace": "android_UNKNOWN",
        "description": "feature flag for enabling optimized_shrink_resources: true by default",
        "value": {
          "Val": {
            "UnspecifiedValue": false
          }
        },
        "workflow": 1,
        "containers": [
          "product",
          "system",
          "system_ext",
          "vendor"
        ]
      },
      "value": {
        "Val": null
      }
    },
    {
      "flag_declaration": {
        "name": "RELEASE_USE_RESOURCE_PROCESSOR_BY_DEFAULT",
        "namespace": "android_UNKNOWN",
        "description": "feature flag for enabling use_resource_processor: true by default",
        "value": {
          "Val": {
            "BoolValue": false
          }
        },
        "workflow": 1,
        "containers": [
          "product",
          "system",
          "system_ext",
          "vendor"
        ]
      },
      "value": {
        "Val": {
          "BoolValue": false
        }
      }
    },
    {
      "flag_declaration": {
        "name": "RELEASE_USE_SYSTEM_FEATURE_BUILD_FLAGS",
        "namespace": "android_UNKNOWN",
        "description": "Enable use of system feature build-time flags and codegen.",
        "value": {
          "Val": {
            "UnspecifiedValue": false
          }
        },
        "workflow": 3,
        "containers": [
          "product",
          "system",
          "system_ext",
          "vendor"
        ]
      },
      "value": {
        "Val": null
      }
    },
    {
      "flag_declaration": {
        "name": "RELEASE_USE_TRANSITIVE_JARS_IN_CLASSPATH",
        "namespace": "android_UNKNOWN",
        "description": "feature flag for enabling building with transitive classpaths",
        "value": {
          "Val": {
            "UnspecifiedValue": false
          }
        },
        "workflow": 1,
        "containers": [
          "product",
          "system",
          "system_ext",
          "vendor"
        ]
      },
      "value": {
        "Val": null
      }
    },
    {
      "flag_declaration": {
        "name": "RELEASE_USE_WEBVIEW_BOOTSTRAP_MODULE",
        "namespace": "android_UNKNOWN",
        "description": "b/318717084 - enable the WebViewBootstrap mainline module",
        "value": {
          "Val": {
            "BoolValue": false
          }
        },
        "workflow": 1,
        "containers": [
          "product",
          "system",
          "system_ext",
          "vendor"
        ]
      },
      "value": {
        "Val": {
          "BoolValue": false
        }
      }
    },
    {
      "flag_declaration": {
        "name": "RELEASE_WRITE_APPCOMPAT_OVERRIDE_SYSTEM_PROPERTIES",
        "namespace": "android_UNKNOWN",
        "description": "flag to enable the writing of appcompat override system properties. Not expected to go beyond trunk",
        "value": {
          "Val": {
            "BoolValue": false
          }
        },
        "workflow": 1,
        "containers": [
          "product",
          "system",
          "system_ext",
          "vendor"
        ]
      },
      "value": {
        "Val": {
          "BoolValue": false
        }
      }
    }
  ]
}