<?xml version="1.0" encoding="UTF-8" standalone="no"?>
<!DOCTYPE svg PUBLIC "-//W3C//DTD SVG 1.1//EN" "http://www.w3.org/Graphics/SVG/1.1/DTD/svg11.dtd">
<!-- Generated by Microsoft Visio, SVG Export Reporting-Queue.svg Activity -->
<svg xmlns="http://www.w3.org/2000/svg" xmlns:xlink="http://www.w3.org/1999/xlink" xmlns:ev="http://www.w3.org/2001/xml-events"
		xmlns:v="http://schemas.microsoft.com/visio/2003/SVGExtensions/" width="11.6929in" height="8.26772in"
		viewBox="0 0 841.89 595.276" xml:space="preserve" color-interpolation-filters="sRGB" class="st13">
	<v:documentProperties v:langID="1043" v:metric="true" v:viewMarkup="false">
		<v:userDefs>
			<v:ud v:nameU="msvNoAutoConnect" v:val="VT0(1):26"/>
			<v:ud v:nameU="visV14CFF" v:prompt="" v:val="VT0(1):26"/>
			<v:ud v:nameU="visFlowchartType" v:prompt="" v:val="VT4(CrossFunctional)"/>
		</v:userDefs>
	</v:documentProperties>

	<style type="text/css">
	<![CDATA[
		.st1 {fill:none;stroke:none;stroke-linecap:round;stroke-linejoin:round;stroke-width:0.75}
		.st2 {fill:#000000;font-family:Segoe UI;font-size:1.5em}
		.st3 {marker-end:url(#mrkr5-10);stroke:#000000;stroke-linecap:round;stroke-linejoin:round;stroke-width:0.75}
		.st4 {fill:#000000;fill-opacity:1;stroke:#000000;stroke-opacity:1;stroke-width:0.22935779816514}
		.st5 {fill:#ffffff;stroke:#000000;stroke-linecap:round;stroke-linejoin:round;stroke-width:0.75}
		.st6 {fill:#000000;font-family:Calibri;font-size:0.833336em}
		.st7 {fill:#000000}
		.st8 {stroke:#000000;stroke-linecap:round;stroke-linejoin:round;stroke-width:0.75}
		.st9 {fill:#000000;font-family:Calibri;font-size:0.499992em}
		.st10 {font-size:1em}
		.st11 {fill:#ffffff;stroke:none;stroke-linecap:butt;stroke-width:7.2}
		.st12 {fill:#000000;font-family:Calibri;font-size:0.666664em}
		.st13 {fill:none;fill-rule:evenodd;font-size:12px;overflow:visible;stroke-linecap:square;stroke-miterlimit:3}
	]]>
	</style>

	<defs id="Markers">
		<g id="lend5">
			<path d="M 2 1 L 0 0 L 1.98117 -0.993387 C 1.67173 -0.364515 1.67301 0.372641 1.98465 1.00043 " style="stroke:none"/>
		</g>
		<marker id="mrkr5-10" class="st4" v:arrowType="5" v:arrowSize="2" v:setback="7.63" refX="-7.63" orient="auto"
				markerUnits="strokeWidth" overflow="visible">
			<use xlink:href="#lend5" transform="scale(-4.36,-4.36) "/>
		</marker>
	</defs>
	<g v:mID="17" v:index="2" v:groupContext="foregroundPage">
		<title>Queue</title>
		<v:pageProperties v:drawingScale="0.0393701" v:pageScale="0.0393701" v:drawingUnits="24" v:shadowOffsetX="8.50394"
				v:shadowOffsetY="-8.50394"/>
		<v:layer v:name="Connector" v:index="0"/>
		<g id="shape130-1" v:mID="130" v:groupContext="shape" transform="translate(20.6929,-469.701)">
			<title>Sheet.130</title>
			<desc>Reporting</desc>
			<v:textBlock v:margins="rect(4,4,4,4)" v:tabSpace="42.5197" v:verticalAlign="0"/>
			<v:textRect cx="396.85" cy="542.835" width="793.71" height="104.882"/>
			<rect x="0" y="490.394" width="793.701" height="104.882" class="st1"/>
			<text x="710.89" y="510.59" class="st2" v:langID="1043"><v:paragraph v:horizAlign="2"/><v:tabList/>Reporting</text>		</g>
		<g id="group146-4" transform="translate(289.984,-220.252)" v:mID="146" v:groupContext="group">
			<title>Sheet.146</title>
			<g id="shape67-5" v:mID="67" v:groupContext="shape" v:layerMember="0" transform="translate(35.4331,-70.8661)">
				<title>Dynamic connector</title>
				<path d="M7.09 595.28 L7.09 617.9" class="st3"/>
			</g>
			<g id="shape69-11" v:mID="69" v:groupContext="shape" v:layerMember="0" transform="translate(120.472,-127.559)">
				<title>Dynamic connector.7</title>
				<path d="M7.09 595.28 L7.09 617.9" class="st3"/>
			</g>
			<g id="group112-16" transform="translate(-3.19744E-014,-56.6929)" v:mID="112" v:groupContext="group">
				<title>Sheet.112</title>
				<g id="shape113-17" v:mID="113" v:groupContext="shape">
					<title>Action.113</title>
					<v:custProps>
						<v:cp v:nameU="Function" v:lbl="" v:prompt="" v:type="0" v:format="" v:sortKey="" v:invis="false"
								v:ask="false" v:langID="1043" v:cal="0" v:val="VT4()"/>
					</v:custProps>
					<v:userDefs>
						<v:ud v:nameU="visVersion" v:prompt="" v:val="VT0(15):26"/>
					</v:userDefs>
					<rect x="0" y="538.583" width="85.0394" height="56.6929" rx="8.50394" ry="8.50394" class="st1"/>
				</g>
				<g id="shape114-19" v:mID="114" v:groupContext="shape" transform="translate(1.59872E-014,-14.1732)">
					<title>Action.106</title>
					<desc>Queue report line</desc>
					<v:custProps>
						<v:cp v:nameU="Function" v:lbl="" v:prompt="" v:type="0" v:format="" v:sortKey="" v:invis="false"
								v:ask="false" v:langID="1043" v:cal="0" v:val="VT4()"/>
					</v:custProps>
					<v:userDefs>
						<v:ud v:nameU="visVersion" v:prompt="" v:val="VT0(15):26"/>
					</v:userDefs>
					<v:textBlock v:margins="rect(4,4,4,4)" v:tabSpace="42.5197"/>
					<v:textRect cx="42.5197" cy="581.102" width="85.04" height="28.3465"/>
					<rect x="0" y="566.929" width="85.0394" height="28.3465" rx="8.50394" ry="8.50394" class="st5"/>
					<text x="6.34" y="584.1" class="st6" v:langID="1043"><v:paragraph v:horizAlign="1"/><v:tabList/>Queue report line</text>				</g>
			</g>
			<g id="group115-22" v:mID="115" v:groupContext="group">
				<title>Sheet.115</title>
				<g id="shape116-23" v:mID="116" v:groupContext="shape">
					<title>Action.108</title>
					<v:custProps>
						<v:cp v:nameU="Function" v:lbl="" v:prompt="" v:type="0" v:format="" v:sortKey="" v:invis="false"
								v:ask="false" v:langID="1043" v:cal="0" v:val="VT4()"/>
					</v:custProps>
					<v:userDefs>
						<v:ud v:nameU="visVersion" v:prompt="" v:val="VT0(15):26"/>
					</v:userDefs>
					<rect x="0" y="538.583" width="85.0394" height="56.6929" rx="8.50394" ry="8.50394" class="st1"/>
				</g>
				<g id="shape117-25" v:mID="117" v:groupContext="shape" transform="translate(28.3465,-14.1732)">
					<title>Final node.111</title>
					<v:custProps>
						<v:cp v:nameU="Function" v:lbl="" v:prompt="" v:type="0" v:format="" v:sortKey="" v:invis="false"
								v:ask="false" v:langID="1043" v:cal="0" v:val="VT4()"/>
					</v:custProps>
					<v:userDefs>
						<v:ud v:nameU="visVersion" v:prompt="" v:val="VT0(15):26"/>
					</v:userDefs>
					<path d="M25.51 581.1 A11.3386 11.3386 -180 1 0 2.83 581.1 A11.3386 11.3386 -180 1 0 25.51 581.1 Z" class="st7"/>
					<path d="M28.35 581.1 A14.1732 14.1732 -180 1 0 0 581.1 A14.1732 14.1732 -180 1 0 28.35 581.1" class="st8"/>
					<path d="M25.51 581.1 A11.3386 11.3386 -180 1 0 2.83 581.1 A11.3386 11.3386 -180 1 0 25.51 581.1" class="st8"/>
				</g>
			</g>
			<g id="group123-29" transform="translate(85.0394,-113.386)" v:mID="123" v:groupContext="group">
				<title>Sheet.123</title>
				<g id="shape124-30" v:mID="124" v:groupContext="shape" transform="translate(0,-28.3465)">
					<title>Sheet.124</title>
					<desc>API Trigger</desc>
					<v:textBlock v:margins="rect(4,4,4,4)" v:tabSpace="42.5197" v:verticalAlign="0"/>
					<v:textRect cx="21.2598" cy="581.102" width="42.52" height="28.3465"/>
					<rect x="0" y="566.929" width="42.5197" height="28.3465" class="st1"/>
					<text x="7.98" y="576.33" class="st9" v:langID="1043"><v:paragraph v:horizAlign="1"/><v:tabList/>API Trigger</text>				</g>
				<g id="shape125-33" v:mID="125" v:groupContext="shape" transform="translate(42.5197,-28.3465)">
					<title>Sheet.125</title>
					<v:textBlock v:margins="rect(4,4,4,4)" v:tabSpace="42.5197" v:verticalAlign="0"/>
					<rect x="0" y="566.929" width="42.5197" height="28.3465" class="st1"/>
				</g>
				<g id="shape126-35" v:mID="126" v:groupContext="shape" transform="translate(42.5197,0)">
					<title>Sheet.126</title>
					<v:textBlock v:margins="rect(4,4,4,4)" v:tabSpace="42.5197" v:verticalAlign="2"/>
					<rect x="0" y="566.929" width="42.5197" height="28.3465" class="st1"/>
				</g>
				<g id="shape127-37" v:mID="127" v:groupContext="shape">
					<title>Sheet.127</title>
					<v:textBlock v:margins="rect(4,4,4,4)" v:tabSpace="42.5197" v:verticalAlign="2"/>
					<rect x="0" y="566.929" width="42.5197" height="28.3465" class="st1"/>
				</g>
				<g id="shape128-39" v:mID="128" v:groupContext="shape" transform="translate(28.3465,-14.1732)">
					<title>Initial node.110</title>
					<v:custProps>
						<v:cp v:nameU="Function" v:lbl="" v:prompt="" v:type="0" v:format="" v:sortKey="" v:invis="false"
								v:ask="false" v:langID="1043" v:cal="0" v:val="VT4()"/>
					</v:custProps>
					<v:userDefs>
						<v:ud v:nameU="visVersion" v:prompt="" v:val="VT0(15):26"/>
					</v:userDefs>
					<ellipse cx="14.1732" cy="581.102" rx="14.1732" ry="14.1732" class="st5"/>
				</g>
			</g>
			<g id="group131-41" transform="translate(85.0394,-56.6929)" v:mID="131" v:groupContext="group">
				<title>Sheet.131</title>
				<g id="shape132-42" v:mID="132" v:groupContext="shape" transform="translate(28.3465,-14.1732)">
					<title>Decision.112</title>
					<v:custProps>
						<v:cp v:nameU="Function" v:lbl="" v:prompt="" v:type="0" v:format="" v:sortKey="" v:invis="false"
								v:ask="false" v:langID="1043" v:cal="0" v:val="VT4()"/>
					</v:custProps>
					<v:userDefs>
						<v:ud v:nameU="visVersion" v:prompt="" v:val="VT0(15):26"/>
					</v:userDefs>
					<path d="M14.17 595.28 L28.35 581.1 L14.17 566.93 L0 581.1 L14.17 595.28 Z" class="st5"/>
				</g>
				<g id="shape133-44" v:mID="133" v:groupContext="shape" transform="translate(0,-28.3465)">
					<title>Sheet.133</title>
					<desc>Model valid?</desc>
					<v:textBlock v:margins="rect(4,4,4,4)" v:tabSpace="42.5197" v:verticalAlign="0"/>
					<v:textRect cx="21.2598" cy="581.102" width="42.52" height="28.3465"/>
					<rect x="0" y="566.929" width="42.5197" height="28.3465" class="st1"/>
					<text x="13.36" y="576.33" class="st9" v:langID="1043"><v:paragraph v:horizAlign="1"/><v:tabList/>Model<v:lf/><tspan
								x="14.12" dy="1.2em" class="st10">valid</tspan>?  </text>				</g>
				<g id="shape134-48" v:mID="134" v:groupContext="shape" transform="translate(42.5197,-28.3465)">
					<title>Sheet.134</title>
					<v:textBlock v:margins="rect(4,4,4,4)" v:tabSpace="42.5197" v:verticalAlign="0"/>
					<rect x="0" y="566.929" width="42.5197" height="28.3465" class="st1"/>
				</g>
				<g id="shape135-50" v:mID="135" v:groupContext="shape" transform="translate(42.5197,0)">
					<title>Sheet.135</title>
					<v:textBlock v:margins="rect(4,4,4,4)" v:tabSpace="42.5197" v:verticalAlign="2"/>
					<rect x="0" y="566.929" width="42.5197" height="28.3465" class="st1"/>
				</g>
				<g id="shape136-52" v:mID="136" v:groupContext="shape">
					<title>Sheet.136</title>
					<v:textBlock v:margins="rect(4,4,4,4)" v:tabSpace="42.5197" v:verticalAlign="2"/>
					<rect x="0" y="566.929" width="42.5197" height="28.3465" class="st1"/>
				</g>
			</g>
			<g id="shape137-54" v:mID="137" v:groupContext="shape" v:layerMember="0" transform="translate(205.512,-70.8661)">
				<title>Dynamic connector.137</title>
				<path d="M7.09 595.28 L7.09 617.9" class="st3"/>
			</g>
			<g id="group138-59" transform="translate(170.079,-56.6929)" v:mID="138" v:groupContext="group">
				<title>Sheet.138</title>
				<g id="shape139-60" v:mID="139" v:groupContext="shape">
					<title>Action.113</title>
					<v:custProps>
						<v:cp v:nameU="Function" v:lbl="" v:prompt="" v:type="0" v:format="" v:sortKey="" v:invis="false"
								v:ask="false" v:langID="1043" v:cal="0" v:val="VT4()"/>
					</v:custProps>
					<v:userDefs>
						<v:ud v:nameU="visVersion" v:prompt="" v:val="VT0(15):26"/>
					</v:userDefs>
					<rect x="0" y="538.583" width="85.0394" height="56.6929" rx="8.50394" ry="8.50394" class="st1"/>
				</g>
				<g id="shape140-62" v:mID="140" v:groupContext="shape" transform="translate(1.59872E-014,-14.1732)">
					<title>Action.106</title>
					<desc>Respond with error code</desc>
					<v:custProps>
						<v:cp v:nameU="Function" v:lbl="" v:prompt="" v:type="0" v:format="" v:sortKey="" v:invis="false"
								v:ask="false" v:langID="1043" v:cal="0" v:val="VT4()"/>
					</v:custProps>
					<v:userDefs>
						<v:ud v:nameU="visVersion" v:prompt="" v:val="VT0(15):26"/>
					</v:userDefs>
					<v:textBlock v:margins="rect(4,4,4,4)" v:tabSpace="42.5197"/>
					<v:textRect cx="42.5197" cy="581.102" width="85.04" height="28.3465"/>
					<rect x="0" y="566.929" width="85.0394" height="28.3465" rx="8.50394" ry="8.50394" class="st5"/>
					<text x="14.69" y="578.1" class="st6" v:langID="1043"><v:paragraph v:horizAlign="1"/><v:tabList/>Respond with <tspan
								x="21.17" dy="1.2em" class="st10">error code</tspan></text>				</g>
			</g>
			<g id="group141-66" transform="translate(170.079,0)" v:mID="141" v:groupContext="group">
				<title>Sheet.141</title>
				<g id="shape142-67" v:mID="142" v:groupContext="shape">
					<title>Action.108</title>
					<v:custProps>
						<v:cp v:nameU="Function" v:lbl="" v:prompt="" v:type="0" v:format="" v:sortKey="" v:invis="false"
								v:ask="false" v:langID="1043" v:cal="0" v:val="VT4()"/>
					</v:custProps>
					<v:userDefs>
						<v:ud v:nameU="visVersion" v:prompt="" v:val="VT0(15):26"/>
					</v:userDefs>
					<rect x="0" y="538.583" width="85.0394" height="56.6929" rx="8.50394" ry="8.50394" class="st1"/>
				</g>
				<g id="shape143-69" v:mID="143" v:groupContext="shape" transform="translate(28.3465,-14.1732)">
					<title>Final node.111</title>
					<v:custProps>
						<v:cp v:nameU="Function" v:lbl="" v:prompt="" v:type="0" v:format="" v:sortKey="" v:invis="false"
								v:ask="false" v:langID="1043" v:cal="0" v:val="VT4()"/>
					</v:custProps>
					<v:userDefs>
						<v:ud v:nameU="visVersion" v:prompt="" v:val="VT0(15):26"/>
					</v:userDefs>
					<path d="M25.51 581.1 A11.3386 11.3386 -180 1 0 2.83 581.1 A11.3386 11.3386 -180 1 0 25.51 581.1 Z" class="st7"/>
					<path d="M28.35 581.1 A14.1732 14.1732 -180 1 0 0 581.1 A14.1732 14.1732 -180 1 0 28.35 581.1" class="st8"/>
					<path d="M25.51 581.1 A11.3386 11.3386 -180 1 0 2.83 581.1 A11.3386 11.3386 -180 1 0 25.51 581.1" class="st8"/>
				</g>
			</g>
			<g id="shape144-73" v:mID="144" v:groupContext="shape" v:layerMember="0" transform="translate(113.386,-77.9528)">
				<title>Dynamic connector.144</title>
				<desc>Yes</desc>
				<v:textBlock v:margins="rect(4,4,4,4)" v:tabSpace="42.5197"/>
				<v:textRect cx="-14.1732" cy="588.189" width="40" height="17.6036"/>
				<path d="M0 588.19 L-22.62 588.19" class="st3"/>
				<rect v:rectContext="textBkgnd" x="-19.677" y="583.389" width="11.0078" height="9.59985" class="st11"/>
				<text x="-19.68" y="590.59" class="st12" v:langID="1043"><v:paragraph v:horizAlign="1"/><v:tabList/>Yes</text>			</g>
			<g id="shape145-80" v:mID="145" v:groupContext="shape" v:layerMember="0" transform="translate(141.732,-77.9528)">
				<title>Dynamic connector.145</title>
				<desc>No</desc>
				<v:textBlock v:margins="rect(4,4,4,4)" v:tabSpace="42.5197"/>
				<v:textRect cx="14.1732" cy="588.189" width="40" height="17.6036"/>
				<path d="M0 588.19 L22.62 588.19" class="st3"/>
				<rect v:rectContext="textBkgnd" x="9.48185" y="583.389" width="9.38287" height="9.59985" class="st11"/>
				<text x="9.48" y="590.59" class="st12" v:langID="1043"><v:paragraph v:horizAlign="1"/><v:tabList/>No</text>			</g>
		</g>
	</g>
</svg>
