<?xml version="1.0" encoding="UTF-8" standalone="no"?>
<!DOCTYPE svg PUBLIC "-//W3C//DTD SVG 1.1//EN" "http://www.w3.org/Graphics/SVG/1.1/DTD/svg11.dtd">
<!-- Generated by Microsoft Visio, SVG Export Products-ListProducts.svg List Products -->
<svg xmlns="http://www.w3.org/2000/svg" xmlns:xlink="http://www.w3.org/1999/xlink" xmlns:ev="http://www.w3.org/2001/xml-events"
		xmlns:v="http://schemas.microsoft.com/visio/2003/SVGExtensions/" width="11.6929in" height="8.26772in"
		viewBox="0 0 841.89 595.276" xml:space="preserve" color-interpolation-filters="sRGB" class="st11">
	<v:documentProperties v:langID="1043" v:metric="true" v:viewMarkup="false">
		<v:userDefs>
			<v:ud v:nameU="msvNoAutoConnect" v:val="VT0(1):26"/>
		</v:userDefs>
	</v:documentProperties>

	<style type="text/css">
	<![CDATA[
		.st1 {fill:none;stroke:none;stroke-linecap:round;stroke-linejoin:round;stroke-width:0.75}
		.st2 {fill:#000000;font-family:Calibri;font-size:0.499992em}
		.st3 {font-size:1em}
		.st4 {fill:#ffffff;stroke:#000000;stroke-linecap:round;stroke-linejoin:round;stroke-width:0.75}
		.st5 {fill:#000000;font-family:Calibri;font-size:0.75em}
		.st6 {fill:#000000}
		.st7 {stroke:#000000;stroke-linecap:round;stroke-linejoin:round;stroke-width:0.75}
		.st8 {marker-end:url(#mrkr5-34);stroke:#000000;stroke-linecap:round;stroke-linejoin:round;stroke-width:0.75}
		.st9 {fill:#000000;fill-opacity:1;stroke:#000000;stroke-opacity:1;stroke-width:0.22935779816514}
		.st10 {fill:#000000;font-family:Segoe UI;font-size:1.5em}
		.st11 {fill:none;fill-rule:evenodd;font-size:12px;overflow:visible;stroke-linecap:square;stroke-miterlimit:3}
	]]>
	</style>

	<defs id="Markers">
		<g id="lend5">
			<path d="M 2 1 L 0 0 L 1.98117 -0.993387 C 1.67173 -0.364515 1.67301 0.372641 1.98465 1.00043 " style="stroke:none"/>
		</g>
		<marker id="mrkr5-34" class="st9" v:arrowType="5" v:arrowSize="2" v:setback="7.63" refX="-7.63" orient="auto"
				markerUnits="strokeWidth" overflow="visible">
			<use xlink:href="#lend5" transform="scale(-4.36,-4.36) "/>
		</marker>
	</defs>
	<g v:mID="4" v:index="2" v:groupContext="foregroundPage">
		<title>List Products</title>
		<v:pageProperties v:drawingScale="0.0393701" v:pageScale="0.0393701" v:drawingUnits="24" v:shadowOffsetX="8.50394"
				v:shadowOffsetY="-8.50394"/>
		<v:layer v:name="Connector" v:index="0"/>
		<g id="group21-1" transform="translate(382.677,-198.425)" v:mID="21" v:groupContext="group">
			<title>Sheet.21</title>
			<g id="group1-2" transform="translate(1.1191E-013,-113.386)" v:mID="1" v:groupContext="group">
				<title>Sheet.1</title>
				<g id="shape2-3" v:mID="2" v:groupContext="shape" transform="translate(0,-28.3465)">
					<title>Sheet.2</title>
					<desc>API Trigger</desc>
					<v:textBlock v:margins="rect(4,4,4,4)" v:tabSpace="42.5197" v:verticalAlign="0"/>
					<v:textRect cx="21.2598" cy="581.102" width="42.52" height="28.3465"/>
					<rect x="0" y="566.929" width="42.5197" height="28.3465" class="st1"/>
					<text x="17.22" y="576.33" class="st2" v:langID="1043"><v:paragraph v:horizAlign="1"/><v:tabList/>API<v:lf/><tspan
								x="12.7" dy="1.2em" class="st3">Trigger</tspan></text>				</g>
				<g id="shape3-7" v:mID="3" v:groupContext="shape" transform="translate(42.5197,-28.3465)">
					<title>Sheet.3</title>
					<v:textBlock v:margins="rect(4,4,4,4)" v:tabSpace="42.5197" v:verticalAlign="0"/>
					<rect x="0" y="566.929" width="42.5197" height="28.3465" class="st1"/>
				</g>
				<g id="shape4-9" v:mID="4" v:groupContext="shape" transform="translate(42.5197,0)">
					<title>Sheet.4</title>
					<v:textBlock v:margins="rect(4,4,4,4)" v:tabSpace="42.5197" v:verticalAlign="2"/>
					<rect x="0" y="566.929" width="42.5197" height="28.3465" class="st1"/>
				</g>
				<g id="shape5-11" v:mID="5" v:groupContext="shape">
					<title>Sheet.5</title>
					<v:textBlock v:margins="rect(4,4,4,4)" v:tabSpace="42.5197" v:verticalAlign="2"/>
					<rect x="0" y="566.929" width="42.5197" height="28.3465" class="st1"/>
				</g>
				<g id="shape6-13" v:mID="6" v:groupContext="shape" transform="translate(28.3465,-14.1732)">
					<title>Initial node.110</title>
					<v:custProps>
						<v:cp v:nameU="Function" v:lbl="" v:prompt="" v:type="0" v:format="" v:sortKey="" v:invis="false"
								v:ask="false" v:langID="1043" v:cal="0" v:val="VT4()"/>
					</v:custProps>
					<v:userDefs>
						<v:ud v:nameU="visVersion" v:prompt="" v:val="VT0(15):26"/>
					</v:userDefs>
					<ellipse cx="14.1732" cy="581.102" rx="14.1732" ry="14.1732" class="st4"/>
				</g>
			</g>
			<g id="group13-15" transform="translate(1.59872E-014,-56.6929)" v:mID="13" v:groupContext="group">
				<title>Sheet.13</title>
				<g id="shape14-16" v:mID="14" v:groupContext="shape">
					<title>Action.113</title>
					<v:custProps>
						<v:cp v:nameU="Function" v:lbl="" v:prompt="" v:type="0" v:format="" v:sortKey="" v:invis="false"
								v:ask="false" v:langID="1043" v:cal="0" v:val="VT4()"/>
					</v:custProps>
					<v:userDefs>
						<v:ud v:nameU="visVersion" v:prompt="" v:val="VT0(15):26"/>
					</v:userDefs>
					<rect x="0" y="538.583" width="85.0394" height="56.6929" rx="8.50394" ry="8.50394" class="st1"/>
				</g>
				<g id="shape15-18" v:mID="15" v:groupContext="shape" transform="translate(1.59872E-014,-14.1732)">
					<title>Action.106</title>
					<desc>Return list of all products</desc>
					<v:custProps>
						<v:cp v:nameU="Function" v:lbl="" v:prompt="" v:type="0" v:format="" v:sortKey="" v:invis="false"
								v:ask="false" v:langID="1043" v:cal="0" v:val="VT4()"/>
					</v:custProps>
					<v:userDefs>
						<v:ud v:nameU="visVersion" v:prompt="" v:val="VT0(15):26"/>
					</v:userDefs>
					<v:textBlock v:margins="rect(4,4,4,4)" v:tabSpace="42.5197"/>
					<v:textRect cx="42.5197" cy="581.102" width="85.04" height="28.3465"/>
					<rect x="0" y="566.929" width="85.0394" height="28.3465" rx="8.50394" ry="8.50394" class="st4"/>
					<text x="13.68" y="578.4" class="st5" v:langID="1043"><v:paragraph v:horizAlign="1"/><v:tabList/>Return list of all <tspan
								x="26.32" dy="1.2em" class="st3">products</tspan></text>				</g>
			</g>
			<g id="group16-22" v:mID="16" v:groupContext="group">
				<title>Sheet.16</title>
				<g id="shape17-23" v:mID="17" v:groupContext="shape">
					<title>Action.108</title>
					<v:custProps>
						<v:cp v:nameU="Function" v:lbl="" v:prompt="" v:type="0" v:format="" v:sortKey="" v:invis="false"
								v:ask="false" v:langID="1043" v:cal="0" v:val="VT4()"/>
					</v:custProps>
					<v:userDefs>
						<v:ud v:nameU="visVersion" v:prompt="" v:val="VT0(15):26"/>
					</v:userDefs>
					<rect x="0" y="538.583" width="85.0394" height="56.6929" rx="8.50394" ry="8.50394" class="st1"/>
				</g>
				<g id="shape18-25" v:mID="18" v:groupContext="shape" transform="translate(28.3465,-14.1732)">
					<title>Final node.111</title>
					<v:custProps>
						<v:cp v:nameU="Function" v:lbl="" v:prompt="" v:type="0" v:format="" v:sortKey="" v:invis="false"
								v:ask="false" v:langID="1043" v:cal="0" v:val="VT4()"/>
					</v:custProps>
					<v:userDefs>
						<v:ud v:nameU="visVersion" v:prompt="" v:val="VT0(15):26"/>
					</v:userDefs>
					<path d="M25.51 581.1 A11.3386 11.3386 -180 1 0 2.83 581.1 A11.3386 11.3386 -180 1 0 25.51 581.1 Z" class="st6"/>
					<path d="M28.35 581.1 A14.1732 14.1732 -180 1 0 0 581.1 A14.1732 14.1732 -180 1 0 28.35 581.1" class="st7"/>
					<path d="M25.51 581.1 A11.3386 11.3386 -180 1 0 2.83 581.1 A11.3386 11.3386 -180 1 0 25.51 581.1" class="st7"/>
				</g>
			</g>
			<g id="shape19-29" v:mID="19" v:groupContext="shape" v:layerMember="0" transform="translate(35.4331,-127.559)">
				<title>Dynamic connector</title>
				<path d="M7.09 595.28 L7.09 617.9" class="st8"/>
			</g>
			<g id="shape20-35" v:mID="20" v:groupContext="shape" v:layerMember="0" transform="translate(35.4331,-70.8661)">
				<title>Dynamic connector.20</title>
				<path d="M7.09 595.28 L7.09 617.9" class="st8"/>
			</g>
		</g>
		<g id="shape24-40" v:mID="24" v:groupContext="shape" transform="translate(28.3465,-471.969)">
			<title>Sheet.24</title>
			<desc>Products</desc>
			<v:textBlock v:margins="rect(4,4,4,4)" v:tabSpace="42.5197" v:verticalAlign="0"/>
			<v:textRect cx="396.85" cy="542.835" width="793.71" height="104.882"/>
			<rect x="0" y="490.394" width="793.701" height="104.882" class="st1"/>
			<text x="719.98" y="510.59" class="st10" v:langID="1043"><v:paragraph v:horizAlign="2"/><v:tabList/>Products</text>		</g>
	</g>
</svg>
