<?xml version="1.0" encoding="UTF-8" standalone="no"?>
<!DOCTYPE svg PUBLIC "-//W3C//DTD SVG 1.1//EN" "http://www.w3.org/Graphics/SVG/1.1/DTD/svg11.dtd">
<!-- Generated by Microsoft Visio, SVG Export Cleanup-Network.svg Network -->
<svg xmlns="http://www.w3.org/2000/svg" xmlns:xlink="http://www.w3.org/1999/xlink" xmlns:ev="http://www.w3.org/2001/xml-events"
		xmlns:v="http://schemas.microsoft.com/visio/2003/SVGExtensions/" width="11.6929in" height="8.26772in"
		viewBox="0 0 841.89 595.276" xml:space="preserve" color-interpolation-filters="sRGB" class="st13">
	<v:documentProperties v:langID="1043" v:metric="true" v:viewMarkup="false">
		<v:userDefs>
			<v:ud v:nameU="msvNoAutoConnect" v:val="VT0(1):26"/>
		</v:userDefs>
	</v:documentProperties>

	<style type="text/css">
	<![CDATA[
		.st1 {fill:none;stroke:none;stroke-linecap:round;stroke-linejoin:round;stroke-width:0.75}
		.st2 {fill:#0078d7;font-family:Segoe UI;font-size:0.75em}
		.st3 {fill:none;stroke:none;stroke-linecap:round;stroke-linejoin:round;stroke-width:0.24}
		.st4 {fill:#0078d7;stroke:none;stroke-linecap:butt;stroke-width:0.75}
		.st5 {fill:#0078d7;stroke:none;stroke-linecap:butt;stroke-width:0.772727}
		.st6 {font-size:1em}
		.st7 {fill:#0078d7;stroke:none;stroke-linecap:butt;stroke-width:0.24}
		.st8 {marker-end:url(#mrkr13-58);stroke:#000000;stroke-linecap:round;stroke-linejoin:round;stroke-width:0.75}
		.st9 {fill:#000000;fill-opacity:1;stroke:#000000;stroke-opacity:1;stroke-width:0.22935779816514}
		.st10 {marker-end:url(#mrkr13-64);stroke:#ea700d;stroke-linecap:round;stroke-linejoin:round;stroke-width:0.75}
		.st11 {fill:#ea700d;fill-opacity:1;stroke:#ea700d;stroke-opacity:1;stroke-width:0.22935779816514}
		.st12 {fill:#0078d7;font-family:Segoe UI;font-size:4.00001em}
		.st13 {fill:none;fill-rule:evenodd;font-size:12px;overflow:visible;stroke-linecap:square;stroke-miterlimit:3}
	]]>
	</style>

	<defs id="Markers">
		<g id="lend13">
			<path d="M 3 1 L 0 0 L 3 -1 L 3 1 " style="stroke:none"/>
		</g>
		<marker id="mrkr13-58" class="st9" v:arrowType="13" v:arrowSize="2" v:setback="13.08" refX="-13.08" orient="auto"
				markerUnits="strokeWidth" overflow="visible">
			<use xlink:href="#lend13" transform="scale(-4.36,-4.36) "/>
		</marker>
		<marker id="mrkr13-64" class="st11" v:arrowType="13" v:arrowSize="2" v:setback="13.08" refX="-13.08" orient="auto"
				markerUnits="strokeWidth" overflow="visible">
			<use xlink:href="#lend13" transform="scale(-4.36,-4.36) "/>
		</marker>
	</defs>
	<g v:mID="0" v:index="1" v:groupContext="foregroundPage">
		<title>Network</title>
		<v:pageProperties v:drawingScale="0.0393701" v:pageScale="0.0393701" v:drawingUnits="24" v:shadowOffsetX="8.50394"
				v:shadowOffsetY="-8.50394"/>
		<v:layer v:name="Connector" v:index="0"/>
		<g id="group96-1" transform="translate(255.118,-236.32)" v:mID="96" v:groupContext="group">
			<title>Sheet.96</title>
			<g id="group97-2" v:mID="97" v:groupContext="group">
				<title>Sheet.97</title>
				<g id="group98-3" v:mID="98" v:groupContext="group">
					<title>Sheet.98</title>
					<g id="shape99-4" v:mID="99" v:groupContext="shape">
						<title>Sheet.99</title>
						<desc>Assets FTP</desc>
						<v:textBlock v:margins="rect(4,4,4,4)" v:tabSpace="42.5197" v:verticalAlign="0"/>
						<v:textRect cx="56.6929" cy="580.604" width="113.39" height="29.3442"/>
						<rect x="0" y="565.931" width="113.386" height="29.3442" class="st1"/>
						<text x="35.88" y="580.73" class="st2" v:langID="1043"><v:paragraph v:horizAlign="1"/><v:tabList/>Assets FTP</text>					</g>
					<g id="group100-7" transform="translate(0,-29.3442)" v:mID="100" v:groupContext="group">
						<title>Sheet.100</title>
						<g id="shape101-8" v:mID="101" v:groupContext="shape">
							<title>Box</title>
							<v:userDefs>
								<v:ud v:nameU="visVersion" v:val="VT0(15):26"/>
							</v:userDefs>
							<rect x="0" y="530.331" width="113.386" height="64.9447" class="st3"/>
						</g>
						<g id="shape102-10" v:mID="102" v:groupContext="shape" transform="translate(34.3672,-11.5766)">
							<title>Box.261</title>
							<v:userDefs>
								<v:ud v:nameU="visVersion" v:val="VT0(15):26"/>
							</v:userDefs>
							<rect x="0" y="553.484" width="44.6513" height="41.7916" class="st3"/>
						</g>
					</g>
				</g>
				<g id="group103-12" transform="translate(35.6697,-41.9309)" v:mID="103" v:groupContext="group">
					<title>Virtual Machine symbol only</title>
					<g id="shape104-13" v:mID="104" v:groupContext="shape">
						<title>Sheet.104</title>
						<path d="M39.51 557.61 L2.28 557.61 C1.01 557.61 0 558.71 0 559.93 L0 585.12 C0 586.34 1.01 587.43 2.28 587.43
									 L15.03 587.43 C16.4 592.14 14.55 592.81 6.47 592.81 L6.47 595.28 L16.75 595.28 L24.26 595.28
									 L33.96 595.28 L33.96 592.81 C25.87 592.81 25.08 592.14 26.45 587.43 L39.51 587.43 C40.76 587.43
									 42.05 586.34 42.05 585.12 L42.05 559.93 C42.05 558.71 40.76 557.61 39.51 557.61 ZM38.81 560.75
									 L38.81 584.29 L3.23 584.29 L3.23 560.75 L38.92 560.69 L38.81 560.75 Z" class="st4"/>
					</g>
					<g id="group105-15" transform="translate(13.4236,-15.1112)" v:mID="105" v:groupContext="group">
						<title>Sheet.105</title>
						<g id="group106-16" transform="translate(0.667019,-8.30955)" v:mID="106" v:groupContext="group">
							<title>Sheet.106</title>
							<g id="shape107-17" v:mID="107" v:groupContext="shape">
								<title>Sheet.107</title>
								<path d="M13.04 591.53 L6.52 587.88 L0 591.53 L0 591.62 L6.52 595.28 L13.04 591.62 L13.04 591.53 Z"
										class="st4"/>
							</g>
						</g>
						<g id="group108-19" transform="translate(7.85532,1.13687E-013)" v:mID="108" v:groupContext="group">
							<title>Sheet.108</title>
							<g id="shape109-20" v:mID="109" v:groupContext="shape">
								<title>Sheet.109</title>
								<path d="M0 588.05 L0 595.28 L6.52 591.62 L6.52 584.4 L0 588.05 Z" class="st4"/>
							</g>
						</g>
						<g id="group110-22" v:mID="110" v:groupContext="group">
							<title>Sheet.110</title>
							<g id="shape111-23" v:mID="111" v:groupContext="shape">
								<title>Sheet.111</title>
								<path d="M6.52 588.05 L0 584.4 L0 591.62 L6.52 595.28 L6.52 588.05 Z" class="st4"/>
							</g>
						</g>
					</g>
				</g>
			</g>
			<g id="group112-25" transform="translate(226.772,0)" v:mID="112" v:groupContext="group">
				<title>Sheet.112</title>
				<g id="group113-26" v:mID="113" v:groupContext="group">
					<title>Sheet.113</title>
					<g id="shape114-27" v:mID="114" v:groupContext="shape">
						<title>Sheet.114</title>
						<desc>Azure Key Vault</desc>
						<v:textBlock v:margins="rect(4,4,4,4)" v:tabSpace="42.5197" v:verticalAlign="0"/>
						<v:textRect cx="56.6929" cy="580.604" width="113.39" height="29.3442"/>
						<rect x="0" y="565.931" width="113.386" height="29.3442" class="st1"/>
						<text x="25.44" y="580.73" class="st2" v:langID="1043"><v:paragraph v:horizAlign="1"/><v:tabList/>Azure Key Vault</text>					</g>
					<g id="group115-30" transform="translate(0,-29.3442)" v:mID="115" v:groupContext="group">
						<title>Sheet.115</title>
						<g id="shape116-31" v:mID="116" v:groupContext="shape">
							<title>Box</title>
							<v:userDefs>
								<v:ud v:nameU="visVersion" v:val="VT0(15):26"/>
							</v:userDefs>
							<rect x="0" y="530.331" width="113.386" height="64.9447" class="st3"/>
						</g>
						<g id="shape117-33" v:mID="117" v:groupContext="shape" transform="translate(34.3672,-11.5766)">
							<title>Box.261</title>
							<v:userDefs>
								<v:ud v:nameU="visVersion" v:val="VT0(15):26"/>
							</v:userDefs>
							<rect x="0" y="553.484" width="44.6513" height="41.7916" class="st3"/>
						</g>
					</g>
				</g>
				<g id="group118-35" transform="translate(39.3838,-42.5369)" v:mID="118" v:groupContext="group">
					<title>Key Vault</title>
					<g id="shape119-36" v:mID="119" v:groupContext="shape">
						<title>Sheet.119</title>
						<path d="M34.62 578.04 C34.62 572.4 31.91 567.46 27.82 564.29 C27.82 564.44 27.82 564.68 27.82 564.83 C27.82
									 566.53 27.35 568.15 26.66 569.54 C28.67 571.78 29.9 574.72 29.9 577.97 C29.9 584.92 24.26 590.56
									 17.31 590.56 C10.35 590.56 4.71 584.92 4.71 577.97 C4.71 574.49 6.1 571.4 8.35 569.08 C7.73
									 567.77 7.34 566.3 7.34 564.75 C7.34 564.44 7.34 564.06 7.42 563.75 C2.94 566.84 0 572.09 0 577.97
									 C-0 587.55 7.73 595.28 17.31 595.28 C26.89 595.28 34.62 587.63 34.62 578.04 Z" class="st5"/>
					</g>
					<g id="shape120-38" v:mID="120" v:groupContext="shape" transform="translate(9.58182,-8.11364)">
						<title>Sheet.120</title>
						<path d="M7.96 564.83 C3.55 564.83 0 568.38 0 572.79 C0 576.42 2.4 579.43 5.72 580.44 L5.72 588.32 L2.01
									 588.32 L2.01 592.34 L5.72 592.34 L5.72 595.28 L10.12 595.28 L10.12 580.44 C13.45 579.51 15.84
									 576.42 15.84 572.79 C15.92 568.38 12.36 564.83 7.96 564.83 ZM7.96 569 C10.05 569 11.75 570.7
									 11.75 572.79 C11.75 574.88 10.05 576.58 7.96 576.58 C5.87 576.58 4.17 574.88 4.17 572.79 C4.17
									 570.7 5.87 569 7.96 569 Z" class="st5"/>
					</g>
				</g>
			</g>
			<g id="group121-40" transform="translate(113.386,-7.95808E-013)" v:mID="121" v:groupContext="group">
				<title>Sheet.121</title>
				<g id="group122-41" v:mID="122" v:groupContext="group">
					<title>Sheet.122</title>
					<g id="shape123-42" v:mID="123" v:groupContext="shape">
						<title>Sheet.123</title>
						<desc>Cleanup processed files [Scheduled]</desc>
						<v:textBlock v:margins="rect(4,4,4,4)" v:tabSpace="42.5197" v:verticalAlign="0"/>
						<v:textRect cx="56.6929" cy="580.604" width="113.39" height="29.3442"/>
						<rect x="0" y="565.931" width="113.386" height="29.3442" class="st1"/>
						<text x="10.02" y="578.03" class="st2" v:langID="1043"><v:paragraph v:horizAlign="1"/><v:tabList/>Cleanup processed files<v:lf/><tspan
									x="33.32" dy="1.5em" class="st6">[</tspan>Scheduled]</text>					</g>
					<g id="group124-46" transform="translate(0,-29.3442)" v:mID="124" v:groupContext="group">
						<title>Sheet.124</title>
						<g id="shape125-47" v:mID="125" v:groupContext="shape">
							<title>Box</title>
							<v:userDefs>
								<v:ud v:nameU="visVersion" v:val="VT0(15):26"/>
							</v:userDefs>
							<rect x="0" y="530.331" width="113.386" height="64.9447" class="st3"/>
						</g>
						<g id="shape126-49" v:mID="126" v:groupContext="shape" transform="translate(34.3672,-11.5766)">
							<title>Box.261</title>
							<v:userDefs>
								<v:ud v:nameU="visVersion" v:val="VT0(15):26"/>
							</v:userDefs>
							<rect x="0" y="553.484" width="44.6513" height="41.7916" class="st3"/>
						</g>
					</g>
				</g>
				<g id="shape127-51" v:mID="127" v:groupContext="shape" transform="translate(34.7847,-42.4017)">
					<title>Azure Functions (nc)</title>
					<path d="M32.57 556.09 L19.23 556.09 L12.05 575.75 L20.8 575.82 L13.96 595.28 L32.84 569.31 L23.68 569.31 L32.57
								 556.09 ZM0.28 575.95 L2.4 578.27 L2.47 578.34 L12.05 587.24 C12.39 587.57 13.14 587.64 13.55 587.24
								 C13.96 586.84 13.96 586.11 13.55 585.71 L3.63 575.95 C3.22 575.55 3.22 574.82 3.63 574.42 L13.35
								 564.99 C13.9 564.59 13.76 563.86 13.35 563.47 C12.87 563.07 12.25 563.07 11.84 563.47 L2.4 572.36
								 L0.28 574.42 C-0.06 574.82 -0.13 575.55 0.28 575.95 ZM43.52 575.95 C43.93 575.55 43.86 574.82 43.52
								 574.42 L41.39 572.36 L31.95 563.47 C31.54 563.07 30.93 563.07 30.45 563.47 C30.04 563.86 29.9 564.59
								 30.45 564.99 L40.37 574.42 C40.78 574.82 40.78 575.55 40.37 575.95 L30.24 585.71 C29.83 586.11 29.83
								 586.84 30.24 587.24 C30.66 587.64 31.41 587.57 31.75 587.24 L41.12 578.21 L41.19 578.14 L43.52 575.95
								 Z" class="st7"/>
				</g>
			</g>
			<g id="shape128-53" v:mID="128" v:groupContext="shape" v:layerMember="0" transform="translate(147.753,-54.7299)">
				<title>Dynamic connector.236</title>
				<path d="M0 588.19 L-58.92 588.19" class="st8"/>
			</g>
			<g id="shape129-59" v:mID="129" v:groupContext="shape" v:layerMember="0" transform="translate(192.404,-54.7299)">
				<title>Dynamic connector.237</title>
				<path d="M0 588.19 L58.92 588.19" class="st10"/>
			</g>
		</g>
		<g id="shape130-65" v:mID="130" v:groupContext="shape" transform="translate(28.3465,-471.969)">
			<title>Sheet.130</title>
			<desc>Cleanup</desc>
			<v:textBlock v:margins="rect(4,4,4,4)" v:tabSpace="42.5197"/>
			<v:textRect cx="396.85" cy="542.835" width="793.71" height="104.882"/>
			<rect x="0" y="490.394" width="793.701" height="104.882" class="st1"/>
			<text x="310.14" y="557.23" class="st12" v:langID="1043"><v:paragraph v:horizAlign="1"/><v:tabList/>Cleanup</text>		</g>
	</g>
</svg>
