{
    "direction":"ltr",
    "typography":{
        "fontFamily":"crayond_regular"
    },
    "palette": {
        "mode":"light",
        "primary": {
            "light": "#F78E99",
            "main": "#F67280",
            "dark": "#AC4F59",
            "contrastText": "#fff"
        },
        "secondary": {
            "light": "#766dde",
            "main": "#5449d6",
            "dark": "#3a3395",
            "contrastText": "#fff"
        },
        "error": {
            "light": "#e57373",
            "main": "#f44336",
            "dark": "#d32f2f",
            "contrastText": "#fff"
        }
    }
}