<svg xmlns="http://www.w3.org/2000/svg" width="19.481" height="24" viewBox="0 0 19.481 24">
  <g id="form" transform="translate(-48.2)">
    <path id="Path_212" data-name="Path 212" d="M142.468,383.467h1.579v1.579h-1.579Z" transform="translate(-89.843 -365.47)" fill="#616161"/>
    <path id="Path_213" data-name="Path 213" d="M336.426,14.306h4.359l-5.519-5.519v4.359A1.161,1.161,0,0,0,336.426,14.306Z" transform="translate(-273.508 -8.382)" fill="#616161"/>
    <path id="Path_214" data-name="Path 214" d="M142.468,254.933h1.579v1.579h-1.579Z" transform="translate(-89.843 -242.969)" fill="#616161"/>
    <path id="Path_215" data-name="Path 215" d="M62.836,7.431A2.589,2.589,0,0,1,60.25,4.845V0H50.786A2.589,2.589,0,0,0,48.2,2.586V21.414A2.589,2.589,0,0,0,50.786,24H65.1a2.589,2.589,0,0,0,2.586-2.586V7.431Zm-1.883,3.112a.7.7,0,0,1,0,1.406H57.941a.7.7,0,0,1,0-1.406ZM51.916,3.766h3.766a.7.7,0,0,1,0,1.406H51.916a.7.7,0,1,1,0-1.406Zm0,3.013h6.025a.7.7,0,0,1,0,1.406H51.916a.7.7,0,1,1,0-1.406Zm3.716,13.506a.7.7,0,0,1-.7.7H51.916a.7.7,0,0,1-.7-.7V17.272a.7.7,0,0,1,.7-.7h3.012a.7.7,0,0,1,.7.7Zm0-6.025a.7.7,0,0,1-.7.7H51.916a.7.7,0,0,1-.7-.7V11.247a.7.7,0,0,1,.7-.7h3.012a.7.7,0,0,1,.7.7Zm8.334,6.728H57.941a.7.7,0,0,1,0-1.406h6.025a.7.7,0,1,1,0,1.406Zm-6.728-3.716a.7.7,0,0,1,.7-.7h3.012a.7.7,0,0,1,0,1.406H57.941A.7.7,0,0,1,57.238,17.272Zm6.728-2.309H57.941a.7.7,0,0,1,0-1.406h6.025a.7.7,0,1,1,0,1.406Z" fill="#616161"/>
  </g>
</svg>
