<svg xmlns="http://www.w3.org/2000/svg" width="19.886" height="28" viewBox="0 0 19.886 28">
  <g id="test" transform="translate(-21.42)">
    <path id="Path_216" data-name="Path 216" d="M40.64,37.98H38.1v1.862a.847.847,0,0,1-.847.847H25.662a.847.847,0,0,1-.847-.847V37.98h-2.73a.666.666,0,0,0-.666.666V63.17a.666.666,0,0,0,.666.666H40.64a.666.666,0,0,0,.666-.666V38.646A.666.666,0,0,0,40.64,37.98ZM24.162,42.66h5.411a.847.847,0,0,1,0,1.694H24.162a.847.847,0,0,1,0-1.694Zm0,5.169h5.411a.847.847,0,0,1,0,1.694H24.162a.847.847,0,0,1,0-1.694Zm0,5.169h5.411a.847.847,0,1,1,0,1.694H24.162a.847.847,0,1,1,0-1.694Zm0,4.67h7.3a.847.847,0,1,1,0,1.694h-7.3a.847.847,0,1,1,0-1.694Zm12.318,4.5H24.162a.847.847,0,0,1,0-1.694H36.481a.847.847,0,1,1,0,1.694Zm2.681-9.042-2.638,2.638a.847.847,0,0,1-1.2,0L33.8,54.236a.847.847,0,1,1,1.2-1.2l.928.929,2.04-2.039a.847.847,0,0,1,1.2,1.2Zm0-5.169-2.638,2.638a.846.846,0,0,1-1.2,0L33.8,49.067a.847.847,0,1,1,1.2-1.2l.928.928,2.04-2.039a.847.847,0,0,1,1.2,1.2Zm0-5.169-2.638,2.638a.847.847,0,0,1-1.2,0L33.8,43.9A.847.847,0,0,1,35,42.7l.928.929,2.04-2.039a.847.847,0,0,1,1.2,1.2Z" transform="translate(0 -35.836)" fill="#565f64"/>
    <path id="Path_217" data-name="Path 217" d="M121.189,0h-9.337a.282.282,0,0,0-.282.282v2.6a.282.282,0,0,0,.282.282h9.337a.282.282,0,0,0,.282-.282V.282A.282.282,0,0,0,121.189,0Z" transform="translate(-85.061)" fill="#565f64"/>
  </g>
</svg>
