<svg xmlns="http://www.w3.org/2000/svg" width="25" height="25" viewBox="0 0 25 25">
  <path id="icons8-administrative-tools" d="M10.109,0a.509.509,0,0,0-.5.422L9.125,3.344a8.428,8.428,0,0,0-1.719.7L5,2.328a.5.5,0,0,0-.641.047L2.406,4.328a.5.5,0,0,0-.047.641L4.047,7.391a8.572,8.572,0,0,0-.719,1.734L.422,9.609a.512.512,0,0,0-.422.5v2.75a.487.487,0,0,0,.406.484l2.922.516a8.463,8.463,0,0,0,.719,1.734L2.328,18a.5.5,0,0,0,.047.641l1.953,1.953a.5.5,0,0,0,.641.047l2.438-1.7a8.489,8.489,0,0,0,1.719.719l.484,2.922a.511.511,0,0,0,.5.422h2.75c.016,0,.068,0,.141,0v1.5a.5.5,0,0,0,.5.5h11a.5.5,0,0,0,.5-.5V15.922A1.422,1.422,0,0,0,23.578,14.5H19.391c.08-.215.172-.445.234-.641l2.953-.516A.5.5,0,0,0,23,12.859v-2.75a.509.509,0,0,0-.422-.5l-2.953-.484a8.435,8.435,0,0,0-.7-1.7l1.719-2.453a.5.5,0,0,0-.047-.641L18.641,2.375A.493.493,0,0,0,18,2.328l-2.422,1.75a8.489,8.489,0,0,0-1.719-.719L13.344.406A.487.487,0,0,0,12.859,0ZM11.5,7.828A3.672,3.672,0,1,1,7.828,11.5,3.675,3.675,0,0,1,11.5,7.828ZM14.422,15.5h9.156a.421.421,0,0,1,.422.422V16H14v-.078A.42.42,0,0,1,14.422,15.5ZM14,17H24v7H14Zm4.5.3-.359.344-1.672,1.672-.641-.547-.375-.328L14.8,19.2l.375.313,1,.859.359.313,2.328-2.328L19.2,18Zm0,2.5-.359.344-1.672,1.672-.641-.547-.375-.328L14.8,21.7l.375.313,1,.859.359.313,2.328-2.328L19.2,20.5Z" fill="#fff"/>
</svg>
