<svg xmlns="http://www.w3.org/2000/svg" width="13.061" height="13.083" viewBox="0 0 13.061 13.083">
  <g id="Group_4267" data-name="Group 4267" transform="translate(-266.47 -1095.447)">
    <line id="Line_38" data-name="Line 38" x2="12" y2="12" transform="translate(267 1096)" fill="none" stroke="#f03f3f" stroke-width="1.5"/>
    <line id="Line_39" data-name="Line 39" x1="12" y2="11" transform="translate(267 1096)" fill="none" stroke="#f03f3f" stroke-width="1.5"/>
  </g>
</svg>
