<svg xmlns="http://www.w3.org/2000/svg" width="24" height="24" viewBox="0 0 24 24">
  <path id="icons8-applicant" d="M7,2V25H22.628v1H31V17.5H27.093V2Zm5.809,3a.741.741,0,0,1,.625.275c.847,0,.627,1.057.5,1.4A.458.458,0,0,1,14.038,7a.478.478,0,0,1-.239.362.849.849,0,0,1-.412.587,4.462,4.462,0,0,0,0,.519c.241.58,1.848.417,1.923,1.535H10.349c.075-1.119,1.681-.956,1.922-1.535a4.462,4.462,0,0,0,0-.519.956.956,0,0,1-.424-.587.449.449,0,0,1-.24-.4.388.388,0,0,1,.121-.276C11.491,5.865,11.592,5.02,12.809,5Zm5.912,1h4.465a.5.5,0,1,1,0,1H18.721a.5.5,0,1,1,0-1Zm0,2.5h4.465a.5.5,0,1,1,0,1H18.721a.5.5,0,1,1,0-1Zm-7.814,5h7.814a.5.5,0,1,1,0,1H10.907a.5.5,0,1,1,0-1Zm10.6,0h1.674a.5.5,0,1,1,0,1H21.512a.5.5,0,1,1,0-1Zm-10.6,3h6.14a.5.5,0,1,1,0,1h-6.14a.5.5,0,1,1,0-1Zm12.837,2h6.14V20h-6.14Zm-12.837,1h7.814a.5.5,0,1,1,0,1H10.907a.5.5,0,1,1,0-1ZM23.744,21h6.14v1.5h-6.14Zm0,2.5h6.14V25h-6.14Z" transform="translate(-7 -2)" fill="#2f3033"/>
</svg>
