<svg xmlns="http://www.w3.org/2000/svg" width="12" height="12" viewBox="0 0 12 12">
  <path id="icons8-info" d="M8,2a6,6,0,1,0,6,6A6,6,0,0,0,8,2Zm0,.522A5.478,5.478,0,1,1,2.522,8,5.474,5.474,0,0,1,8,2.522ZM8,4.348a.783.783,0,1,0,.783.783A.783.783,0,0,0,8,4.348ZM6.957,6.957v.522h.522V10.87H6.957v.522H9.043V10.87H8.522V6.957H6.957Z" transform="translate(-2 -2)" fill="#33a0d4"/>
</svg>
