<svg id="Group_2634" data-name="Group 2634" xmlns="http://www.w3.org/2000/svg" width="27.475" height="20.606" viewBox="0 0 27.475 20.606">
  <g id="Group_2633" data-name="Group 2633" transform="translate(0 0)">
    <path id="Path_259" data-name="Path 259" d="M7.116,65.7c3.769,3.247,10.383,8.959,12.326,10.74a1.135,1.135,0,0,0,1.661,0c1.945-1.783,8.559-7.5,12.328-10.742a.589.589,0,0,0,.08-.8,2.259,2.259,0,0,0-1.8-.9H8.831a2.258,2.258,0,0,0-1.8.9A.588.588,0,0,0,7.116,65.7Z" transform="translate(-6.536 -64)" fill="#858585"/>
    <path id="Path_260" data-name="Path 260" d="M27.143,126.465a.571.571,0,0,0-.61.082c-4.182,3.533-9.519,8.063-11.2,9.571a2.323,2.323,0,0,1-3.2,0c-1.79-1.607-7.783-6.686-11.2-9.57a.573.573,0,0,0-.942.435V141.33a2.288,2.288,0,0,0,2.29,2.282h22.9a2.288,2.288,0,0,0,2.29-2.282V126.982A.57.57,0,0,0,27.143,126.465Z" transform="translate(0 -123.007)" fill="#858585"/>
  </g>
</svg>
