<svg id="test_1_" data-name="test (1)" xmlns="http://www.w3.org/2000/svg" width="17" height="20" viewBox="0 0 17 20">
  <path id="Path_218" data-name="Path 218" d="M14,36h2.074v2.074H14Z" transform="translate(-11.926 -24.527)" fill="#565f64"/>
  <path id="Path_219" data-name="Path 219" d="M42.8,8.359V24.876a.353.353,0,0,1-.346.359H41.419V9.8a1.061,1.061,0,0,0-1.037-1.077H39V8h3.456A.353.353,0,0,1,42.8,8.359Z" transform="translate(-27.876 -6.617)" fill="#565f64"/>
  <path id="Path_220" data-name="Path 220" d="M46.185,4.359V20.876a.353.353,0,0,1-.346.359H44.8V5.8a1.061,1.061,0,0,0-1.037-1.077H41V4h4.839A.353.353,0,0,1,46.185,4.359Z" transform="translate(-29.185 -4)" fill="#565f64"/>
  <path id="Path_221" data-name="Path 221" d="M14,22h2.074v2.074H14Z" transform="translate(-11.926 -15.547)" fill="#565f64"/>
  <path id="Path_222" data-name="Path 222" d="M20.1,12H18.024v.359a1.061,1.061,0,0,1-1.037,1.077h-5.53a1.061,1.061,0,0,1-1.037-1.077V12H8.346A.353.353,0,0,0,8,12.359V28.876a.353.353,0,0,0,.346.359H20.1a.353.353,0,0,0,.346-.359V12.359A.353.353,0,0,0,20.1,12Zm-5.876,3.232H15.6v.718H14.222Zm0,2.154H15.6V18.1H14.222Zm0,2.872H15.6v.718H14.222Zm0,2.154H15.6v.718H14.222ZM9.383,15.232a.353.353,0,0,1,.346-.359h2.765a.353.353,0,0,1,.346.359V18.1a.353.353,0,0,1-.346.359H9.728a.353.353,0,0,1-.346-.359Zm0,5.027a.353.353,0,0,1,.346-.359h2.765a.353.353,0,0,1,.346.359v2.872a.353.353,0,0,1-.346.359H9.728a.353.353,0,0,1-.346-.359Zm9.678,7.54H9.383v-.718h9.678Zm0-2.154H9.383v-.718h9.678Zm0-2.513H16.3v-.718h2.765Zm0-2.154H16.3v-.718h2.765Zm0-2.872H16.3v-.718h2.765Zm0-2.154H16.3v-.718h2.765Z" transform="translate(-8 -9.235)" fill="#565f64"/>
  <path id="Path_223" data-name="Path 223" d="M22.876,5.383a1.04,1.04,0,0,1-1.037-1.037A.346.346,0,0,0,21.493,4H18.728a.346.346,0,0,0-.346.346,1.04,1.04,0,0,1-1.037,1.037A.346.346,0,0,0,17,5.728V7.111a.346.346,0,0,0,.346.346h5.53a.346.346,0,0,0,.346-.346V5.728A.346.346,0,0,0,22.876,5.383Zm-1.728,0H19.074V4.691h2.074Z" transform="translate(-13.766 -4)" fill="#565f64"/>
</svg>
