<svg xmlns="http://www.w3.org/2000/svg" width="22.619" height="25" viewBox="0 0 22.619 25">
  <path id="icons8-file-configuration" d="M10.679,4A2.679,2.679,0,0,0,8,6.679V25.131a2.679,2.679,0,0,0,2.679,2.679h13.69a2.686,2.686,0,0,0,.746-.106L23.369,25.96a5.021,5.021,0,0,1-1.426.024A5.051,5.051,0,0,1,17.8,19.329a1.548,1.548,0,0,1,2.546-.6,1.551,1.551,0,0,1,.6-2.547,5.048,5.048,0,0,1,6.1,2.409V13.524H20.2a2.679,2.679,0,0,1-2.679-2.679V4Zm8.631.523v6.322a.894.894,0,0,0,.893.893h6.322ZM22.816,17.1a3.832,3.832,0,0,0-1.481.2.36.36,0,0,0-.134.594l1.926,1.926a1.191,1.191,0,0,1-.069,1.747,1.241,1.241,0,0,1-1.666-.115l-1.875-1.875a.36.36,0,0,0-.594.134,3.859,3.859,0,0,0,4.821,4.935l3.826,3.826A1.786,1.786,0,1,0,30.1,25.952L26.27,22.126a3.857,3.857,0,0,0-2.925-4.956A4.029,4.029,0,0,0,22.816,17.1Z" transform="translate(-8 -4)" fill="#1D94CE"/>
</svg>
