<svg xmlns="http://www.w3.org/2000/svg" width="30.339" height="27.571" viewBox="0 0 30.339 27.571">
  <g id="growth" transform="translate(0 -16.594)">
    <path id="Path_183" data-name="Path 183" d="M87.455,252.7a1.877,1.877,0,0,0-.479,1.157v4.873H89.8v-7.7c0-.374-.214-.464-.479-.2Z" transform="translate(-79.724 -214.569)" fill="#565f64"/>
    <path id="Path_184" data-name="Path 184" d="M236.484,197.307a1.882,1.882,0,0,0-.479,1.158v9.49h2.829V195.633c0-.374-.214-.463-.479-.2Z" transform="translate(-216.327 -163.789)" fill="#565f64"/>
    <path id="Path_185" data-name="Path 185" d="M286.143,149.822a1.875,1.875,0,0,0-.48,1.156v13.638h2.63V148.353c0-.374-.215-.464-.48-.2Z" transform="translate(-261.845 -120.451)" fill="#565f64"/>
    <path id="Path_186" data-name="Path 186" d="M186.887,246.945l-.282.283a1.6,1.6,0,0,0-.281.96v5.346h2.829v-8.175c0-.374-.215-.464-.48-.2Z" transform="translate(-170.788 -209.369)" fill="#565f64"/>
    <path id="Path_187" data-name="Path 187" d="M137.13,249.325c-.265-.264-.48-.176-.48.2v7.828h2.829v-5.005a1.823,1.823,0,0,0-.455-1.13l-.455-.453Z" transform="translate(-125.256 -213.187)" fill="#565f64"/>
    <path id="Path_188" data-name="Path 188" d="M34.719,301.826l-.914.915a1.708,1.708,0,0,0-.479,1.017v.537h3.158v-3.559c0-.374-.214-.463-.479-.2Z" transform="translate(-30.548 -260.129)" fill="#565f64"/>
    <path id="Path_189" data-name="Path 189" d="M29.86,27.777c.264.265.479.176.479-.2V17.895a1.385,1.385,0,0,0-1.353-1.3H19.357c-.374,0-.464.215-.2.48L22.583,20.5l-1.4,1.391-6.479,6.485-3.427-3.426a.678.678,0,0,0-.958,0L.794,34.486a2.712,2.712,0,0,0,0,3.835l.066.067a2.71,2.71,0,0,0,3.833,0L10.8,32.277,14.228,35.7a.679.679,0,0,0,.959,0l11.3-11.3Z" transform="translate(0 0)" fill="#565f64"/>
  </g>
</svg>
