<svg xmlns="http://www.w3.org/2000/svg" width="22.815" height="28" viewBox="0 0 22.815 28">
  <g id="Solid" transform="translate(-64 -32)">
    <path id="Path_261" data-name="Path 261" d="M80.593,311.614V308.5a.519.519,0,0,0-.519-.519H65.037A2.062,2.062,0,0,1,64,307.706V311.1a1.038,1.038,0,0,0,1.037,1.037H80.074A.519.519,0,0,0,80.593,311.614Zm-12.444-1.037H67.111V309.54h1.037Zm10.889,0H69.185V309.54h9.852Z" transform="translate(0 -257.836)" fill="#565f64"/>
    <path id="Path_262" data-name="Path 262" d="M195.314,182.013l1.8,1.8a3.1,3.1,0,0,0,0-3.6Z" transform="translate(-122.803 -138.606)" fill="#565f64"/>
    <path id="Path_263" data-name="Path 263" d="M192,160.679v1.815l1.283-1.282A3.094,3.094,0,0,0,192,160.679Z" transform="translate(-119.704 -120.339)" fill="#565f64"/>
    <path id="Path_264" data-name="Path 264" d="M138.549,163.746v-3.067a3.111,3.111,0,1,0,2.32,5.6l-2.168-2.168A.519.519,0,0,1,138.549,163.746Z" transform="translate(-67.29 -120.339)" fill="#565f64"/>
    <path id="Path_265" data-name="Path 265" d="M65.037,266.074V264a1.037,1.037,0,0,0,0,2.074Z" transform="translate(0 -216.963)" fill="#565f64"/>
    <path id="Path_266" data-name="Path 266" d="M138.148,104v21.778a.519.519,0,0,1-.519.519H120v1.037h19.185V104Z" transform="translate(-52.37 -67.333)" fill="#565f64"/>
    <path id="Path_267" data-name="Path 267" d="M114.667,80H101.185v1.556a1.556,1.556,0,1,1-3.111,0v-.519h1.037v.519a.519.519,0,0,0,1.037,0V80H96V94h14a1.557,1.557,0,0,1,1.556,1.556v3.111A1.557,1.557,0,0,1,110,100.222H96v2.593h18.667Zm-6.222,2.074h1.037v1.037h-1.037ZM101.7,92.444a4.148,4.148,0,1,1,4.148-4.148A4.148,4.148,0,0,1,101.7,92.444Zm10.37-1.037h-4.667V90.37h4.667Zm1.037-2.074h-5.7V88.3h5.7Zm0-2.074h-5.7V86.222h5.7Zm0-2.074h-5.7V84.148h5.7Zm0-2.074h-2.593V82.074h2.593Z" transform="translate(-29.926 -44.889)" fill="#565f64"/>
    <path id="Path_268" data-name="Path 268" d="M115.111,34.074a1.037,1.037,0,1,0-2.074,0H112a2.074,2.074,0,1,1,4.148,0Z" transform="translate(-44.889)" fill="#565f64"/>
  </g>
</svg>
