<svg xmlns="http://www.w3.org/2000/svg" width="24" height="24" viewBox="0 0 24 24">
  <path id="icons8-selfies" d="M25.143,4H6.857A2.86,2.86,0,0,0,4,6.857V25.143A2.86,2.86,0,0,0,6.857,28H25.143A2.86,2.86,0,0,0,28,25.143V6.857A2.86,2.86,0,0,0,25.143,4ZM16,8a4.571,4.571,0,1,1-4.571,4.571A4.572,4.572,0,0,1,16,8Zm0,12a7.452,7.452,0,0,1,7.429,6.857H8.571A7.452,7.452,0,0,1,16,20Z" transform="translate(-4 -4)" fill="#2f3033"/>
</svg>
