<svg xmlns="http://www.w3.org/2000/svg" width="20.582" height="23.649" viewBox="0 0 18.582 23.649">
  <g id="document" transform="translate(-51.199)">
    <g id="Group_1732" data-name="Group 1732" transform="translate(56.267)">
      <g id="Group_1731" data-name="Group 1731" transform="translate(0)">
        <path id="Path_49" data-name="Path 49" d="M161.811,2.534,161.158.578a.845.845,0,0,0-.8-.578h-5.068a.845.845,0,0,0-.8.578l-.653,1.956H153.6V5.912h8.446V2.534Zm-3.143,1.689a.845.845,0,0,1-1.689,0V3.379a.845.845,0,0,1,1.689,0Z" transform="translate(-153.6)" fill="#565f64"/>
      </g>
    </g>
    <g id="Group_1734" data-name="Group 1734" transform="translate(51.199 2.534)">
      <g id="Group_1733" data-name="Group 1733" transform="translate(0)">
        <path id="Path_50" data-name="Path 50" d="M68.936,51.2H66.4v4.223a.845.845,0,0,1-.845.845H55.422a.845.845,0,0,1-.845-.845V51.2H52.044a.845.845,0,0,0-.845.845V71.471a.845.845,0,0,0,.845.845H68.936a.845.845,0,0,0,.845-.845V52.045A.845.845,0,0,0,68.936,51.2ZM65.558,67.248H55.422a.845.845,0,1,1,0-1.689H65.558a.845.845,0,0,1,0,1.689Zm0-3.379H55.422a.845.845,0,1,1,0-1.689H65.558a.845.845,0,0,1,0,1.689Zm0-3.379H55.422a.845.845,0,1,1,0-1.689H65.558a.845.845,0,1,1,0,1.689Z" transform="translate(-51.199 -51.2)" fill="#565f64"/>
      </g>
    </g>
  </g>
</svg>
