<svg xmlns="http://www.w3.org/2000/svg" width="31.972" height="25.577" viewBox="0 0 31.972 25.577">
  <path id="Icon_awesome-user-clock" data-name="Icon awesome-user-clock" d="M24.778,11.19a7.194,7.194,0,1,0,7.194,7.194A7.189,7.189,0,0,0,24.778,11.19Zm3.2,7.508a.488.488,0,0,1-.485.485H24.463a.488.488,0,0,1-.485-.485V14.872a.488.488,0,0,1,.485-.485h.629a.488.488,0,0,1,.485.485v2.713h1.913a.488.488,0,0,1,.485.485Zm-11.989-.315a8.761,8.761,0,0,1,.909-3.872,6.656,6.656,0,0,0-1.229-.125h-.834a8.7,8.7,0,0,1-7.284,0H6.714A6.716,6.716,0,0,0,0,21.1V23.18a2.4,2.4,0,0,0,2.4,2.4h17.34A8.792,8.792,0,0,1,15.986,18.384Zm-4.8-5.6A6.394,6.394,0,1,0,4.8,6.394,6.394,6.394,0,0,0,11.19,12.789Z" fill="#848484"/>
</svg>
