<svg xmlns="http://www.w3.org/2000/svg" width="21.607" height="27.5" viewBox="0 0 21.607 27.5">
  <path id="Path_54" data-name="Path 54" d="M72.732,5.518a.973.973,0,0,0-.213-.32L67.608.287A.994.994,0,0,0,66.914,0H52.182A.982.982,0,0,0,51.2.982V26.518a.982.982,0,0,0,.982.982H71.825a.982.982,0,0,0,.982-.982V5.893A.974.974,0,0,0,72.732,5.518ZM67.9,22.589H56.111a.982.982,0,1,1,0-1.964H67.9a.982.982,0,1,1,0,1.964Zm0-3.929H56.111a.982.982,0,1,1,0-1.964H67.9a.982.982,0,1,1,0,1.964Zm0-3.929H56.111a.982.982,0,1,1,0-1.964H67.9a.982.982,0,1,1,0,1.964Zm0-3.929H56.111a.982.982,0,1,1,0-1.964H67.9a.982.982,0,1,1,0,1.964Zm0-5.893V3.353l1.558,1.558H67.9Z" transform="translate(-51.2)" fill="#565f64"/>
</svg>
