<svg xmlns="http://www.w3.org/2000/svg" width="20" height="20" viewBox="0 0 20 20">
  <path id="icons8-info" d="M12,2A10,10,0,1,0,22,12,10.007,10.007,0,0,0,12,2Zm0,.87A9.13,9.13,0,1,1,2.87,12,9.124,9.124,0,0,1,12,2.87Zm0,3.043a1.3,1.3,0,1,0,1.3,1.3,1.3,1.3,0,0,0-1.3-1.3Zm-1.739,4.348v.87h.87v5.652h-.87v.87h3.478v-.87h-.87V10.261H10.261Z" transform="translate(-2 -2)" fill="#707070"/>
</svg>
