<svg xmlns="http://www.w3.org/2000/svg" width="17" height="20" viewBox="0 0 17 20">
  <g id="user-4" transform="translate(1)">
    <path id="Path_106" data-name="Path 106" d="M136.806,1.509a5.566,5.566,0,0,1,0,7.286,4.315,4.315,0,0,1-6.556,0,5.565,5.565,0,0,1,0-7.286,4.315,4.315,0,0,1,6.556,0" transform="translate(-126.028 0)" fill="#616161"/>
    <path id="Path_107" data-name="Path 107" d="M48.174,293.506a12.852,12.852,0,0,0-14.9,0,2.6,2.6,0,0,0-1.049,2.127V300.1h17v-4.464A2.6,2.6,0,0,0,48.174,293.506Z" transform="translate(-33.223 -280.097)" fill="#616161"/>
  </g>
</svg>
