MD5Version 10
commandline ""

numFrames 2
numJoints 85
frameRate 60
numAnimatedComponents 510

hierarchy {
  "origin" -1 63 0 //
  "hips" 0 63 6 //
  "spine" 1 63 12 //
  "ribs" 2 63 18 //
  "neck" 3 63 24 //
  "neckcontol" 4 63 30 //
  "head" 4 63 36 //
  "jaw" 6 63 42 //
  "lower_lip0" 7 63 48 //
  "lip.003" 8 63 54 //
  "lip.002" 9 63 60 //
  "lip.001" 10 63 66 //
  "lip" 11 63 72 //
  "eye.L" 6 63 78 //
  "eye.R" 6 63 84 //
  "upper_lip0" 6 63 90 //
  "lip.004" 15 63 96 //
  "lip.005" 16 63 102 //
  "lip.006" 17 63 108 //
  "lip.007" 18 63 114 //
  "eyelidIK3.L" 6 63 120 //
  "eyelid2.L" 20 63 126 //
  "eyelid3.L" 21 63 132 //
  "eyelidIK2.L" 6 63 138 //
  "eyelid1.L" 23 63 144 //
  "eyelid.L" 24 63 150 //
  "eyelidIK3.R" 6 63 156 //
  "eyelid2.R" 26 63 162 //
  "eyelid3.R" 27 63 168 //
  "eyelidIK2.R" 6 63 174 //
  "eyelid1.R" 29 63 180 //
  "eyelid.R" 30 63 186 //
  "head_tag" 4 63 192 //
  "shoulder.R" 3 63 198 //
  "upper_arm.R" 33 63 204 //
  "forearm.R" 34 63 210 //
  "hand.R" 35 63 216 //
  "finger_index.01.R" 36 63 222 //
  "finger_index.02.R" 37 63 228 //
  "finger_index.03.R" 38 63 234 //
  "thumb.01.R" 36 63 240 //
  "thumb.02.R" 40 63 246 //
  "thumb.03.R" 41 63 252 //
  "tag_weapon" 36 63 258 //
  "finger_middle.01.R" 36 63 264 //
  "finger_middle.02.R" 44 63 270 //
  "finger_middle.03.R" 45 63 276 //
  "finger_ring.01.R" 36 63 282 //
  "finger_ring.02.R" 47 63 288 //
  "finger_ring.03.R" 48 63 294 //
  "finger_pinky.01.R" 36 63 300 //
  "finger_pinky.02.R" 50 63 306 //
  "finger_pinky.03.R" 51 63 312 //
  "hand_armor.R" 35 63 318 //
  "tag_gear" 3 63 324 //
  "shoulder.L" 3 63 330 //
  "upper_arm.L" 55 63 336 //
  "forearm.L" 56 63 342 //
  "hand_armor.L" 57 63 348 //
  "hand.L" 57 63 354 //
  "finger_index.01.L" 59 63 360 //
  "finger_index.02.L" 60 63 366 //
  "finger_index.03.L" 61 63 372 //
  "thumb.01.L" 59 63 378 //
  "thumb.02.L" 63 63 384 //
  "thumb.03.L" 64 63 390 //
  "finger_middle.01.L" 59 63 396 //
  "finger_middle.02.L" 66 63 402 //
  "finger_middle.03.L" 67 63 408 //
  "finger_ring.01.L" 59 63 414 //
  "finger_ring.02.L" 69 63 420 //
  "finger_ring.03.L" 70 63 426 //
  "finger_pinky.01.L" 59 63 432 //
  "finger_pinky.02.L" 72 63 438 //
  "finger_pinky.03.L" 73 63 444 //
  "thigh.R" 1 63 450 //
  "shin.R" 75 63 456 //
  "thigh.L" 1 63 462 //
  "shin.L" 77 63 468 //
  "ankle.R" 0 63 474 //
  "foot.R" 79 63 480 //
  "toe.R" 79 63 486 //
  "ankle.L" 0 63 492 //
  "toe.L" 82 63 498 //
  "foot.L" 82 63 504 //
}

bounds {
  ( -1.945048 -2.565454 -0.049552 ) ( 5.958083 2.008111 12.966467 )
  ( -1.945048 -2.565454 -0.049552 ) ( 5.958083 2.008111 12.966467 )
}

baseframe {
  ( 0.000000 0.000000 0.000000 ) ( 0.000000 -0.707107 -0.707107 )
  ( 0.184526 6.906084 -0.013687 ) ( -0.063425 -0.704162 0.063709 )
  ( -0.000000 1.240110 0.000000 ) ( 0.191587 0.001295 -0.009840 )
  ( -0.000000 1.426178 -0.000000 ) ( -0.063779 -0.002332 0.012698 )
  ( -0.000000 1.821084 0.000000 ) ( -0.145265 -0.001328 -0.001879 )
  ( 0.000000 0.808121 0.000000 ) ( 0.001844 -0.515148 -0.857099 )
  ( -0.002195 0.809023 0.000794 ) ( 0.040325 0.000217 -0.001349 )
  ( -0.003138 0.224356 0.163703 ) ( -0.591717 0.381594 0.595702 )
  ( -0.263320 0.555491 -0.218415 ) ( -0.002580 0.003661 -0.873876 )
  ( 0.000000 0.017501 -0.000000 ) ( 0.220569 0.655870 0.690904 )
  ( 0.000000 0.135389 -0.000001 ) ( 0.037467 -0.018190 0.200649 )
  ( 0.000000 0.113742 0.000000 ) ( -0.125321 0.000000 0.210707 )
  ( 0.000000 0.113741 -0.000000 ) ( 0.037467 0.018190 0.200649 )
  ( 0.262165 0.811893 0.662538 ) ( -0.000000 -0.752543 -0.658544 )
  ( -0.244069 0.811856 0.663658 ) ( -0.000000 -0.752542 -0.658544 )
  ( 0.225828 0.266057 0.774515 ) ( 0.047000 0.705543 -0.047000 )
  ( -0.000000 0.017501 -0.000000 ) ( 0.186223 0.743981 0.598525 )
  ( -0.000000 0.145787 -0.000001 ) ( 0.114298 0.017382 0.174281 )
  ( -0.000000 0.112094 0.000000 ) ( -0.001650 -0.003770 0.248557 )
  ( -0.000000 0.111594 0.000000 ) ( 0.099455 -0.020017 0.173948 )
  ( 0.361090 0.810247 0.681599 ) ( 0.046999 0.705543 -0.046999 )
  ( -0.000000 0.011231 0.000000 ) ( 0.138551 0.777593 0.585011 )
  ( 0.000000 0.112704 0.000001 ) ( 0.248666 0.003044 0.385872 )
  ( 0.360328 0.777492 0.684141 ) ( 0.046999 0.705543 -0.046999 )
  ( -0.000000 0.010076 -0.000000 ) ( -0.135461 0.512721 0.787661 )
  ( -0.000000 0.108887 -0.000001 ) ( -0.349590 0.371748 0.224171 )
  ( -0.137678 0.812980 0.691455 ) ( 0.046999 0.705543 -0.046999 )
  ( -0.000000 0.011230 0.000000 ) ( 0.069059 0.752863 0.649633 )
  ( 0.000000 0.131865 -0.000000 ) ( 0.201215 -0.007965 0.324740 )
  ( -0.136810 0.780376 0.690930 ) ( 0.046999 0.705543 -0.046999 )
  ( -0.000000 0.010076 0.000000 ) ( 0.085597 0.645822 0.755134 )
  ( -0.000000 0.128464 -0.000001 ) ( -0.122912 -0.007699 0.282440 )
  ( -0.002195 0.809023 0.000794 ) ( 0.040325 0.000217 -0.001349 )
  ( -0.014833 1.825302 -0.071422 ) ( 0.548058 -0.398517 -0.527101 )
  ( 0.000000 1.493901 0.000000 ) ( 0.337192 0.599744 -0.369520 )
  ( 0.000000 2.103016 0.000000 ) ( -0.166080 0.071882 0.080628 )
  ( 0.000001 1.823368 0.000000 ) ( 0.026122 0.716524 0.005963 )
  ( 0.288927 0.945606 -0.016979 ) ( -0.100840 -0.682277 -0.030495 )
  ( 0.000000 0.310931 0.000000 ) ( -0.001887 -0.003346 -0.140544 )
  ( -0.000000 0.255058 0.000000 ) ( 0.014527 -0.020137 -0.079928 )
  ( 0.182657 0.102359 0.122068 ) ( 0.068809 0.469953 0.338161 )
  ( -0.000000 0.450617 0.000000 ) ( -0.099065 0.025937 0.025593 )
  ( 0.000000 0.295731 -0.000001 ) ( 0.108671 0.022517 0.026610 )
  ( 0.586577 1.443575 0.291631 ) ( 0.494772 0.504178 0.517254 )
  ( 0.081677 0.956433 -0.018380 ) ( -0.107088 -0.736173 -0.098262 )
  ( 0.000000 0.323707 0.000000 ) ( -0.004845 -0.051318 -0.175658 )
  ( 0.000000 0.229679 -0.000000 ) ( 0.016195 -0.015133 -0.050692 )
  ( -0.151893 0.951490 -0.015787 ) ( -0.155854 -0.744157 -0.130418 )
  ( -0.000001 0.298948 -0.000000 ) ( 0.022449 -0.039879 -0.150750 )
  ( -0.000000 0.222754 0.000000 ) ( 0.017543 -0.013115 -0.049400 )
  ( -0.332551 0.872253 0.059175 ) ( -0.270536 -0.079021 -0.029623 )
  ( 0.000000 0.247823 -0.000000 ) ( -0.085055 0.000243 0.004201 )
  ( 0.000000 0.155400 0.000000 ) ( -0.148243 -0.000940 -0.003131 )
  ( 0.531379 1.351308 -0.004340 ) ( 0.015885 0.004080 0.999865 )
  ( 0.002183 1.423120 -0.451181 ) ( 0.675237 0.001866 -0.002772 )
  ( 0.014634 1.825497 -0.071451 ) ( 0.552755 0.408370 0.515946 )
  ( 0.000000 1.493901 0.000000 ) ( 0.498017 -0.047311 0.047143 )
  ( 0.000000 2.103018 -0.000001 ) ( -0.075532 0.079375 0.168458 )
  ( 0.093228 1.351308 0.523154 ) ( 0.654641 0.002699 0.755929 )
  ( 0.000000 1.823368 -0.000000 ) ( -0.025836 0.094228 -0.007102 )
  ( 0.286576 1.006395 -0.107107 ) ( 0.072174 0.602406 -0.086389 )
  ( 0.000000 0.249955 0.000000 ) ( -0.000083 -0.010683 -0.125485 )
  ( -0.000000 0.254363 -0.000000 ) ( -0.016009 0.049143 -0.075943 )
  ( 0.120542 0.102358 -0.183667 ) ( 0.017564 -0.626009 0.348850 )
  ( -0.000000 0.445150 0.000000 ) ( 0.067621 -0.024966 0.008198 )
  ( 0.000000 0.302324 0.000000 ) ( -0.058338 0.684439 0.061834 )
  ( 0.073565 1.013167 -0.024132 ) ( 0.119028 -0.795213 0.100389 )
  ( -0.000000 0.266205 0.000000 ) ( 0.003820 0.009027 0.165078 )
  ( -0.000000 0.229740 -0.000000 ) ( -0.004806 0.012921 0.052363 )
  ( -0.127263 1.003840 0.060605 ) ( 0.184529 -0.779480 0.128005 )
  ( -0.000000 0.246800 0.000000 ) ( -0.001225 -0.003214 0.130582 )
  ( 0.000000 0.222126 -0.000000 ) ( 0.002051 0.007113 0.050428 )
  ( -0.358085 0.893698 0.063869 ) ( 0.227228 -0.775272 0.133791 )
  ( 0.000000 0.221431 -0.000000 ) ( -0.006730 0.001955 0.092569 )
  ( -0.000000 0.154458 0.000000 ) ( -0.003598 -0.015304 0.148050 )
  ( -0.810392 0.550812 -0.372493 ) ( -0.984551 0.027405 -0.000267 )
  ( 0.000000 3.626385 -0.000000 ) ( -0.211921 0.002430 0.007077 )
  ( 0.782400 0.551416 -0.372917 ) ( -0.984498 -0.026294 0.009171 )
  ( -0.000000 3.626384 0.000000 ) ( -0.211935 -0.017722 -0.006644 )
  ( -0.305859 0.828940 1.124649 ) ( -0.552637 0.176065 -0.801670 )
  ( -0.090614 0.138320 1.006144 ) ( 0.752092 0.018236 0.046746 )
  ( -0.090614 0.138320 1.006144 ) ( -0.854351 0.076975 -0.055594 )
  ( -0.305858 0.828940 -1.124649 ) ( 0.585870 -0.181993 -0.777713 )
  ( -0.005721 0.138319 -1.010200 ) ( -0.046568 0.515226 -0.854890 )
  ( -0.005721 0.138319 -1.010200 ) ( -0.753536 -0.000864 0.003278 )
}

frame 0 {
  -0.000000 0.000000 -0.009903 -0.707107 -0.000000 -0.000000
  0.309123 6.437504 -0.106869 -0.075371 -0.540867 0.048998
  0.000000 1.240110 -0.000000 0.052507 -0.000062 -0.047498
  0.000000 1.426179 -0.000000 -0.184318 -0.000420 0.040287
  0.000000 1.821082 0.000000 -0.059450 -0.193375 -0.058793
  0.000000 0.808121 -0.000000 0.001844 -0.515148 -0.857099
  -0.044148 0.766293 0.024775 0.045046 0.018595 0.043682
  -0.003138 0.224357 0.163702 -0.582226 0.395844 0.586146
  -0.259541 0.557510 -0.217253 0.917771 -0.378686 0.089287
  0.000000 0.017501 -0.000000 0.766855 -0.164101 -0.216398
  0.000000 0.135389 0.000001 0.077406 -0.083308 0.226103
  -0.000000 0.113742 0.000001 -0.176718 -0.042501 0.164695
  -0.000000 0.113742 -0.000000 -0.031558 -0.009163 0.230041
  0.262164 0.811892 0.662537 0.061118 0.848054 0.523650
  -0.244069 0.811855 0.663658 0.073789 0.846507 0.523270
  0.224683 0.261798 0.775026 0.064377 -0.710294 0.225210
  -0.000000 0.017499 0.000000 0.694299 -0.191224 -0.199823
  0.000000 0.145787 0.000002 0.140073 -0.029166 0.201370
  0.000000 0.112094 0.000001 -0.076060 -0.067477 0.233263
  0.000000 0.111594 -0.000000 0.024045 -0.043243 0.223826
  0.365934 0.793585 0.683418 0.046999 0.705543 -0.046999
  -0.000000 0.011231 0.000000 0.125932 0.784485 0.580794
  -0.000000 0.112704 -0.000001 0.249001 -0.023430 0.387489
  0.360328 0.777494 0.684140 0.046999 0.705543 -0.046999
  -0.000000 0.010075 0.000000 -0.099297 0.457441 0.813067
  -0.000001 0.108887 0.000001 -0.431279 0.352683 0.307498
  -0.136625 0.803881 0.692455 0.046999 0.705543 -0.046999
  0.000000 0.011230 0.000000 -0.008426 0.730560 0.661906
  0.000000 0.131865 0.000001 0.067457 -0.083498 0.375702
  -0.136810 0.780377 0.690930 0.046999 0.705543 -0.046999
  -0.000000 0.010076 -0.000000 0.062122 0.627371 0.752991
  0.000000 0.128464 -0.000001 -0.209364 -0.078930 0.364853
  -0.002195 0.809022 0.000794 0.040325 0.000217 -0.001349
  -0.014832 1.825300 -0.071422 0.502758 -0.495435 -0.451433
  0.000000 1.493901 -0.000001 0.100530 0.548669 -0.727102
  -0.000000 2.103015 -0.000000 -0.828866 0.028426 0.402396
  -0.000000 1.823368 -0.000000 0.173698 0.452590 -0.344153
  0.288925 0.945606 -0.016979 -0.051841 -0.682663 -0.029424
  0.000000 0.310931 0.000001 0.000221 -0.001470 -0.002343
  0.000000 0.255058 -0.000000 -0.029908 -0.071880 -0.099353
  0.182655 0.102358 0.122067 -0.046053 0.856516 0.343917
  0.000001 0.450618 0.000001 -0.220708 -0.095756 -0.011102
  -0.000001 0.295730 0.000001 0.027530 -0.286009 -0.054913
  0.305358 1.687174 0.277019 0.494772 0.504178 0.517254
  0.081675 0.956432 -0.018380 -0.233377 -0.644880 -0.350916
  0.000001 0.323706 -0.000000 0.060323 -0.029335 -0.532217
  -0.000000 0.229678 0.000000 0.030246 0.093352 -0.399019
  -0.151895 0.951490 -0.015787 -0.274730 -0.666626 -0.333950
  0.000001 0.298947 0.000000 0.109124 -0.029793 -0.486399
  0.000000 0.222754 0.000000 0.007208 0.071093 -0.357542
  -0.332552 0.872253 0.059175 -0.325949 -0.063278 -0.060789
  -0.000001 0.247822 -0.000000 -0.402108 0.002085 -0.028376
  0.000001 0.155400 0.000000 -0.575146 -0.067862 -0.060786
  0.531378 1.351308 -0.004341 0.015904 0.004065 0.999865
  0.002183 1.423119 -0.451180 0.675237 0.001866 -0.002772
  0.014634 1.825496 -0.071451 0.323929 0.601337 0.572023
  0.000001 1.493901 -0.000001 0.462640 0.351261 0.419077
  -0.000000 2.103017 0.000001 0.064982 0.486993 0.543856
  0.093227 1.351309 0.523154 0.654641 0.002695 0.755929
  -0.000000 1.823368 -0.000001 0.011510 0.502631 -0.270906
  0.286577 1.006395 -0.107107 0.042652 0.601426 -0.060186
  -0.000001 0.249956 0.000001 -0.015882 -0.010246 -0.492311
  0.000000 0.254363 -0.000000 0.101242 0.240802 -0.237823
  0.120542 0.102358 -0.183666 0.005176 -0.620241 0.357966
  -0.000001 0.445152 0.000001 0.157720 -0.024706 0.019135
  -0.000000 0.302325 0.000000 -0.137210 0.607857 0.227433
  0.073565 1.013166 -0.024131 0.133760 -0.782170 0.140998
  -0.000001 0.266205 0.000000 -0.016255 0.010386 0.569239
  -0.000000 0.229740 0.000000 -0.107716 0.262334 0.022949
  -0.127263 1.003840 0.060605 0.218230 -0.750198 0.202348
  -0.000001 0.246799 0.000000 -0.054634 0.001125 0.522012
  -0.000000 0.222125 -0.000000 -0.079124 0.287522 -0.049691
  -0.358085 0.893698 0.063869 0.199769 -0.753201 0.186036
  0.000001 0.221431 0.000000 -0.139544 0.005392 0.498634
  0.000000 0.154457 -0.000000 0.037931 0.325624 -0.072637
  -0.810392 0.550811 -0.372493 -0.966435 0.110867 -0.082632
  0.000000 3.626384 0.000000 -0.373016 0.002306 0.012456
  0.782400 0.551415 -0.372917 -0.932379 -0.100583 0.052530
  0.000000 3.626384 -0.000001 -0.302329 -0.017285 -0.009478
  -1.406109 0.838118 1.299208 -0.369178 0.203943 -0.901430
  -0.090614 0.138320 1.006144 0.752092 0.018236 0.046746
  -0.090614 0.138320 1.006144 -0.852404 0.078746 -0.052999
  2.241435 0.812477 -1.543512 0.711378 -0.142690 -0.667010
  -0.005721 0.138320 -1.010200 -0.025764 -0.537679 0.842437
  -0.005721 0.138320 -1.010200 -0.753536 -0.000863 0.003278
}

frame 1 {
  -0.000000 0.000000 -0.009903 -0.707107 -0.000000 -0.000000
  0.309123 6.437504 -0.106869 -0.075371 -0.540867 0.048998
  0.000000 1.240110 -0.000000 0.052507 -0.000062 -0.047498
  0.000000 1.426179 -0.000000 -0.184318 -0.000420 0.040287
  0.000000 1.821082 0.000000 -0.059450 -0.193375 -0.058793
  0.000000 0.808121 -0.000000 0.001844 -0.515148 -0.857099
  -0.044148 0.766293 0.024775 0.045046 0.018595 0.043682
  -0.003138 0.224357 0.163702 -0.582226 0.395844 0.586146
  -0.259541 0.557510 -0.217253 0.917771 -0.378686 0.089287
  0.000000 0.017501 -0.000000 0.766855 -0.164101 -0.216398
  0.000000 0.135389 0.000001 0.077406 -0.083308 0.226103
  -0.000000 0.113742 0.000001 -0.176718 -0.042501 0.164695
  -0.000000 0.113742 -0.000000 -0.031558 -0.009163 0.230041
  0.262164 0.811892 0.662537 0.061118 0.848054 0.523650
  -0.244069 0.811855 0.663658 0.073789 0.846507 0.523270
  0.224683 0.261798 0.775026 0.064377 -0.710294 0.225210
  -0.000000 0.017499 0.000000 0.694299 -0.191224 -0.199823
  0.000000 0.145787 0.000002 0.140073 -0.029166 0.201370
  0.000000 0.112094 0.000001 -0.076060 -0.067477 0.233263
  0.000000 0.111594 -0.000000 0.024045 -0.043243 0.223826
  0.365934 0.793585 0.683418 0.046999 0.705543 -0.046999
  -0.000000 0.011231 0.000000 0.125932 0.784485 0.580794
  -0.000000 0.112704 -0.000001 0.249001 -0.023430 0.387489
  0.360328 0.777494 0.684140 0.046999 0.705543 -0.046999
  -0.000000 0.010075 0.000000 -0.099297 0.457441 0.813067
  -0.000001 0.108887 0.000001 -0.431279 0.352683 0.307498
  -0.136625 0.803881 0.692455 0.046999 0.705543 -0.046999
  0.000000 0.011230 0.000000 -0.008426 0.730560 0.661906
  0.000000 0.131865 0.000001 0.067457 -0.083498 0.375702
  -0.136810 0.780377 0.690930 0.046999 0.705543 -0.046999
  -0.000000 0.010076 -0.000000 0.062122 0.627371 0.752991
  0.000000 0.128464 -0.000001 -0.209364 -0.078930 0.364853
  -0.002195 0.809022 0.000794 0.040325 0.000217 -0.001349
  -0.014832 1.825300 -0.071422 0.502758 -0.495435 -0.451433
  0.000000 1.493901 -0.000001 0.100530 0.548669 -0.727102
  -0.000000 2.103015 -0.000000 -0.828866 0.028426 0.402396
  -0.000000 1.823368 -0.000000 0.173698 0.452590 -0.344153
  0.288925 0.945606 -0.016979 -0.051841 -0.682663 -0.029424
  0.000000 0.310931 0.000001 0.000221 -0.001470 -0.002343
  0.000000 0.255058 -0.000000 -0.029908 -0.071880 -0.099353
  0.182655 0.102358 0.122067 -0.046053 0.856516 0.343917
  0.000001 0.450618 0.000001 -0.220708 -0.095756 -0.011102
  -0.000001 0.295730 0.000001 0.027530 -0.286009 -0.054913
  0.305358 1.687174 0.277019 0.494772 0.504178 0.517254
  0.081675 0.956432 -0.018380 -0.233377 -0.644880 -0.350916
  0.000001 0.323706 -0.000000 0.060323 -0.029335 -0.532217
  -0.000000 0.229678 0.000000 0.030246 0.093352 -0.399019
  -0.151895 0.951490 -0.015787 -0.274730 -0.666626 -0.333950
  0.000001 0.298947 0.000000 0.109124 -0.029793 -0.486399
  0.000000 0.222754 0.000000 0.007208 0.071093 -0.357542
  -0.332552 0.872253 0.059175 -0.325949 -0.063278 -0.060789
  -0.000001 0.247822 -0.000000 -0.402108 0.002085 -0.028376
  0.000001 0.155400 0.000000 -0.575146 -0.067862 -0.060786
  0.531378 1.351308 -0.004341 0.015904 0.004065 0.999865
  0.002183 1.423119 -0.451180 0.675237 0.001866 -0.002772
  0.014634 1.825496 -0.071451 0.323929 0.601337 0.572023
  0.000001 1.493901 -0.000001 0.462640 0.351261 0.419077
  -0.000000 2.103017 0.000001 0.064982 0.486993 0.543856
  0.093227 1.351309 0.523154 0.654641 0.002695 0.755929
  -0.000000 1.823368 -0.000001 0.011510 0.502631 -0.270906
  0.286577 1.006395 -0.107107 0.042652 0.601426 -0.060186
  -0.000001 0.249956 0.000001 -0.015882 -0.010246 -0.492311
  0.000000 0.254363 -0.000000 0.101242 0.240802 -0.237823
  0.120542 0.102358 -0.183666 0.005176 -0.620241 0.357966
  -0.000001 0.445152 0.000001 0.157720 -0.024706 0.019135
  -0.000000 0.302325 0.000000 -0.137210 0.607857 0.227433
  0.073565 1.013166 -0.024131 0.133760 -0.782170 0.140998
  -0.000001 0.266205 0.000000 -0.016255 0.010386 0.569239
  -0.000000 0.229740 0.000000 -0.107716 0.262334 0.022949
  -0.127263 1.003840 0.060605 0.218230 -0.750198 0.202348
  -0.000001 0.246799 0.000000 -0.054634 0.001125 0.522012
  -0.000000 0.222125 -0.000000 -0.079124 0.287522 -0.049691
  -0.358085 0.893698 0.063869 0.199769 -0.753201 0.186036
  0.000001 0.221431 0.000000 -0.139544 0.005392 0.498634
  0.000000 0.154457 -0.000000 0.037931 0.325624 -0.072637
  -0.810392 0.550811 -0.372493 -0.966435 0.110867 -0.082632
  0.000000 3.626384 0.000000 -0.373016 0.002306 0.012456
  0.782400 0.551415 -0.372917 -0.932379 -0.100583 0.052530
  0.000000 3.626384 -0.000001 -0.302329 -0.017285 -0.009478
  -1.406109 0.838118 1.299208 -0.369178 0.203943 -0.901430
  -0.090614 0.138320 1.006144 0.752092 0.018236 0.046746
  -0.090614 0.138320 1.006144 -0.852404 0.078746 -0.052999
  2.241435 0.812477 -1.543512 0.711378 -0.142690 -0.667010
  -0.005721 0.138320 -1.010200 -0.025764 -0.537679 0.842437
  -0.005721 0.138320 -1.010200 -0.753536 -0.000863 0.003278
}

