MD5Version 10 // Parameters used during export: Reorient: False; Scale: 1.0
commandline ""

numFrames 16
numJoints 38
frameRate 60
numAnimatedComponents 228

hierarchy {
  "origin" -1 63 0 //
  "torso1" 0 63 6 //
  "plate2" 1 63 12 //
  "butt" 1 63 18 //
  "butt1" 3 63 24 //
  "butt2" 4 63 30 //
  "torso" 1 63 36 //
  "plate1" 6 63 42 //
  "neck" 6 63 48 //
  "plate" 8 63 54 //
  "head" 8 63 60 //
  "jaw" 10 63 66 //
  "jaw1" 11 63 72 //
  "jaw2" 12 63 78 //
  "eye_R" 10 63 84 //
  "eye1_R" 10 63 90 //
  "eye2_R" 10 63 96 //
  "eye_L" 10 63 102 //
  "eye1_L" 10 63 108 //
  "eye2_L" 10 63 114 //
  "arm_R" 8 63 120 //
  "arm1_R" 20 63 126 //
  "arm2_R" 21 63 132 //
  "arm_L" 8 63 138 //
  "arm1_L" 23 63 144 //
  "arm2_L" 24 63 150 //
  "mid_leg_R" 6 63 156 //
  "mid_leg1_R" 26 63 162 //
  "mid_leg2_R" 27 63 168 //
  "mid_leg_L" 6 63 174 //
  "mid_leg1_L" 29 63 180 //
  "mid_leg2_L" 30 63 186 //
  "back_leg_R" 1 63 192 //
  "back_leg1_R" 32 63 198 //
  "back_leg2_R" 33 63 204 //
  "back_leg_L" 1 63 210 //
  "back_leg1_L" 35 63 216 //
  "back_leg2_L" 36 63 222 //
}

bounds {
  ( -21.6612739563 -17.3204460144 0.0103193186 ) ( 23.6423892975 17.3204345703 28.9973087311 )
  ( -21.7271556854 -17.3199119568 0.0076074973 ) ( 23.5238914490 17.3199062347 29.1004028320 )
  ( -21.8195457458 -17.3199310303 0.0056436360 ) ( 23.3528041840 17.3199234009 29.2470664978 )
  ( -21.9116325378 -17.3204193115 0.0060122907 ) ( 23.1802597046 17.3204154968 29.3922595978 )
  ( -21.9770240784 -17.3207588196 0.0076763034 ) ( 23.0618991852 17.3207588196 29.4926128387 )
  ( -22.0001754761 -17.3208084106 0.0077684075 ) ( 23.0295715332 17.3208045959 29.5270576477 )
  ( -21.7295742035 -17.3208065033 0.0077080876 ) ( 23.4570808411 17.3208084106 29.2825946808 )
  ( -21.0304641724 -17.3207855225 0.0073368996 ) ( 24.4739761353 17.3207855225 28.6281242371 )
  ( -20.3066558838 -17.3207244873 0.0062900484 ) ( 25.4129924774 17.3207168579 27.9476394653 )
  ( -20.0142250061 -17.3206138611 0.0055519938 ) ( 25.7612648010 17.3206119537 27.6795711517 )
  ( -20.1186141968 -17.3205127716 0.0055813342 ) ( 25.6412677765 17.3205089569 27.7614097595 )
  ( -20.4127540588 -17.3204689026 0.0065251663 ) ( 25.2923278809 17.3204650879 27.9967174530 )
  ( -20.8250122070 -17.3205184937 0.0081184730 ) ( 24.7769508362 17.3205146790 28.3294944763 )
  ( -21.2374801636 -17.3206367493 0.0098143956 ) ( 24.2327232361 17.3206291199 28.6574668884 )
  ( -21.5325775146 -17.3207550049 0.0110539794 ) ( 23.8291282654 17.3207511902 28.8838481903 )
  ( -21.6379737854 -17.3208045959 0.0115012228 ) ( 23.6832847595 17.3208045959 28.9616279602 )
}

baseframe {
  ( 0.0000000000 0.0000000000 0.0000000000 ) ( -0.7071068287 -0.0000000000 -0.0000000000 )
  ( -3.7220883369 15.5883541107 0.0158092398 ) ( -0.5319860578 -0.4658227265 0.5319861770 )
  ( 0.0158069842 0.7253782749 -4.2293028831 ) ( 0.6815123558 0.1885224134 -0.6815127134 )
  ( -0.0000008603 1.0023922920 -2.2860689163 ) ( -0.0000003336 -0.0596590936 -0.9982188940 )
  ( 0.0000000010 5.2951149940 -0.0000016321 ) ( 0.0778666586 -0.0000000160 -0.0000000564 )
  ( -0.0000000009 5.5872893333 -0.0000004839 ) ( 0.0159793925 -0.0040049786 -0.0016346668 )
  ( 0.0000000003 5.4236168861 0.0000006884 ) ( 0.0150023354 -0.0000000794 0.0000000253 )
  ( 0.0158079248 2.6921284199 -2.7244768143 ) ( 0.6528964043 0.2715259194 -0.6528964043 )
  ( -0.0000000006 5.6076002121 0.0000002984 ) ( 0.0177963804 -0.0000022176 -0.0000192518 )
  ( 0.0159386676 3.2198216915 -1.4872398376 ) ( 0.5966547132 0.3794800341 -0.5966378450 )
  ( -0.0000000022 4.9625768661 0.0000002383 ) ( 0.0018392461 0.0000013022 0.0000192297 )
  ( 0.0159972105 -0.3164609075 2.4960210323 ) ( -0.1907610744 0.0000004958 -0.0000000174 )
  ( 0.0000000000 3.9519104958 0.0000014305 ) ( 0.0602938756 0.0000001025 0.0000000062 )
  ( 0.0000000000 3.2605547905 -0.0000009537 ) ( 0.0867455453 -0.0000000468 -0.0000000101 )
  ( -5.7047104836 2.7340445518 -2.3252048492 ) ( 0.6987985373 -0.7152213454 0.0022497051 )
  ( -4.9808630943 4.7616004944 -1.6856464148 ) ( -0.5616764426 0.8254736662 -0.0105947424 )
  ( -4.1405067444 6.8342165947 -0.9228302240 ) ( 0.5536530614 -0.8290354013 -0.0782901794 )
  ( 5.7367129326 2.7340431213 -2.3251926899 ) ( -0.4867381752 -0.5081037879 0.5014085174 )
  ( 5.0128645897 4.7615990639 -1.6856358051 ) ( 0.5539450645 0.8213630319 0.0934750661 )
  ( 4.1725082397 6.8342146873 -0.9228212833 ) ( -0.5568271279 -0.8277298212 -0.0510358736 )
  ( -8.6595220566 -0.8033444881 2.2397105694 ) ( -0.2792378366 0.7978029251 0.5003764629 )
  ( 0.0000003204 7.2231268883 -0.0000004768 ) ( 0.0927502289 -0.5032481551 -0.8570011258 )
  ( -0.0000001192 11.4308481216 -0.0000019073 ) ( -0.9652854204 0.0058598421 0.0368102118 )
  ( 8.6910619736 -0.8040113449 2.2397751808 ) ( -0.2775567770 -0.7984272242 -0.5013206601 )
  ( -0.0000001490 7.2231292725 0.0000009537 ) ( 0.1676158756 0.5067360997 0.8455518484 )
  ( 0.0000004793 11.4308471680 0.0000007153 ) ( -0.9655788541 -0.0355931334 0.0280773621 )
  ( -7.7061948776 -0.1411823183 2.6340744495 ) ( -0.4844970107 0.6715618372 0.4026111066 )
  ( -0.0000000373 6.3036546707 0.0000000298 ) ( 0.2013457417 -0.5005806088 -0.8413327336 )
  ( 0.0000000000 7.2933096886 -0.0000007153 ) ( -0.9073526859 0.0195215177 -0.1706071049 )
  ( 7.7378110886 -0.1411832720 2.6340734959 ) ( -0.4643301070 -0.6897497773 -0.4257119000 )
  ( 0.0000000000 6.3036546707 0.0000017285 ) ( 0.1303723007 0.5009768605 0.8552095294 )
  ( -0.0000005364 7.2933101654 0.0000005960 ) ( -0.9134225249 -0.0079756621 0.1343692541 )
  ( -7.0111351013 1.1081300974 3.4398808479 ) ( -0.6126219630 0.5615829825 0.3317723572 )
  ( -0.0000004470 5.9885435104 0.0000005662 ) ( 0.0563720427 -0.5975177884 -0.7991787791 )
  ( -0.0000003576 6.1728167534 0.0000002384 ) ( -0.8802543879 0.0119903330 -0.0398214385 )
  ( 7.0427532196 1.1081298590 3.4398784637 ) ( -0.6268337369 -0.5410783887 -0.3040692806 )
  ( 0.0000004168 5.9885435104 -0.0000011325 ) ( 0.1305470318 0.5976421833 0.7904567122 )
  ( 0.0000000845 6.1728181839 -0.0000017807 ) ( -0.8755496144 -0.0259163864 0.0992287397 )
}

frame 0 {
  0.0000000000 0.0000000000 0.0000000000 -0.7071068287 -0.0000000000 -0.0000000000
  -3.7555050850 15.6032333374 0.0158092417 -0.5326197147 -0.4650979936 0.5326198936
  0.0158069842 0.7253782749 -4.2293043137 0.6815123558 0.1885223091 -0.6815127730
  -0.0000008593 1.0023922920 -2.2860682011 -0.0000003339 -0.0596581176 -0.9982189536
  0.0000000011 5.2951149940 0.0000000293 0.0778648183 -0.0000000155 -0.0000000494
  0.0000000009 5.5872883797 0.0000007082 0.0159750413 -0.0008258483 -0.0016855318
  0.0000000017 5.4236173630 0.0000015526 0.0150032053 0.0000001293 0.0000066821
  0.0158079248 2.6921284199 -2.7244756222 0.6528963447 0.2715259194 -0.6528964639
  -0.0000000022 5.6076002121 -0.0000044666 0.0158888251 -0.0000021630 -0.0000141514
  0.0159386694 3.2198212147 -1.4872395992 0.5966547132 0.3794800341 -0.5966377854
  0.0000000020 4.9625759125 0.0000007106 0.0032391625 0.0000020230 0.0000075284
  0.0159972105 -0.3164623380 2.4960215092 -0.2043547630 0.0000016587 -0.0000099069
  -0.0000000000 3.9519090652 -0.0000019073 0.1048953459 -0.0000002057 -0.0000067672
  -0.0000000001 3.2605526447 -0.0000004769 0.0600681379 -0.0000031968 0.0000165478
  -5.7047100067 2.7340438366 -2.3252069950 0.6987987757 -0.7152211070 0.0022484185
  -4.9808626175 4.7616004944 -1.6856465340 -0.5616765022 0.8254736662 -0.0105947424
  -4.1405067444 6.8342151642 -0.9228307009 0.5536531210 -0.8290354013 -0.0782901868
  5.7367134094 2.7340426445 -2.3251936436 -0.4867382050 -0.5081037879 0.5014085174
  5.0128650665 4.7615985870 -1.6856360435 0.5539449453 0.8213631511 0.0934749097
  4.1725082397 6.8342151642 -0.9228222370 -0.5568271279 -0.8277297616 -0.0510365069
  -8.6595191956 -0.8033437729 2.2397110462 -0.2795329988 0.7997525930 0.4971921146
  0.0000000894 7.2231264114 0.0000021458 0.0925138369 -0.5029194951 -0.8572539687
  -0.0000022650 11.4308452606 -0.0000014305 -0.9662971497 0.0064456658 0.0373543203
  8.6910629272 -0.8040114045 2.2397751808 -0.2778536677 -0.8003866673 -0.4981302321
  -0.0000001788 7.2231302261 -0.0000009537 0.1674072891 0.5063764453 0.8458151817
  -0.0000019744 11.4308490753 0.0000004768 -0.9666239619 -0.0357082821 0.0275976174
  -7.7061953545 -0.1411824077 2.6340744495 -0.4841610193 0.6728814840 0.4017266631
  0.0000002086 6.3036546707 -0.0000003576 0.2016747743 -0.5016568899 -0.8405763507
  -0.0000006258 7.2933092117 -0.0000009537 -0.9070422053 0.0168161876 -0.1714493334
  7.7378115654 -0.1411833167 2.6340734959 -0.4640305042 -0.6910304427 -0.4248123467
  0.0000000028 6.3036556244 0.0000002384 0.1307704151 0.5020686984 0.8544803858
  0.0000002310 7.2933092117 -0.0000001192 -0.9131439328 -0.0052443603 0.1352272630
  -7.0111355782 1.1081311703 3.4398806095 -0.6121699214 0.5616384745 0.3322176039
  0.0000001192 5.9885406494 0.0000019372 0.0565675758 -0.5976422429 -0.7990603447
  -0.0000004768 6.1728200912 0.0000008643 -0.8800579309 0.0086861877 -0.0391836688
  7.0427536964 1.1081304550 3.4398784637 -0.6264016032 -0.5411239266 -0.3045348227
  0.0000006203 5.9885439873 -0.0000010729 0.1307312250 0.5977645516 0.7903231382
  -0.0000002403 6.1728162766 -0.0000006184 -0.8753967881 -0.0226278212 0.0985798389
}

frame 1 {
  0.0000000000 0.0000000000 0.0000000000 -0.7071068287 -0.0000000000 -0.0000000000
  -3.8515806198 15.6463613510 0.0158092510 -0.5344585180 -0.4629838765 0.5344586372
  0.0158069804 0.7253777981 -4.2293047905 0.6815123558 0.1885223091 -0.6815126538
  -0.0000008623 1.0023922920 -2.2860677242 -0.0000003339 -0.0596575625 -0.9982188940
  0.0000000023 5.2951159477 -0.0000004699 0.0778638497 -0.0000000154 -0.0000000496
  0.0000000006 5.5872902870 -0.0000011991 0.0159755331 -0.0008258554 -0.0016854986
  -0.0000000038 5.4236159325 -0.0000006974 0.0150043182 0.0000001292 0.0000066809
  0.0158079248 2.6921288967 -2.7244753838 0.6528963447 0.2715258896 -0.6528964043
  -0.0000000012 5.6076006889 0.0000020303 0.0158870723 -0.0000021630 -0.0000141498
  0.0159386676 3.2198221684 -1.4872401953 0.5966547132 0.3794799745 -0.5966378450
  -0.0000000014 4.9625768661 0.0000004126 0.0048063584 0.0000020113 0.0000075305
  0.0159972068 -0.3164607286 2.4960179329 -0.2254202664 0.0000009995 -0.0000082253
  0.0000000000 3.9519114494 0.0000009539 0.1777451187 -0.0000002082 -0.0000109408
  0.0000000000 3.2605540752 0.0000007152 0.0171273444 -0.0000041138 0.0000188215
  -5.7047100067 2.7340438366 -2.3252058029 0.6987985969 -0.7152212858 0.0022497056
  -4.9808626175 4.7615981102 -1.6856461763 -0.5616764426 0.8254736662 -0.0105944695
  -4.1405067444 6.8342151642 -0.9228310585 0.5536530614 -0.8290354013 -0.0782901943
  5.7367134094 2.7340426445 -2.3251934052 -0.4867382050 -0.5081037879 0.5014085174
  5.0128650665 4.7615981102 -1.6856358051 0.5539450645 0.8213632107 0.0934749171
  4.1725082397 6.8342132568 -0.9228215218 -0.5568270683 -0.8277298212 -0.0510362014
  -8.6595191956 -0.8033423424 2.2397091389 -0.2802453637 0.8025306463 0.4923316538
  0.0000015348 7.2231283188 -0.0000021458 0.0920120850 -0.5008962750 -0.8585848808
  -0.0000009537 11.4308471680 0.0000009537 -0.9693651199 0.0103252437 0.0381956995
  8.6910629272 -0.8040108681 2.2397727966 -0.2785831988 -0.8031621575 -0.4932745695
  -0.0000008643 7.2231292725 -0.0000004768 0.1670258790 0.5042350292 0.8471848965
  -0.0000012666 11.4308490753 0.0000014305 -0.9697421193 -0.0381578468 0.0269629359
  -7.7061953545 -0.1411823928 2.6340730190 -0.4832041264 0.6767166853 0.3990882039
  0.0000001341 6.3036541939 0.0000013113 0.2026033998 -0.5047730803 -0.8383758664
  0.0000005066 7.2933101654 0.0000009537 -0.9061159492 0.0089805899 -0.1738096923
  7.7378115654 -0.1411833167 2.6340727806 -0.4632031024 -0.6947268844 -0.4221303463
  -0.0000000857 6.3036551476 0.0000000596 0.1318825781 0.5052280426 0.8523604870
  -0.0000001192 7.2933096886 -0.0000004768 -0.9123124480 0.0026288868 0.1376232356
  -7.0111355782 1.1081298590 3.4398803711 -0.6108720899 0.5617958307 0.3334933817
  0.0000002980 5.9885439873 0.0000009835 0.0571238361 -0.5980126858 -0.7987094522
  0.0000002682 6.1728177071 0.0000009537 -0.8794218302 -0.0009055974 -0.0372755826
  7.0427536964 1.1081298590 3.4398782253 -0.6251615286 -0.5412528515 -0.3058681190
  0.0000001714 5.9885420799 0.0000020266 0.1312539130 0.5981396437 0.7899205685
  -0.0000001565 6.1728177071 0.0000006184 -0.8748912811 -0.0130816987 0.0966337249
}

frame 2 {
  0.0000000000 0.0000000000 0.0000000000 -0.7071068287 -0.0000000000 -0.0000000000
  -3.9893445969 15.7083015442 0.0158092659 -0.5370870829 -0.4599320292 0.5370871425
  0.0158069804 0.7253780365 -4.2293052673 0.6815123558 0.1885223836 -0.6815126538
  -0.0000008636 1.0023920536 -2.2860682011 -0.0000003339 -0.0596569330 -0.9982189536
  0.0000000052 5.2951159477 -0.0000037034 0.0778629631 -0.0000000155 -0.0000000493
  0.0000000017 5.5872898102 -0.0000004839 0.0159757119 -0.0008258557 -0.0016854998
  0.0000000016 5.4236159325 -0.0000005186 0.0150039215 0.0000001292 0.0000066813
  0.0158079229 2.6921279430 -2.7244770527 0.6528964043 0.2715259194 -0.6528964043
  0.0000000023 5.6076002121 0.0000020303 0.0158892181 -0.0000021630 -0.0000141519
  0.0159386657 3.2198214531 -1.4872393608 0.5966547728 0.3794800341 -0.5966378450
  -0.0000000014 4.9625763893 0.0000007702 0.0073519181 0.0000019925 0.0000075364
  0.0159972087 -0.3164619803 2.4960207939 -0.2401632369 0.0000004729 -0.0000069375
  0.0000000001 3.9519085884 0.0000014308 0.2472693622 -0.0000002119 -0.0000143228
  0.0000000001 3.2605528831 -0.0000001193 -0.0258491617 -0.0000050214 0.0000207156
  -5.7047100067 2.7340443134 -2.3252060413 0.6987987757 -0.7152212262 0.0022484185
  -4.9808626175 4.7615995407 -1.6856470108 -0.5616764426 0.8254737258 -0.0105944695
  -4.1405067444 6.8342142105 -0.9228312969 0.5536530614 -0.8290354013 -0.0782901943
  5.7367134094 2.7340433598 -2.3251945972 -0.4867381752 -0.5081037879 0.5014085174
  5.0128650665 4.7615981102 -1.6856364012 0.5539450049 0.8213630319 0.0934749097
  4.1725082397 6.8342142105 -0.9228228331 -0.5568271875 -0.8277299404 -0.0510361977
  -8.6595191956 -0.8033436537 2.2397115231 -0.2812718153 0.8065910339 0.4851331711
  0.0000014603 7.2231273651 -0.0000009537 0.0912652016 -0.4982406199 -0.8603374362
  0.0000004768 11.4308471680 -0.0000004768 -0.9734574556 0.0159551986 0.0394313224
  8.6910629272 -0.8040106297 2.2397778034 -0.2796343863 -0.8072214723 -0.4860801399
  -0.0000005066 7.2231264114 -0.0000016689 -0.1664369255 -0.5014029741 -0.8490002155
  0.0000007823 11.4308500290 0.0000009537 -0.9739081860 -0.0417301133 0.0260041058
  -7.7061953545 -0.1411827207 2.6340742111 -0.4818861485 0.6822005510 0.3951351345
  0.0000001788 6.3036565781 -0.0000016987 0.2038671076 -0.5092654228 -0.8351804614
  0.0000004917 7.2933096886 0.0000002384 -0.9047034383 -0.0022359844 -0.1769963056
  7.7378115654 -0.1411836147 2.6340725422 -0.4620791078 -0.7000118494 -0.4181175530
  0.0000000820 6.3036551476 -0.0000005662 0.1334064007 0.5097654462 0.8492851853
  -0.0000010133 7.2933111191 -0.0000003576 -0.9110276103 0.0138997380 0.1408626437
  -7.0111355782 1.1081305742 3.4398810863 -0.6089913249 0.5620648265 0.3353127241
  0.0000003576 5.9885444641 -0.0000007153 0.0579450727 -0.5985728502 -0.7981790304
  0.0000000894 6.1728153229 -0.0000003874 -0.8783321381 -0.0147126308 -0.0345275737
  7.0427536964 1.1081296206 3.4398789406 -0.6233639121 -0.5414828062 -0.3077695966
  -0.0000001788 5.9885430336 0.0000002980 0.1320226341 0.5987015963 0.7893179059
  0.0000002086 6.1728172302 -0.0000003912 -0.8739899993 0.0006608000 0.0938181281
}

frame 3 {
  0.0000000000 0.0000000000 0.0000000000 -0.7071068287 -0.0000000000 -0.0000000000
  -4.1291241646 15.7705307007 0.0158092808 -0.5396981835 -0.4568652511 0.5396982431
  0.0158069823 0.7253787518 -4.2293038368 0.6815124154 0.1885224134 -0.6815126538
  -0.0000008594 1.0023934841 -2.2860684395 -0.0000003339 -0.0596599840 -0.9982188344
  -0.0000000027 5.2951154709 -0.0000004848 0.0778680369 -0.0000000154 -0.0000000497
  0.0000000005 5.5872893333 -0.0000009607 0.0159737337 -0.0008258496 -0.0016855152
  -0.0000000003 5.4236173630 0.0000016570 0.0150084356 0.0000001291 0.0000066765
  0.0158079267 2.6921288967 -2.7244751453 0.6528964043 0.2715259194 -0.6528964639
  0.0000000003 5.6076006889 -0.0000012479 0.0158792380 -0.0000021630 -0.0000141416
  0.0159386676 3.2198204994 -1.4872409105 0.5966547132 0.3794800937 -0.5966378450
  -0.0000000003 4.9625759125 0.0000000550 0.0106889782 0.0000019679 0.0000075367
  0.0159972087 -0.3164606094 2.4960203171 -0.2492656261 0.0000001126 -0.0000061084
  0.0000000000 3.9519109726 -0.0000014301 0.3041431606 -0.0000002160 -0.0000166794
  -0.0000000000 3.2605543137 -0.0000008345 -0.0625639185 -0.0000057886 0.0000220832
  -5.7047100067 2.7340445518 -2.3252058029 0.6987987161 -0.7152212262 0.0022497058
  -4.9808626175 4.7615995407 -1.6856476068 -0.5616765022 0.8254736662 -0.0105947414
  -4.1405067444 6.8342142105 -0.9228315353 0.5536530614 -0.8290354013 -0.0782901943
  5.7367134094 2.7340435982 -2.3251936436 -0.4867382050 -0.5081037879 0.5014085174
  5.0128650665 4.7615981102 -1.6856361628 0.5539450645 0.8213631511 0.0934749097
  4.1725082397 6.8342142105 -0.9228221178 -0.5568271875 -0.8277297020 -0.0510365106
  -8.6595191956 -0.8033448458 2.2397093773 -0.2822903693 0.8107451797 0.4776635170
  0.0000015795 7.2231273651 -0.0000016689 0.0905009955 -0.4959236383 -0.8618779778
  -0.0000002384 11.4308471680 -0.0000004768 -0.9771729112 0.0216016211 0.0406744033
  8.6910629272 -0.8040106297 2.2397742271 -0.2806777656 -0.8113762140 -0.4786121547
  -0.0000009835 7.2231283188 -0.0000016689 -0.1658093780 -0.4989235401 -0.8505992889
  -0.0000001490 11.4308490753 -0.0000019073 -0.9776984453 -0.0453241616 0.0250143129
  -7.7061953545 -0.1411824524 2.6340749264 -0.4806423485 0.6875982881 0.3910387158
  0.0000004172 6.3036551476 0.0000003874 0.2050327212 -0.5137097836 -0.8319923282
  -0.0000004992 7.2933092117 -0.0000007153 -0.9031773210 -0.0134770358 -0.1798672527
  7.7378115654 -0.1411832869 2.6340744495 -0.4610361159 -0.7052131295 -0.4139653146
  0.0000001490 6.3036541939 0.0000003576 0.1348320544 0.5142592192 0.8462050557
  -0.0000002980 7.2933096886 -0.0000007153 -0.9096167088 0.0251960717 0.1437920034
  -7.0111355782 1.1081308126 3.4398810863 -0.6070383787 0.5624393821 0.3371405602
  -0.0000003874 5.9885444641 -0.0000012517 0.0588327795 -0.5991519690 -0.7976216674
  -0.0000000224 6.1728200912 0.0000007749 -0.8770276904 -0.0286135878 -0.0318879075
  7.0427536964 1.1081308126 3.4398796558 -0.6214953065 -0.5418212414 -0.3096820712
  0.0000007749 5.9885430336 -0.0000028014 0.1328527629 0.5992884040 0.7886785269
  0.0000001788 6.1728157997 0.0000000764 -0.8728667498 0.0144979525 0.0910961628
}

frame 4 {
  0.0000000000 0.0000000000 0.0000000000 -0.7071068287 -0.0000000000 -0.0000000000
  -4.2290501595 15.8142080307 0.0158092976 -0.5415044427 -0.4547229409 0.5415045023
  0.0158069823 0.7253782749 -4.2293033600 0.6815124750 0.1885223687 -0.6815126538
  -0.0000008607 1.0023920536 -2.2860705853 -0.0000003339 -0.0596581921 -0.9982189536
  0.0000000013 5.2951149940 -0.0000030478 0.0778650492 -0.0000000155 -0.0000000494
  -0.0000000008 5.5872898102 -0.0000002454 0.0159749445 -0.0008258445 -0.0016855439
  0.0000000016 5.4236164093 -0.0000004888 0.0150022926 0.0000001293 0.0000066823
  0.0158079248 2.6921291351 -2.7244780064 0.6528964043 0.2715259194 -0.6528964639
  -0.0000000095 5.6076002121 -0.0000039301 0.0158918966 -0.0000021630 -0.0000141553
  0.0159386676 3.2198212147 -1.4872404337 0.5966547728 0.3794800341 -0.5966378450
  -0.0000000007 4.9625763893 -0.0000001835 0.0144566828 0.0000019398 0.0000075512
  0.0159972105 -0.3164625168 2.4960210323 -0.2571080327 -0.0000001519 -0.0000055263
  0.0000000000 3.9519100189 0.0000014310 0.3468793631 -0.0000002196 -0.0000184186
  0.0000000001 3.2605543137 -0.0000002385 -0.0904834494 -0.0000063774 0.0000231285
  -5.7047100067 2.7340443134 -2.3252050877 0.6987987161 -0.7152212262 0.0022484190
  -4.9808626175 4.7615995407 -1.6856470108 -0.5616763830 0.8254736662 -0.0105947405
  -4.1405067444 6.8342142105 -0.9228308201 0.5536531210 -0.8290354013 -0.0782901943
  5.7367134094 2.7340421677 -2.3251926899 -0.4867382050 -0.5081037879 0.5014085174
  5.0128650665 4.7615981102 -1.6856365204 0.5539450049 0.8213631511 0.0934749097
  4.1725082397 6.8342142105 -0.9228222370 -0.5568271279 -0.8277298808 -0.0510365143
  -8.6595191956 -0.8033436537 2.2397100925 -0.2829863429 0.8136973381 0.4722980857
  0.0000001937 7.2231273651 0.0000011921 0.0899632424 -0.4945378304 -0.8628101349
  -0.0000001192 11.4308462143 0.0000009537 -0.9795380235 0.0255190171 0.0415272750
  8.6910629272 -0.8040109873 2.2397744656 -0.2813917696 -0.8143286109 -0.4732475877
  -0.0000005960 7.2231283188 0.0000011921 -0.1653560847 -0.4974271059 -0.8515732288
  -0.0000007302 11.4308490753 0.0000000000 -0.9801151752 -0.0478185005 0.0243230481
  -7.7061944008 -0.1411822438 2.6340737343 -0.4798904955 0.6911321878 0.3882002831
  -0.0000000075 6.3036551476 -0.0000011623 0.2057411224 -0.5165824890 -0.8299181461
  0.0000003129 7.2933120728 0.0000002384 -0.9020569324 -0.0213783700 -0.1814257503
  7.7378106117 -0.1411831379 2.6340739727 -0.4604232907 -0.7086176872 -0.4110935330
  -0.0000002980 6.3036556244 -0.0000016987 0.1357130408 0.5171629190 0.8441964388
  -0.0000002980 7.2933077812 -0.0000005960 -0.9085592031 0.0331393592 0.1453937441
  -7.0111355782 1.1081289053 3.4398787022 -0.6056052446 0.5627978444 0.3384307325
  -0.0000004768 5.9885411263 -0.0000006258 0.0595153458 -0.5995662212 -0.7972139120
  0.0000001304 6.1728162766 0.0000006557 -0.8759866953 -0.0383843444 -0.0301872566
  7.0427536964 1.1081293821 3.4398763180 -0.6201214790 -0.5421564579 -0.3110343814
  0.0000010729 5.9885430336 0.0000007749 0.1334947944 0.5997065306 0.7882090211
  -0.0000007749 6.1728167534 0.0000003951 -0.8719429374 0.0242248327 0.0893286094
}

frame 5 {
  0.0000000000 0.0000000000 0.0000000000 -0.7071068287 -0.0000000000 -0.0000000000
  -4.2643342018 15.8293523788 0.0158093069 -0.5421237350 -0.4539844096 0.5421238542
  0.0158069804 0.7253785133 -4.2293043137 0.6815123558 0.1885223091 -0.6815126538
  -0.0000008599 1.0023927689 -2.2860689163 -0.0000003339 -0.0596574955 -0.9982188940
  0.0000000002 5.2951149940 -0.0000011702 0.0778639168 -0.0000000154 -0.0000000495
  -0.0000000007 5.5872902870 0.0000011851 0.0159753542 -0.0008258563 -0.0016854963
  0.0000000009 5.4236178398 0.0000006884 0.0150102759 0.0000001291 0.0000066741
  0.0158079248 2.6921286583 -2.7244765759 0.6528964043 0.2715259194 -0.6528964043
  0.0000000053 5.6076006889 -0.0000005923 0.0158731379 -0.0000021631 -0.0000141353
  0.0159386657 3.2198202610 -1.4872395992 0.5966547132 0.3794800937 -0.5966378450
  -0.0000000014 4.9625763893 0.0000007702 0.0182415023 0.0000019122 0.0000075465
  0.0159972087 -0.3164623380 2.4960200787 -0.2675056756 -0.0000003962 -0.0000049785
  0.0000000000 3.9519090652 0.0000009542 0.3775759339 -0.0000002224 -0.0000199912
  0.0000000000 3.2605547905 0.0000002383 -0.1093796566 -0.0000068066 0.0000240959
  -5.7047100067 2.7340450287 -2.3252058029 0.6987985969 -0.7152212858 0.0022484185
  -4.9808626175 4.7616000175 -1.6856467724 -0.5616764426 0.8254737854 -0.0105947433
  -4.1405067444 6.8342151642 -0.9228316545 0.5536530614 -0.8290354013 -0.0782902092
  5.7367134094 2.7340438366 -2.3251934052 -0.4867381752 -0.5081037879 0.5014085174
  5.0128650665 4.7615985870 -1.6856362820 0.5539450049 0.8213631511 0.0934750587
  4.1725082397 6.8342151642 -0.9228230715 -0.5568271279 -0.8277298808 -0.0510365181
  -8.6595191956 -0.8033437133 2.2397108078 -0.2832208872 0.8147320747 0.4704092741
  -0.0000002831 7.2231259346 -0.0000002384 0.0897787362 -0.4941149056 -0.8630979061
  -0.0000003576 11.4308471680 0.0000000000 -0.9803078175 0.0268494934 0.0418152548
  8.6910629272 -0.8040104508 2.2397754192 -0.2816330492 -0.8153633475 -0.4713590443
  0.0000004172 7.2231278419 -0.0000021458 -0.1651978195 -0.4969674349 -0.8518752456
  0.0000002682 11.4308490753 0.0000011921 -0.9809024930 -0.0486630909 0.0240876339
  -7.7061939240 -0.1411822438 2.6340732574 -0.4798426330 0.6918739676 0.3874522150
  0.0000001714 6.3036556244 -0.0000024140 0.2058444023 -0.5170277953 -0.8295969367
  -0.0000006855 7.2933106422 -0.0000007153 -0.9017243981 -0.0241111536 -0.1812486798
  7.7378110886 -0.1411834955 2.6340723038 -0.4604117572 -0.7093325853 -0.4103441238
  -0.0000000298 6.3036556244 0.0000006557 0.1358417273 0.5176115036 0.8438859582
  -0.0000011325 7.2933111191 -0.0000008345 -0.9082197547 0.0358915925 0.1452297568
  -7.0111355782 1.1081303358 3.4398801327 -0.6050887704 0.5629506707 0.3388816714
  0.0000004172 5.9885439873 0.0000008047 0.0597699173 -0.5997100472 -0.7970695496
  0.0000003949 6.1728167534 0.0000001192 -0.8756018877 -0.0417762212 -0.0296503026
  7.0427536964 1.1081305742 3.4398777485 -0.6196256280 -0.5423017144 -0.3115081489
  -0.0000004172 5.9885416031 -0.0000015497 0.1337341666 0.5998514891 0.7880415916
  0.0000005364 6.1728167534 -0.0000006768 -0.8715953231 0.0276020560 0.0887669250
}

frame 6 {
  0.0000000000 0.0000000000 0.0000000000 -0.7071068287 -0.0000000000 -0.0000000000
  -3.9179313183 15.7108602524 0.0158092845 -0.5381202102 -0.4587228298 0.5381202698
  0.0158069842 0.7253777981 -4.2293033600 0.6815124750 0.1885223687 -0.6815127134
  -0.0000008613 1.0023918152 -2.2860670090 -0.0000003340 -0.0596576445 -0.9982188940
  0.0000000010 5.2951140404 -0.0000004252 0.0778646842 -0.0000000154 -0.0000000495
  0.0000000018 5.5872883797 -0.0000002454 0.0159748048 -0.0008258494 -0.0016855226
  0.0000000016 5.4236164093 0.0000020593 0.0150063895 0.0000001292 0.0000066794
  0.0158079211 2.6921286583 -2.7244749069 0.6528964043 0.2715259194 -0.6528964043
  -0.0000000001 5.6076011658 0.0000026860 0.0158836544 -0.0000021630 -0.0000141460
  0.0159386657 3.2198214531 -1.4872393608 0.5966547132 0.3794799745 -0.5966378450
  -0.0000000019 4.9625763893 0.0000008894 0.0215660334 0.0000018875 0.0000075595
  0.0159972087 -0.3164622188 2.4960198402 -0.2949575782 -0.0000008696 -0.0000037953
  0.0000000000 3.9519107342 0.0000004775 0.4010994136 -0.0000002232 -0.0000228564
  0.0000000000 3.2605538368 0.0000002383 -0.1348742545 -0.0000066896 0.0000259436
  -5.7047100067 2.7340445518 -2.3252065182 0.6987987161 -0.7152211666 0.0022484188
  -4.9808626175 4.7615995407 -1.6856465340 -0.5616764426 0.8254737854 -0.0105947405
  -4.1405067444 6.8342142105 -0.9228314161 0.5536531210 -0.8290354013 -0.0782901868
  5.7367134094 2.7340433598 -2.3251941204 -0.4867382050 -0.5081037879 0.5014085174
  5.0128650665 4.7615981102 -1.6856361628 0.5539450049 0.8213631511 0.0934750587
  4.1725082397 6.8342142105 -0.9228229523 -0.5568270087 -0.8277299404 -0.0510365181
  -8.6595191956 -0.8033437729 2.2397117615 -0.2850688100 0.7983657718 0.4939688742
  -0.0000001043 7.2231268883 0.0000010729 0.0893664062 -0.4731509387 -0.8751254082
  -0.0000005960 11.4308462143 0.0000004768 -0.9803289175 0.0353332162 0.0444231890
  8.6910629272 -0.8040106297 2.2397758961 -0.2834000289 -0.7990207672 -0.4949250519
  -0.0000007004 7.2231273651 0.0000001192 -0.1658421904 -0.4755792022 -0.8638934493
  -0.0000005569 11.4308490753 -0.0000002384 -0.9810988903 -0.0568491258 0.0214870851
  -7.7061953545 -0.1411821842 2.6340749264 -0.4853260219 0.6768944263 0.3961143494
  0.0000002310 6.3036532402 0.0000000596 0.2017357200 -0.5018942356 -0.8404129148
  -0.0000008196 7.2933101654 0.0000004768 -0.9067344666 -0.0019332831 -0.1668602675
  7.7378115654 -0.1411831379 2.6340732574 -0.4654670656 -0.6949086785 -0.4192635119
  -0.0000002682 6.3036546707 -0.0000005662 0.1308424026 0.5023107529 0.8543213010
  -0.0000002682 7.2933077812 -0.0000001192 -0.9126536846 0.0135897659 0.1306542605
  -7.0111355782 1.1081290245 3.4398815632 -0.6176816225 0.5528229475 0.3311533034
  0.0000000298 5.9885416031 0.0000007749 0.0509782657 -0.6005061269 -0.7975572348
  0.0000000596 6.1728181839 -0.0000017285 -0.8788344860 -0.0171058346 -0.0094201015
  7.0427536964 1.1081292629 3.4398791790 -0.6318607330 -0.5321307778 -0.3032245338
  0.0000000149 5.9885430336 -0.0000000596 0.1250288337 0.6006015539 0.7893458605
  0.0000000745 6.1728153229 -0.0000002794 -0.8761878610 0.0030479617 0.0688014179
}

frame 7 {
  0.0000000000 0.0000000000 0.0000000000 -0.7071068287 -0.0000000000 -0.0000000000
  -3.0463941097 15.4057979584 0.0158092156 -0.5274452567 -0.4709580243 0.5274453759
  0.0158069804 0.7253773212 -4.2293057442 0.6815123558 0.1885223389 -0.6815127134
  -0.0000008637 1.0023916960 -2.2860670090 -0.0000003339 -0.0596588440 -0.9982188344
  0.0000000004 5.2951154709 -0.0000009504 0.0778661594 -0.0000000155 -0.0000000497
  0.0000000015 5.5872888565 -0.0000026297 0.0159744099 -0.0008258515 -0.0016855103
  0.0000000003 5.4236159325 -0.0000030965 0.0150049087 0.0000001293 0.0000066805
  0.0158079248 2.6921288967 -2.7244751453 0.6528964043 0.2715259194 -0.6528964639
  -0.0000000039 5.6075997353 0.0000017323 0.0158871654 -0.0000021630 -0.0000141500
  0.0159386694 3.2198212147 -1.4872400761 0.5966547728 0.3794800341 -0.5966378450
  -0.0000000000 4.9625759125 -0.0000000643 0.0241105426 0.0000018685 0.0000075707
  0.0159972105 -0.3164606392 2.4960203171 -0.3398660123 -0.0000017647 -0.0000014384
  0.0000000000 3.9519081116 0.0000000008 0.4077946842 -0.0000002214 -0.0000281579
  0.0000000001 3.2605533600 -0.0000002385 -0.1701233983 -0.0000055240 0.0000293269
  -5.7047100067 2.7340450287 -2.3252072334 0.6987987161 -0.7152211666 0.0022497056
  -4.9808626175 4.7615990639 -1.6856459379 -0.5616764426 0.8254736066 -0.0105944686
  -4.1405067444 6.8342132568 -0.9228306413 0.5536530614 -0.8290354013 -0.0782901943
  5.7367134094 2.7340431213 -2.3251941204 -0.4867382050 -0.5081037879 0.5014085174
  5.0128650665 4.7615985870 -1.6856358051 0.5539450049 0.8213630915 0.0934748948
  4.1725082397 6.8342146873 -0.9228222370 -0.5568271279 -0.8277298808 -0.0510361977
  -8.6595191956 -0.8033442497 2.2397108078 -0.2882204354 0.7526218891 0.5530991554
  -0.0000003129 7.2231278419 0.0000013113 0.0877490789 -0.4211505055 -0.9021079540
  -0.0000005960 11.4308490753 0.0000004768 -0.9790967703 0.0578282103 0.0515253954
  8.6910629272 -0.8040109873 2.2397763729 -0.2863493264 -0.7533393502 -0.5540648699
  0.0000009984 7.2231268883 0.0000005960 -0.1665978283 -0.4224609137 -0.8909165859
  -0.0000001788 11.4308490753 0.0000009537 -0.9803470373 -0.0790845081 0.0143193658
  -7.7061958313 -0.1411825716 2.6340761185 -0.4996198714 0.6428018808 0.4099695385
  0.0000003278 6.3036522865 0.0000010133 0.1896853447 -0.4703036249 -0.8618755937
  -0.0000003576 7.2933096886 0.0000002384 -0.9169462323 0.0558134951 -0.1288578361
  7.7378110886 -0.1411832273 2.6340734959 -0.4790695608 -0.6620606780 -0.4337993562
  0.0000001825 6.3036537170 0.0000003576 -0.1170431376 -0.4702942669 -0.8747029901
  -0.0000004172 7.2933092117 -0.0000007153 -0.9213458300 -0.0445462465 0.0922767520
  -7.0111351013 1.1081298590 3.4398796558 -0.6524360180 0.5309705734 0.3054128885
  -0.0000001490 5.9885454178 0.0000004768 0.0290850084 -0.6097660065 -0.7920433879
  -0.0000002682 6.1728167534 0.0000010133 -0.8830180764 0.0457811840 0.0395078771
  7.0427541733 1.1081296206 3.4398772717 -0.6654304266 -0.5105031133 -0.2759570181
  0.0000000186 5.9885439873 0.0000010133 -0.1027141586 -0.6097516418 -0.7858932018
  -0.0000001192 6.1728186607 0.0000009239 -0.8836689591 -0.0594783537 0.0202684570
}

frame 8 {
  0.0000000000 0.0000000000 0.0000000000 -0.7071068287 -0.0000000000 -0.0000000000
  -2.1880936623 15.1025857925 0.0158091467 -0.5164929032 -0.4829441309 0.5164930224
  0.0158069823 0.7253782749 -4.2293043137 0.6815123558 0.1885222793 -0.6815127730
  -0.0000008601 1.0023924112 -2.2860708237 -0.0000003339 -0.0596576817 -0.9982188940
  -0.0000000065 5.2951145172 -0.0000028392 0.0778637081 -0.0000000154 -0.0000000496
  -0.0000000009 5.5872902870 -0.0000009607 0.0159757081 -0.0008258538 -0.0016855007
  -0.0000000015 5.4236168861 -0.0000016213 0.0150021184 0.0000001293 0.0000066832
  0.0158079229 2.6921279430 -2.7244782448 0.6528964043 0.2715259194 -0.6528964043
  0.0000000026 5.6075997353 -0.0000008009 0.0158920977 -0.0000021630 -0.0000141547
  0.0159386657 3.2198219299 -1.4872415066 0.5966547728 0.3794800341 -0.5966378450
  -0.0000000018 4.9625768661 -0.0000008317 0.0256746244 0.0000018565 0.0000075796
  0.0159972068 -0.3164606094 2.4960188866 -0.3726721406 -0.0000027276 0.0000011627
  0.0000000000 3.9519100189 -0.0000009528 0.3902504146 -0.0000002187 -0.0000338990
  0.0000000000 3.2605569363 0.0000002383 -0.1910763383 -0.0000039156 0.0000327550
  -5.7047100067 2.7340450287 -2.3252058029 0.6987987161 -0.7152211666 0.0022484185
  -4.9808621407 4.7616000175 -1.6856452227 -0.5616764426 0.8254737258 -0.0105947414
  -4.1405067444 6.8342146873 -0.9228302240 0.5536530614 -0.8290354013 -0.0782901943
  5.7367134094 2.7340443134 -2.3251926899 -0.4867382050 -0.5081037879 0.5014085174
  5.0128655434 4.7615971565 -1.6856361628 0.5539450645 0.8213630915 0.0934749171
  4.1725082397 6.8342156410 -0.9228218794 -0.5568270683 -0.8277298212 -0.0510361940
  -8.6595211029 -0.8033438921 2.2397093773 -0.2875823677 0.7025178671 0.6089179516
  -0.0000005662 7.2231283188 -0.0000005364 0.0852631330 -0.3727470040 -0.9237929583
  0.0000002384 11.4308490753 -0.0000004768 -0.9757094979 0.0814311430 0.0585901216
  8.6910629272 -0.8040105104 2.2397744656 -0.2851979136 -0.7033842802 -0.6097918153
  0.0000003874 7.2231283188 0.0000001788 -0.1659092754 -0.3729781806 -0.9127588868
  -0.0000010729 11.4308481216 0.0000002384 -0.9774218202 -0.1036325321 0.0071063437
  -7.7061939240 -0.1411824822 2.6340727806 -0.5161783099 0.6151585579 0.4124549627
  -0.0000001788 6.3036546707 -0.0000004768 -0.1760507077 0.4476037323 0.8762063980
  0.0000002980 7.2933087349 -0.0000007153 -0.9236167669 0.1138424799 -0.0892915055
  7.7378110886 -0.1411830485 2.6340720654 -0.4954870343 -0.6353698373 -0.4370888770
  0.0000000149 6.3036561012 0.0000002384 -0.1022564694 -0.4471544325 -0.8878443241
  0.0000005960 7.2933096886 0.0000003576 -0.9264377356 -0.1031061932 0.0524757542
  -7.0111355782 1.1081304550 3.4398808479 -0.6893520951 0.5140436292 0.2740507722
  -0.0000003045 5.9885430336 -0.0000010133 -0.0095587159 0.6281259060 0.7774820924
  0.0000004172 6.1728191376 0.0000004768 -0.8815749288 0.1070431992 0.0811292529
  7.0427536964 1.1081304550 3.4398791790 -0.7009082437 -0.4942894578 -0.2429771125
  -0.0000001192 5.9885416031 -0.0000002384 -0.0819142684 -0.6280059814 -0.7732142806
  -0.0000005960 6.1728181839 0.0000002980 -0.8850425482 -0.1203339025 -0.0213554874
}

frame 9 {
  0.0000000000 0.0000000000 0.0000000000 -0.7071068287 -0.0000000000 -0.0000000000
  -1.8543522358 14.9858589172 0.0158091206 -0.5122362971 -0.4874566495 0.5122363567
  0.0158069804 0.7253781557 -4.2293038368 0.6815123558 0.1885223538 -0.6815126538
  -0.0000008621 1.0023922920 -2.2860660553 -0.0000003339 -0.0596573800 -0.9982188940
  -0.0000000002 5.2951154709 -0.0000007232 0.0778638572 -0.0000000155 -0.0000000495
  -0.0000000016 5.5872893333 0.0000005294 0.0159752760 -0.0008258492 -0.0016855348
  0.0000000010 5.4236178398 0.0000028937 0.0149992872 0.0000001294 0.0000066861
  0.0158079285 2.6921291351 -2.7244744301 0.6528964043 0.2715259194 -0.6528964639
  0.0000000005 5.6076002121 -0.0000026934 0.0158978570 -0.0000021631 -0.0000141607
  0.0159386694 3.2198204994 -1.4872395992 0.5966547132 0.3794800937 -0.5966378450
  -0.0000000001 4.9625754356 -0.0000003623 0.0261919834 0.0000018523 0.0000075851
  0.0159972124 -0.3164599538 2.4960186481 -0.3822648525 -0.0000031340 0.0000022736
  0.0000000000 3.9519071579 0.0000014314 0.3774127364 -0.0000002174 -0.0000363503
  -0.0000000002 3.2605531216 -0.0000003577 -0.1953864247 -0.0000031970 0.0000341418
  -5.7047100067 2.7340452671 -2.3252069950 0.6987987757 -0.7152211666 0.0022484188
  -4.9808621407 4.7615981102 -1.6856477261 -0.5616764426 0.8254737258 -0.0105944695
  -4.1405067444 6.8342146873 -0.9228310585 0.5536530614 -0.8290354013 -0.0782901943
  5.7367134094 2.7340443134 -2.3251941204 -0.4867381752 -0.5081037879 0.5014085174
  5.0128655434 4.7615971565 -1.6856367588 0.5539450049 0.8213631511 0.0934749097
  4.1725082397 6.8342151642 -0.9228227139 -0.5568271279 -0.8277298808 -0.0510361977
  -8.6595201492 -0.8033420444 2.2397093773 -0.2856760025 0.6841600537 0.6278123260
  0.0000004172 7.2231268883 -0.0000001192 0.0844270587 -0.3589574099 -0.9293816686
  0.0000001639 11.4308471680 0.0000019073 -0.9730092287 0.0872915387 0.0605125725
  8.6910638809 -0.8040097356 2.2397749424 -0.2832035422 -0.6850607395 -0.6286718845
  0.0000009835 7.2231287956 0.0000016689 -0.1655575335 -0.3589256406 -0.9184018373
  -0.0000001192 11.4308500290 -0.0000002384 -0.9748546481 -0.1106420159 0.0050109848
  -7.7061939240 -0.1411824971 2.6340773106 -0.5231766701 0.6067951322 0.4106981158
  0.0000005066 6.3036565781 0.0000005960 -0.1708443016 0.4414273202 0.8798499703
  -0.0000002384 7.2933101654 0.0000007153 -0.9252016544 0.1361642033 -0.0751071721
  7.7378110886 -0.1411831528 2.6340749264 -0.5025623441 -0.6272633076 -0.4356746674
  0.0000000000 6.3036551476 0.0000000000 -0.0967674851 -0.4408050179 -0.8910422325
  -0.0000003576 7.2933077812 -0.0000002384 -0.9274573922 -0.1256831884 0.0382395163
  -7.0111355782 1.1081299782 3.4398789406 -0.7022145391 0.5094441175 0.2622900903
  -0.0000002235 5.9885444641 -0.0000000596 -0.0037447631 0.6358370185 0.7708491087
  0.0000001788 6.1728162766 0.0000014901 -0.8797367811 0.1306567043 0.0917470977
  7.0427536964 1.1081297398 3.4398775101 -0.7132324576 -0.4900552034 -0.2306533903
  0.0000004768 5.9885425568 0.0000004768 -0.0755104125 -0.6356834769 -0.7671508193
  -0.0000003576 6.1728172302 -0.0000009239 -0.8839265704 -0.1437993646 -0.0320733562
}

frame 10 {
  0.0000000000 0.0000000000 0.0000000000 -0.7071068287 -0.0000000000 -0.0000000000
  -1.9702156782 15.0231523514 0.0158091281 -0.5134817958 -0.4861444235 0.5134819150
  0.0158069804 0.7253779173 -4.2293043137 0.6815123558 0.1885223091 -0.6815127730
  -0.0000008603 1.0023922920 -2.2860682011 -0.0000003339 -0.0596584529 -0.9982188344
  -0.0000000002 5.2951149940 0.0000018100 0.0778660998 -0.0000000154 -0.0000000495
  0.0000000015 5.5872888565 0.0000003506 0.0159741025 -0.0008258497 -0.0016855125
  0.0000000036 5.4236178398 0.0000036239 0.0150100552 0.0000001292 0.0000066751
  0.0158079267 2.6921291351 -2.7244753838 0.6528964043 0.2715259492 -0.6528964639
  0.0000000026 5.6076016426 0.0000007190 0.0158747695 -0.0000021630 -0.0000141370
  0.0159386694 3.2198212147 -1.4872395992 0.5966547728 0.3794800341 -0.5966378450
  0.0000000017 4.9625763893 0.0000007553 0.0247543585 0.0000018636 0.0000075693
  0.0159972087 -0.3164623976 2.4960203171 -0.3743427098 -0.0000028098 0.0000014541
  0.0000000000 3.9519104958 0.0000000008 0.3673421144 -0.0000002167 -0.0000343817
  0.0000000001 3.2605535984 -0.0000005961 -0.1835740805 -0.0000033336 0.0000329433
  -5.7047100067 2.7340438366 -2.3252050877 0.6987986565 -0.7152212262 0.0022484183
  -4.9808621407 4.7615985870 -1.6856454611 -0.5616763830 0.8254737854 -0.0105944695
  -4.1405067444 6.8342142105 -0.9228297472 0.5536530614 -0.8290354013 -0.0782901943
  5.7367134094 2.7340431213 -2.3251941204 -0.4867381752 -0.5081037879 0.5014085174
  5.0128655434 4.7615976334 -1.6856343746 0.5539450645 0.8213630915 0.0934750587
  4.1725082397 6.8342127800 -0.9228215218 -0.5568270683 -0.8277298212 -0.0510365106
  -8.6595201492 -0.8033446670 2.2397119999 -0.2860707641 0.6947782040 0.6181076169
  0.0000000149 7.2231278419 0.0000007749 0.0859044939 -0.3734802902 -0.9234047532
  0.0000008345 11.4308490753 -0.0000004768 -0.9718834162 0.0756432861 0.0580028966
  8.6910638809 -0.8040109277 2.2397775650 -0.2836742103 -0.6956408024 -0.6189843416
  0.0000007004 7.2231268883 0.0000010729 -0.1665238291 -0.3738401830 -0.9123159647
  0.0000009537 11.4308481216 -0.0000002384 -0.9735684395 -0.1002339348 0.0074285236
  -7.7061944008 -0.1411820650 2.6340751648 -0.5196037889 0.6105314493 0.4120116532
  -0.0000000894 6.3036527634 0.0000032187 -0.1733873338 0.4443028867 0.8781750202
  -0.0000005364 7.2933101654 -0.0000002384 -0.9243616462 0.1290019602 -0.0829784274
  7.7378106117 -0.1411828697 2.6340739727 -0.4989299178 -0.6308885217 -0.4368126988
  -0.0000002682 6.3036541939 -0.0000005960 -0.0994401202 -0.4437654316 -0.8895845413
  0.0000003576 7.2933101654 0.0000002384 -0.9269310832 -0.1184282526 0.0461384170
  -7.0111355782 1.1081299782 3.4398794174 -0.6937847137 0.5136542320 0.2692631781
  0.0000001267 5.9885411263 0.0000022054 -0.0079583907 0.6296350360 0.7761795521
  -0.0000001192 6.1728162766 -0.0000005364 -0.8807010055 0.1241241470 0.0801034644
  7.0427536964 1.1081298590 3.4398779869 -0.7051221132 -0.4940631092 -0.2379967421
  -0.0000000596 5.9885435104 0.0000003576 -0.0802023783 -0.6295002103 -0.7720701098
  -0.0000003576 6.1728162766 0.0000014305 -0.8841013312 -0.1373347044 -0.0203913003
}

frame 11 {
  0.0000000000 0.0000000000 0.0000000000 -0.7071068287 -0.0000000000 -0.0000000000
  -2.3004493713 15.1307048798 0.0158091486 -0.5170881748 -0.4823067486 0.5170882940
  0.0158069804 0.7253782749 -4.2293038368 0.6815123558 0.1885222793 -0.6815127134
  -0.0000008634 1.0023924112 -2.2860710621 -0.0000003339 -0.0596574284 -0.9982188940
  -0.0000000010 5.2951149940 -0.0000040610 0.0778639838 -0.0000000154 -0.0000000494
  -0.0000000031 5.5872898102 -0.0000011992 0.0159752388 -0.0008258509 -0.0016855213
  -0.0000000007 5.4236173630 -0.0000016660 0.0150019210 0.0000001293 0.0000066833
  0.0158079229 2.6921291351 -2.7244768143 0.6528964043 0.2715259194 -0.6528964639
  -0.0000000011 5.6075997353 0.0000021793 0.0158923380 -0.0000021630 -0.0000141552
  0.0159386657 3.2198224068 -1.4872405529 0.5966547132 0.3794800043 -0.5966377854
  -0.0000000025 4.9625778198 -0.0000009285 0.0205246340 0.0000018948 0.0000075700
  0.0159972105 -0.3164620399 2.4960203171 -0.3501249850 -0.0000019244 -0.0000007806
  0.0000000000 3.9519126415 -0.0000019066 0.3350341618 -0.0000002144 -0.0000289836
  -0.0000000002 3.2605531216 -0.0000002441 -0.1471558958 -0.0000036433 0.0000296540
  -5.7047100067 2.7340435982 -2.3252065182 0.6987987757 -0.7152211666 0.0022484188
  -4.9808621407 4.7615981102 -1.6856485605 -0.5616764426 0.8254737854 -0.0105947405
  -4.1405067444 6.8342142105 -0.9228305221 0.5536530614 -0.8290354013 -0.0782901943
  5.7367134094 2.7340428829 -2.3251934052 -0.4867381752 -0.5081037879 0.5014085174
  5.0128655434 4.7615976334 -1.6856374741 0.5539450049 0.8213631511 0.0934750587
  4.1725082397 6.8342132568 -0.9228222370 -0.5568271279 -0.8277298808 -0.0510361977
  -8.6595191956 -0.8033419847 2.2397096157 -0.2864039242 0.7177583575 0.5951998234
  0.0000011325 7.2231273651 0.0000010729 0.0881437510 -0.4009464979 -0.9113560319
  0.0000010729 11.4308471680 -0.0000004768 -0.9709146619 0.0574882403 0.0532833487
  8.6910648346 -0.8040091395 2.2397747040 -0.2842265368 -0.7185435891 -0.5961185694
  0.0000007749 7.2231273651 -0.0000001192 -0.1677473038 -0.4020044804 -0.9001060128
  -0.0000002980 11.4308509827 0.0000004768 -0.9722946882 -0.0833162516 0.0120468512
  -7.7061948776 -0.1411822736 2.6340725422 -0.5115005970 0.6204569340 0.4139374495
  -0.0000002384 6.3036527634 0.0000011623 -0.1794687659 0.4523778558 0.8732982278
  -0.0000000447 7.2933092117 0.0000007153 -0.9220486283 0.1081949919 -0.1012407988
  7.7378101349 -0.1411829293 2.6340713501 -0.4907429516 -0.6404938102 -0.4383412898
  -0.0000000447 6.3036565781 0.0000009537 -0.1059062928 -0.4520403147 -0.8852307200
  0.0000007302 7.2933092117 0.0000004768 -0.9253463149 -0.0973820984 0.0644779429
  -7.0111355782 1.1081300974 3.4398787022 -0.6759477854 0.5222366452 0.2842647433
  -0.0000002272 5.9885425568 0.0000013113 -0.0171985216 0.6185188890 0.7853507996
  0.0000003874 6.1728172302 -0.0000016689 -0.8825014830 0.1036385298 0.0569908321
  7.0427536964 1.1081300974 3.4398772717 -0.6879734397 -0.5022622347 -0.2537800372
  0.0000006258 5.9885420799 0.0000001192 -0.0902550891 -0.6184446812 -0.7803339958
  -0.0000002980 6.1728157997 -0.0000014156 -0.8843354583 -0.1170086041 0.0027906310
}

frame 12 {
  0.0000000000 0.0000000000 0.0000000000 -0.7071068287 -0.0000000000 -0.0000000000
  -2.7716429234 15.2848072052 0.0158091784 -0.5222231746 -0.4767420292 0.5222232342
  0.0158069786 0.7253781557 -4.2293038368 0.6815123558 0.1885223985 -0.6815127730
  -0.0000008630 1.0023920536 -2.2860686779 -0.0000003339 -0.0596578903 -0.9982188940
  0.0000000017 5.2951149940 0.0000038366 0.0778641179 -0.0000000154 -0.0000000494
  -0.0000000004 5.5872893333 0.0000009466 0.0159755964 -0.0008258498 -0.0016855345
  -0.0000000033 5.4236159325 0.0000011652 0.0149987917 0.0000001294 0.0000066866
  0.0158079267 2.6921284199 -2.7244751453 0.6528963447 0.2715259194 -0.6528964639
  -0.0000000009 5.6076006889 -0.0000009499 0.0158988517 -0.0000021630 -0.0000141618
  0.0159386694 3.2198202610 -1.4872398376 0.5966547728 0.3794800043 -0.5966378450
  0.0000000014 4.9625763893 0.0000005020 0.0144532584 0.0000019399 0.0000075600
  0.0159972068 -0.3164608479 2.4960193634 -0.3113332391 -0.0000007492 -0.0000037484
  -0.0000000000 3.9519095421 -0.0000004762 0.2788195312 -0.0000002112 -0.0000217591
  0.0000000000 3.2605543137 0.0000007152 -0.0886729658 -0.0000038533 0.0000252749
  -5.7047100067 2.7340450287 -2.3252046108 0.6987987161 -0.7152211666 0.0022484185
  -4.9808626175 4.7616004944 -1.6856468916 -0.5616764426 0.8254737854 -0.0105944686
  -4.1405067444 6.8342142105 -0.9228301644 0.5536530614 -0.8290354013 -0.0782901943
  5.7367134094 2.7340440750 -2.3251934052 -0.4867382050 -0.5081037879 0.5014085174
  5.0128650665 4.7615981102 -1.6856356859 0.5539450645 0.8213631511 0.0934749097
  4.1725082397 6.8342132568 -0.9228218198 -0.5568271279 -0.8277298212 -0.0510362014
  -8.6595191956 -0.8033438325 2.2397093773 -0.2847195864 0.7473182678 0.5629860759
  0.0000007749 7.2231268883 0.0000004768 0.0901181623 -0.4362396002 -0.8943604231
  0.0000000000 11.4308481216 -0.0000014305 -0.9695255160 0.0379823670 0.0472744554
  8.6910648346 -0.8040100336 2.2397744656 -0.2828146219 -0.7480264902 -0.5639409423
  -0.0000003725 7.2231287956 -0.0000002384 -0.1682805717 -0.4381876290 -0.8829910159
  0.0000004172 11.4308490753 -0.0000007153 -0.9705117941 -0.0650481209 0.0179179460
  -7.7061944008 -0.1411821097 2.6340737343 -0.5015193224 0.6359564662 0.4135449231
  -0.0000001192 6.3036546707 -0.0000002682 0.1874833256 -0.4659589529 -0.8647091985
  -0.0000001192 7.2933092117 -0.0000002384 -0.9180706739 0.0783028528 -0.1256816983
  7.7378106117 -0.1411835104 2.6340715885 -0.4807929695 -0.6554533243 -0.4374630153
  -0.0000002086 6.3036565781 -0.0000001788 -0.1146118194 -0.4658766091 -0.8773430586
  0.0000005960 7.2933077812 0.0000009537 -0.9223436117 -0.0671990141 0.0890576839
  -7.0111355782 1.1081298590 3.4398794174 -0.6530466676 0.5342937708 0.3029198050
  0.0000005439 5.9885435104 0.0000001788 0.0301653873 -0.6073726416 -0.7938429713
  -0.0000002235 6.1728191376 0.0000001788 -0.8835097551 0.0734047070 0.0251944251
  7.0427536964 1.1081298590 3.4398779869 -0.6659289598 -0.5139645934 -0.2734394670
  0.0000001192 5.9885439873 -0.0000005364 -0.1039575413 -0.6073622704 -0.7875848413
  -0.0000002384 6.1728181839 0.0000001267 -0.8831923604 -0.0869871154 0.0345822871
}

frame 13 {
  0.0000000000 0.0000000000 0.0000000000 -0.7071068287 -0.0000000000 -0.0000000000
  -3.2513213158 15.4400882721 0.0158092082 -0.5272982717 -0.4711226225 0.5272983909
  0.0158069823 0.7253780365 -4.2293043137 0.6815123558 0.1885223985 -0.6815127730
  -0.0000008640 1.0023921728 -2.2860672474 -0.0000003339 -0.0596550032 -0.9982191324
  -0.0000000012 5.2951149940 -0.0000045677 0.0778601840 -0.0000000155 -0.0000000492
  0.0000000001 5.5872902870 -0.0000017952 0.0159766022 -0.0008258488 -0.0016855430
  -0.0000000015 5.4236168861 -0.0000021280 0.0150004821 0.0000001293 0.0000066850
  0.0158079248 2.6921291351 -2.7244746685 0.6528964043 0.2715259194 -0.6528964043
  0.0000000027 5.6075992584 -0.0000002943 0.0158954747 -0.0000021630 -0.0000141583
  0.0159386676 3.2198212147 -1.4872405529 0.5966547728 0.3794800043 -0.5966378450
  0.0000000010 4.9625768661 -0.0000009583 0.0083864685 0.0000019849 0.0000075444
  0.0159972087 -0.3164632618 2.4960219860 -0.2637130916 0.0000004443 -0.0000067779
  0.0000000000 3.9519095421 -0.0000009533 0.2018981427 -0.0000002080 -0.0000143481
  0.0000000000 3.2605526447 -0.0000004769 -0.0183055531 -0.0000037004 0.0000208770
  -5.7047100067 2.7340435982 -2.3252050877 0.6987986565 -0.7152212262 0.0022497054
  -4.9808626175 4.7615971565 -1.6856472492 -0.5616763830 0.8254737854 -0.0105947414
  -4.1405067444 6.8342132568 -0.9228306413 0.5536530614 -0.8290354013 -0.0782901943
  5.7367134094 2.7340431213 -2.3251938820 -0.4867382050 -0.5081037879 0.5014085174
  5.0128650665 4.7615971565 -1.6856369972 0.5539450049 0.8213631511 0.0934749097
  4.1725082397 6.8342132568 -0.9228222370 -0.5568270683 -0.8277298808 -0.0510361977
  -8.6595191956 -0.8033444285 2.2397110462 -0.2822705507 0.7745705843 0.5304235220
  0.0000004470 7.2231268883 -0.0000002384 0.0916237906 -0.4706631899 -0.8760387301
  0.0000015497 11.4308462143 0.0000000000 -0.9676402807 0.0206069965 0.0418351628
  8.6910629272 -0.8040108681 2.2397763729 -0.2804771364 -0.7752414942 -0.5313691497
  0.0000007898 7.2231283188 -0.0000007153 -0.1681719124 -0.4734246433 -0.8646059036
  -0.0000013560 11.4308471680 -0.0000009537 -0.9682651758 -0.0490110293 0.0232186094
  -7.7061953545 -0.1411824077 2.6340737343 -0.4925542176 0.6533375382 0.4096156955
  0.0000001788 6.3036561012 -0.0000007153 0.1949051023 -0.4822935164 -0.8539186716
  -0.0000002980 7.2933101654 -0.0000007153 -0.9131077528 0.0482139401 -0.1491412967
  7.7378115654 -0.1411835104 2.6340730190 -0.4720296860 -0.6722045541 -0.4331014156
  -0.0000004843 6.3036556244 0.0000001788 -0.1229092851 -0.4824591279 -0.8672108054
  0.0000000894 7.2933092117 0.0000002384 -0.9183174968 -0.0368629023 0.1126958057
  -7.0111351013 1.1081298590 3.4398791790 -0.6317208409 0.5474446416 0.3190482855
  0.0000002831 5.9885430336 0.0000004768 0.0434567817 -0.6004168391 -0.7983419299
  0.0000003874 6.1728181839 0.0000005364 -0.8827260733 0.0422580354 -0.0075326874
  7.0427541733 1.1081297398 3.4398777485 -0.6453448534 -0.5269444585 -0.2905047536
  -0.0000002980 5.9885430336 0.0000005960 0.1176127121 0.6004701257 0.7908295393
  0.0000000298 6.1728177071 -0.0000004799 -0.8801982403 -0.0560307093 0.0671810731
}

frame 14 {
  0.0000000000 0.0000000000 0.0000000000 -0.7071068287 -0.0000000000 -0.0000000000
  -3.5980405807 15.5499277115 0.0158092305 -0.5307924151 -0.4671823680 0.5307925344
  0.0158069804 0.7253780365 -4.2293043137 0.6815123558 0.1885223836 -0.6815126538
  -0.0000008597 1.0023925304 -2.2860660553 -0.0000003339 -0.0596579239 -0.9982189536
  0.0000000024 5.2951159477 -0.0000043293 0.0778642967 -0.0000000155 -0.0000000495
  -0.0000000002 5.5872898102 -0.0000002455 0.0159754213 -0.0008258520 -0.0016855149
  0.0000000001 5.4236168861 -0.0000005782 0.0149998115 0.0000001294 0.0000066856
  0.0158079248 2.6921286583 -2.7244753838 0.6528963447 0.2715259492 -0.6528964043
  0.0000000015 5.6076002121 0.0000042953 0.0158971567 -0.0000021630 -0.0000141601
  0.0159386676 3.2198216915 -1.4872401953 0.5966547728 0.3794800043 -0.5966378450
  -0.0000000003 4.9625763893 -0.0000005411 0.0041641016 0.0000020160 0.0000075361
  0.0159972068 -0.3164603710 2.4960217476 -0.2165359408 0.0000014941 -0.0000094757
  0.0000000000 3.9519114494 0.0000000001 0.1163785681 -0.0000002057 -0.0000077845
  -0.0000000000 3.2605547905 0.0000004768 0.0481366217 -0.0000031593 0.0000171353
  -5.7047100067 2.7340438366 -2.3252041340 0.6987985969 -0.7152212858 0.0022497061
  -4.9808626175 4.7616004944 -1.6856456995 -0.5616764426 0.8254736066 -0.0105944686
  -4.1405067444 6.8342156410 -0.9228303432 0.5536530614 -0.8290354013 -0.0782901943
  5.7367134094 2.7340435982 -2.3251929283 -0.4867382050 -0.5081037879 0.5014085174
  5.0128650665 4.7615985870 -1.6856353283 0.5539450049 0.8213631511 0.0934749097
  4.1725082397 6.8342137337 -0.9228217602 -0.5568271875 -0.8277298808 -0.0510365181
  -8.6595191956 -0.8033435345 2.2397117615 -0.2801243067 0.7926688194 0.5070869327
  0.0000007898 7.2231287956 0.0000015497 0.0924395993 -0.4950260520 -0.8619781137
  -0.0000011921 11.4308452606 -0.0000014305 -0.9659052491 0.0090725943 0.0382742956
  8.6910629272 -0.8040102720 2.2397766113 -0.2784101665 -0.7933136225 -0.5080253482
  0.0000004768 7.2231292725 0.0000008345 0.1677532941 0.4983402789 0.8505232334
  0.0000002980 11.4308471680 0.0000002384 -0.9662944078 -0.0384625494 0.0266543012
  -7.7061948776 -0.1411823183 2.6340742111 -0.4865702987 0.6666802764 0.4047298431
  0.0000001043 6.3036537170 0.0000021756 0.1997349560 -0.4955627620 -0.8448380232
  -0.0000000596 7.2933092117 -0.0000007153 -0.9089519382 0.0269660447 -0.1651135534
  7.7378120422 -0.1411834806 2.6340737343 -0.4662908018 -0.6850571632 -0.4279292226
  0.0000000261 6.3036556244 -0.0000002384 0.1284845471 0.4959025085 0.8585640788
  0.0000005402 7.2933092117 -0.0000011921 -0.9148005247 -0.0154597666 0.1288205981
  -7.0111355782 1.1081303358 3.4398803711 -0.6174741983 0.5577322841 0.3287422061
  -0.0000001490 5.9885454178 0.0000011027 0.0530019440 -0.5979180336 -0.7992848754
  -0.0000003576 6.1728191376 0.0000014305 -0.8810599446 0.0198856574 -0.0313299969
  7.0427536964 1.1081299782 3.4398772717 -0.6315456629 -0.5372145176 -0.3008253276
  -0.0000000652 5.9885406494 -0.0000008941 0.1272029430 0.5980222225 0.7908781767
  0.0000000224 6.1728162766 -0.0000000671 -0.8769273758 -0.0337746963 0.0908115357
}

frame 15 {
  0.0000000000 0.0000000000 0.0000000000 -0.7071068287 -0.0000000000 -0.0000000000
  -3.7220883369 15.5883541107 0.0158092398 -0.5319860578 -0.4658227265 0.5319861770
  0.0158069842 0.7253782749 -4.2293028831 0.6815123558 0.1885224134 -0.6815127134
  -0.0000008603 1.0023915768 -2.2860708237 -0.0000003338 -0.0596585274 -0.9982188344
  -0.0000000027 5.2951145172 -0.0000011032 0.0778654814 -0.0000000154 -0.0000000497
  0.0000000002 5.5872898102 -0.0000009607 0.0159747768 -0.0008258520 -0.0016855121
  -0.0000000052 5.4236154556 -0.0000020534 0.0150034018 0.0000001293 0.0000066826
  0.0158079229 2.6921284199 -2.7244746685 0.6528963447 0.2715259194 -0.6528964043
  -0.0000000064 5.6076006889 -0.0000016652 0.0158903413 -0.0000021630 -0.0000141528
  0.0159386657 3.2198209763 -1.4872392416 0.5966547132 0.3794800341 -0.5966378450
  -0.0000000015 4.9625778198 0.0000010682 0.0027169911 0.0000020267 0.0000075284
  0.0159972124 -0.3164621592 2.4960203171 -0.1893840730 0.0000019685 -0.0000106782
  -0.0000000000 3.9519109726 -0.0000014305 0.0623724163 -0.0000001926 -0.0000048641
  -0.0000000000 3.2605538368 0.0000009537 0.0842970759 -0.0000026810 0.0000155390
  -5.7047100067 2.7340440750 -2.3252041340 0.6987988353 -0.7152211070 0.0022484192
  -4.9808626175 4.7615981102 -1.6856471300 -0.5616763830 0.8254738450 -0.0105947424
  -4.1405067444 6.8342142105 -0.9228308201 0.5536530614 -0.8290354013 -0.0782901943
  5.7367134094 2.7340426445 -2.3251926899 -0.4867382050 -0.5081037879 0.5014085174
  5.0128650665 4.7615966797 -1.6856366396 0.5539450645 0.8213630915 0.0934750661
  4.1725082397 6.8342142105 -0.9228214025 -0.5568270087 -0.8277298808 -0.0510365143
  -8.6595191956 -0.8033433557 2.2397112846 -0.2792904675 0.7988030910 0.4988388717
  0.0000001788 7.2231249809 0.0000023842 0.0926805735 -0.5036421418 -0.8567790389
  0.0000000000 11.4308471680 0.0000000000 -0.9652011395 0.0051258146 0.0370716937
  8.6910629272 -0.8040107489 2.2397761345 -0.2776048183 -0.7994389534 -0.4997741580
  0.0000005662 7.2231273651 -0.0000007153 0.1675368696 0.5071409345 0.8453256488
  0.0000002235 11.4308509827 0.0000011921 -0.9655108452 -0.0348787904 0.0278065130
  -7.7061953545 -0.1411824673 2.6340739727 -0.4845002294 0.6715567708 0.4026118219
  0.0000002459 6.3036551476 -0.0000003278 0.2013410777 -0.5005783439 -0.8413352370
  -0.0000001788 7.2933096886 -0.0000009537 -0.9073534012 0.0195288900 -0.1706045121
  7.7378115654 -0.1411833614 2.6340742111 -0.4643264115 -0.6897536516 -0.4257127941
  -0.0000003318 6.3036527634 0.0000033379 0.1303754002 0.5009822249 0.8552056551
  0.0000001118 7.2933073044 0.0000000000 -0.9134216309 -0.0079711936 0.1343708336
  -7.0111355782 1.1081298590 3.4398789406 -0.6126218438 0.5615829825 0.3317724466
  0.0000000298 5.9885406494 0.0000012219 0.0563728772 -0.5975186825 -0.7991781235
  -0.0000002682 6.1728153229 0.0000008047 -0.8802542686 0.0119906925 -0.0398213752
  7.0427536964 1.1081295013 3.4398777485 -0.6268336773 -0.5410785675 -0.3040691614
  -0.0000001944 5.9885430336 -0.0000028610 0.1305489093 0.5976414680 0.7904572487
  -0.0000002843 6.1728172302 -0.0000000075 -0.8755494356 -0.0259165373 0.0992289707
}

