# 3ds Max Wavefront OBJ Exporter v0.97b - (c)2007 guruware
# File Created: 26.06.2014 16:23:22

mtllib Screen.mtl

#
# object Screen
#

v  9.3599 -148.6102 -351.0121
v  20.5606 -10.0450 -370.1590
v  253.0019 -10.0443 -234.6761
v  241.8012 -148.6097 -215.5292
v  238.9121 -155.4224 -215.9508
v  231.7132 -157.6933 -219.7260
v  244.3824 -0.9608 -241.3832
v  251.2142 -3.2317 -236.9804
v  30.6487 -0.9615 -365.9621
v  23.4498 -3.2323 -369.7373
v  17.9795 -157.6936 -344.3049
v  11.1476 -155.4228 -348.7078
v  -416.5537 -148.6103 160.2869
v  -438.7358 -10.0451 160.1602
v  -437.6248 -10.0445 -108.8812
v  -415.4426 -148.6099 -108.7545
v  -414.3632 -155.4225 -106.0416
v  -414.0332 -157.6934 -97.9195
v  -439.1235 -0.9610 -98.0629
v  -438.7265 -3.2319 -106.1808
v  -440.1452 -0.9616 149.3252
v  -439.8152 -3.2324 157.4473
v  -415.0549 -157.6937 149.4687
v  -415.4520 -155.4229 157.5866
v  239.2002 -148.6107 273.4915
v  250.1813 -10.0458 292.7652
v  16.6288 -10.0457 426.3237
v  5.6477 -148.6108 407.0500
v  7.4574 -155.4234 404.7588
v  14.3263 -157.6943 400.4119
v  26.7471 -0.9622 422.2126
v  19.5183 -3.2331 425.9277
v  241.5026 -0.9623 299.4033
v  248.3715 -3.2331 295.0565
v  229.0818 -157.6942 277.6027
v  236.3107 -155.4233 273.8876
# 36 vertices

vn 0.4972 -0.1581 -0.8531
vn -0.9874 -0.1581 -0.0041
vn 0.4902 -0.1581 0.8572
# 3 vertex normals

vt 0.9326 0.0395 0.0000
vt 0.9325 0.2939 0.0000
vt 0.0797 0.2939 0.0000
vt 0.0798 0.0395 0.0000
vt 0.0884 0.0270 0.0000
vt 0.1142 0.0228 0.0000
vt 0.1140 0.3106 0.0000
vt 0.0883 0.3064 0.0000
vt 0.8982 0.3106 0.0000
vt 0.9239 0.3064 0.0000
vt 0.8983 0.0228 0.0000
vt 0.9240 0.0270 0.0000
vt 0.9326 0.3729 0.0000
vt 0.9325 0.6273 0.0000
vt 0.0797 0.6273 0.0000
vt 0.0798 0.3729 0.0000
vt 0.0884 0.3604 0.0000
vt 0.1142 0.3563 0.0000
vt 0.1140 0.6440 0.0000
vt 0.0883 0.6398 0.0000
vt 0.8982 0.6440 0.0000
vt 0.9239 0.6398 0.0000
vt 0.8983 0.3563 0.0000
vt 0.9240 0.3604 0.0000
vt 0.9326 0.7017 0.0000
vt 0.9325 0.9561 0.0000
vt 0.0797 0.9561 0.0000
vt 0.0798 0.7017 0.0000
vt 0.0884 0.6892 0.0000
vt 0.1142 0.6850 0.0000
vt 0.1140 0.9728 0.0000
vt 0.0883 0.9686 0.0000
vt 0.8982 0.9728 0.0000
vt 0.9239 0.9686 0.0000
vt 0.8983 0.6850 0.0000
vt 0.9240 0.6892 0.0000
# 36 texture coords

g Screen
usemtl Material__25
s 1
f 1/1/1 2/2/1 3/3/1 4/4/1 
f 4/4/1 5/5/1 6/6/1 
f 7/7/1 8/8/1 3/3/1 
f 3/3/1 2/2/1 9/9/1 7/7/1 
f 2/2/1 10/10/1 9/9/1 
f 11/11/1 12/12/1 1/1/1 
f 1/1/1 4/4/1 6/6/1 11/11/1 
f 13/13/2 14/14/2 15/15/2 16/16/2 
f 16/16/2 17/17/2 18/18/2 
f 19/19/2 20/20/2 15/15/2 
f 15/15/2 14/14/2 21/21/2 19/19/2 
f 14/14/2 22/22/2 21/21/2 
f 23/23/2 24/24/2 13/13/2 
f 13/13/2 16/16/2 18/18/2 23/23/2 
f 25/25/3 26/26/3 27/27/3 28/28/3 
f 28/28/3 29/29/3 30/30/3 
f 31/31/3 32/32/3 27/27/3 
f 27/27/3 26/26/3 33/33/3 31/31/3 
f 26/26/3 34/34/3 33/33/3 
f 35/35/3 36/36/3 25/25/3 
f 25/25/3 28/28/3 30/30/3 35/35/3 
# 9 polygons - 12 triangles

