MD5Version 10
commandline ""

numFrames 11
numJoints 46
frameRate 60
numAnimatedComponents 276

hierarchy {
	"origin"	-1 63 0	//
	"chest"	0 63 6	// origin
	"tail"	1 63 12	// chest
	"leg0_upper"	1 63 18	// chest
	"leg0_lower"	3 63 24	// leg0_upper
	"leg5_upper"	1 63 30	// chest
	"leg5_lower"	5 63 36	// leg5_upper
	"leg4_upper"	1 63 42	// chest
	"leg4_lower"	7 63 48	// leg4_upper
	"leg1_upper"	1 63 54	// chest
	"leg1_lower"	9 63 60	// leg1_upper
	"leg3_upper"	1 63 66	// chest
	"leg3_lower"	11 63 72	// leg3_upper
	"leg2_upper"	1 63 78	// chest
	"leg2_lower"	13 63 84	// leg2_upper
	"antenna_upper_left0"	1 63 90	// chest
	"antenna_upper_left1"	15 63 96	// antenna_upper_left0
	"antenna_upper_right0"	1 63 102	// chest
	"antenna_upper_right1"	17 63 108	// antenna_upper_right0
	"antenna_right0"	1 63 114	// chest
	"antenna_right1"	19 63 120	// antenna_right0
	"antenna_left0"	1 63 126	// chest
	"antenna_left1"	21 63 132	// antenna_left0
	"antenna_lower_left0"	1 63 138	// chest
	"antenna_lower_left1"	23 63 144	// antenna_lower_left0
	"antenna_lower_right0"	1 63 150	// chest
	"antenna_lower_right1"	25 63 156	// antenna_lower_right0
	"IKantenna_right"	1 63 162	// chest
	"IKantenna_left"	1 63 168	// chest
	"IKantenna_upper_left"	1 63 174	// chest
	"IKantenna_upper_right"	1 63 180	// chest
	"IKantenna_lower_left"	1 63 186	// chest
	"IKantenna_lower_right"	1 63 192	// chest
	"IKleg0"	0 63 198	// origin
	"IKleg0_upper"	0 63 204	// origin
	"IKleg1"	0 63 210	// origin
	"IKleg1_upper"	0 63 216	// origin
	"IKleg5"	0 63 222	// origin
	"IKleg5_upper"	0 63 228	// origin
	"IKleg4"	0 63 234	// origin
	"IKleg4_upper"	0 63 240	// origin
	"IKleg3"	0 63 246	// origin
	"IKleg3_upper"	0 63 252	// origin
	"IKleg2"	0 63 258	// origin
	"IKIKleg2_upper"	0 63 264	// origin
	"IKtail"	0 63 270	// origin
}

bounds {
	( 0.000000 0.000000 0.000000 ) ( 0.000000 0.000000 0.000000 )
	( 0.000000 0.000000 0.000000 ) ( 0.000000 0.000000 0.000000 )
	( 0.000000 0.000000 0.000000 ) ( 0.000000 0.000000 0.000000 )
	( 0.000000 0.000000 0.000000 ) ( 0.000000 0.000000 0.000000 )
	( 0.000000 0.000000 0.000000 ) ( 0.000000 0.000000 0.000000 )
	( 0.000000 0.000000 0.000000 ) ( 0.000000 0.000000 0.000000 )
	( 0.000000 0.000000 0.000000 ) ( 0.000000 0.000000 0.000000 )
	( 0.000000 0.000000 0.000000 ) ( 0.000000 0.000000 0.000000 )
	( 0.000000 0.000000 0.000000 ) ( 0.000000 0.000000 0.000000 )
	( 0.000000 0.000000 0.000000 ) ( 0.000000 0.000000 0.000000 )
	( 0.000000 0.000000 0.000000 ) ( 0.000000 0.000000 0.000000 )
}

baseframe {
	( 0.000000 0.000000 0.100000 ) ( -0.707107 0.000000 0.000000 )
	( 0.312367 -0.360185 -0.004892 ) ( 0.496413 -0.503564 0.496625 )
	( -0.000000 0.520055 0.000000 ) ( 0.178497 -0.000622 -0.003720 )
	( -0.136732 0.038257 0.004402 ) ( 0.153575 0.133789 0.670635 )
	( 0.000000 0.447469 -0.000000 ) ( -0.288828 -0.333030 0.842926 )
	( 0.151140 0.042027 0.014281 ) ( 0.141956 -0.126691 -0.677967 )
	( 0.000000 0.437616 0.000000 ) ( -0.289976 0.341958 -0.836672 )
	( 0.162623 0.221463 -0.011451 ) ( 0.114042 -0.041248 -0.407424 )
	( -0.000000 0.501200 -0.000000 ) ( -0.517678 -0.014907 0.052469 )
	( -0.162016 0.218096 -0.011498 ) ( 0.116163 0.038814 0.404078 )
	( 0.000000 0.492872 0.000000 ) ( -0.515808 0.011248 -0.048502 )
	( 0.142976 0.370391 -0.009384 ) ( -0.001600 0.000475 -0.113450 )
	( -0.000000 0.422763 -0.000000 ) ( -0.443406 0.047551 -0.096794 )
	( -0.137594 0.373323 -0.014729 ) ( 0.007466 -0.000681 0.115847 )
	( 0.000000 0.421663 -0.000000 ) ( -0.454584 -0.044624 0.091247 )
	( 0.035670 -0.040818 0.060014 ) ( -0.018182 0.047886 -0.998486 )
	( 0.000000 0.026025 0.000000 ) ( -0.002853 0.033945 -0.001202 )
	( -0.027674 -0.041720 0.059816 ) ( -0.052107 -0.046785 0.997231 )
	( 0.000000 0.025637 0.000000 ) ( -0.001972 -0.121503 0.002943 )
	( -0.050906 -0.034136 0.024111 ) ( -0.058393 -0.145779 0.987384 )
	( 0.000000 0.049218 -0.000000 ) ( -0.001273 -0.130147 0.004151 )
	( 0.059788 -0.034178 0.023788 ) ( -0.058968 0.144900 -0.987571 )
	( -0.000000 0.049218 -0.000000 ) ( -0.001261 0.129525 -0.004153 )
	( 0.032298 -0.054366 -0.002832 ) ( -0.005747 0.051282 0.998667 )
	( 0.000000 0.018246 -0.000000 ) ( -0.000223 -0.105798 -0.003347 )
	( -0.026453 -0.054341 -0.002832 ) ( -0.011413 -0.051461 -0.998493 )
	( 0.000000 0.018247 -0.000000 ) ( -0.000219 0.104659 0.003397 )
	( -0.053205 -0.156103 -0.013104 ) ( 0.083867 -0.236072 -0.951085 )
	( 0.060800 -0.156152 -0.013104 ) ( 0.083973 0.236037 0.951008 )
	( 0.038704 -0.122207 0.051886 ) ( -0.000097 -0.468376 0.883529 )
	( -0.031079 -0.122177 0.051886 ) ( -0.000097 -0.468376 0.883529 )
	( 0.031859 -0.116268 0.003550 ) ( 0.080502 0.440954 0.880320 )
	( -0.024230 -0.116244 0.003550 ) ( 0.080308 -0.440987 -0.880387 )
	( 0.474768 0.063777 -0.402949 ) ( 0.000374 0.707079 0.000000 )
	( 0.252528 -0.529487 -0.555359 ) ( -0.000000 -0.250468 0.968125 )
	( -0.581522 0.073430 -0.831409 ) ( 0.000374 0.707079 0.000000 )
	( -0.213911 -0.457952 -0.518543 ) ( 0.339129 -0.234470 0.906822 )
	( 0.474768 0.063777 0.400583 ) ( 0.000374 0.707079 0.000000 )
	( 0.252528 -0.529487 0.555269 ) ( 0.968125 -0.000000 0.000000 )
	( -0.581523 0.073430 0.829043 ) ( 0.000374 0.707107 0.000000 )
	( -0.223781 -0.456157 0.514222 ) ( 0.906822 -0.087686 0.339129 )
	( -0.740141 0.073430 0.364709 ) ( 0.000374 0.707079 0.000000 )
	( -0.450942 -0.330299 0.228546 ) ( 0.878231 -0.076169 0.447886 )
	( -0.740141 0.073430 -0.367076 ) ( 0.000374 0.707079 0.000000 )
	( -0.450942 -0.330299 -0.236787 ) ( -0.865705 0.166269 -0.471641 )
	( -0.768131 -0.554428 -0.001125 ) ( 0.576453 -0.409514 0.576453 )
}

frame 0 {
	0.000000 0.000000 0.100000 0.707107 -0.000000 -0.000000
	0.312367 -0.360185 -0.004892 -0.496413 0.503564 -0.496625
	-0.000000 0.520055 0.000000 -0.178497 0.000622 0.003720
	-0.136732 0.038257 0.004402 -0.153575 -0.133789 -0.670635
	0.000000 0.447469 -0.000000 0.288828 0.333030 -0.842926
	0.151140 0.042027 0.014281 -0.141956 0.126691 0.677967
	0.000000 0.437616 0.000000 0.289976 -0.341958 0.836672
	0.162623 0.221463 -0.011451 -0.114042 0.041248 0.407424
	-0.000000 0.501200 -0.000000 0.517678 0.014907 -0.052469
	-0.162016 0.218096 -0.011498 -0.116163 -0.038814 -0.404078
	0.000000 0.492872 0.000000 0.515808 -0.011248 0.048502
	0.142976 0.370391 -0.009384 0.001600 -0.000475 0.113450
	-0.000000 0.422763 -0.000000 0.443406 -0.047551 0.096794
	-0.137594 0.373323 -0.014729 -0.007466 0.000681 -0.115847
	0.000000 0.421663 -0.000000 0.454584 0.044624 -0.091247
	0.035670 -0.040818 0.060014 0.018182 -0.047886 0.998486
	0.000000 0.026025 0.000000 0.002853 -0.033945 0.001202
	-0.027674 -0.041720 0.059816 0.052107 0.046785 -0.997231
	0.000000 0.025637 0.000000 0.001972 0.121503 -0.002943
	-0.050906 -0.034136 0.024111 0.058393 0.145779 -0.987384
	0.000000 0.049218 -0.000000 0.001273 0.130147 -0.004151
	0.059788 -0.034178 0.023788 0.058968 -0.144900 0.987571
	-0.000000 0.049218 -0.000000 0.001261 -0.129525 0.004153
	0.032298 -0.054366 -0.002832 0.005747 -0.051282 -0.998667
	0.000000 0.018246 -0.000000 0.000223 0.105798 0.003347
	-0.026453 -0.054341 -0.002832 0.011413 0.051461 0.998493
	0.000000 0.018247 -0.000000 0.000219 -0.104659 -0.003397
	-0.053205 -0.156103 -0.013104 -0.083867 0.236072 0.951085
	0.060800 -0.156152 -0.013104 -0.083973 -0.236037 -0.951008
	0.038704 -0.122207 0.051886 -0.000097 -0.468376 0.883529
	-0.031079 -0.122177 0.051886 -0.000097 -0.468376 0.883529
	0.031859 -0.116268 0.003550 -0.080502 -0.440954 -0.880320
	-0.024230 -0.116244 0.003550 -0.080308 0.440987 0.880387
	0.474768 0.063777 -0.402949 -0.000374 -0.707079 -0.000000
	0.252528 -0.529487 -0.555359 0.000000 0.250468 -0.968125
	-0.581522 0.073430 -0.831409 -0.000374 -0.707079 -0.000000
	-0.213911 -0.457952 -0.518543 -0.339129 0.234470 -0.906822
	0.474768 0.063777 0.400583 -0.000374 -0.707079 -0.000000
	0.252528 -0.529487 0.555269 -0.968125 0.000000 -0.000000
	-0.581523 0.073430 0.829043 -0.000374 -0.707107 -0.000000
	-0.223781 -0.456157 0.514222 -0.906822 0.087686 -0.339129
	-0.740141 0.073430 0.364709 -0.000374 -0.707079 -0.000000
	-0.450942 -0.330299 0.228546 -0.878231 0.076169 -0.447886
	-0.740141 0.073430 -0.367076 -0.000374 -0.707079 -0.000000
	-0.450942 -0.330299 -0.236787 0.865705 -0.166269 0.471641
	-0.768131 -0.554428 -0.001125 -0.576453 0.409514 -0.576453
}

frame 1 {
	0.000000 0.000000 0.100000 0.707107 -0.000000 -0.000000
	0.294446 -0.283549 -0.004892 -0.500518 0.499484 -0.500728
	0.000000 0.520055 -0.000000 -0.227265 0.000792 0.003763
	-0.136732 0.038257 0.004402 -0.210967 -0.216741 -0.660617
	0.000000 0.447469 0.000000 0.284535 0.280982 -0.867993
	0.151140 0.042027 0.014281 -0.196030 0.209627 0.671871
	-0.000000 0.437615 0.000000 0.284295 -0.289571 0.862109
	0.162623 0.221463 -0.011451 -0.177540 0.069586 0.416694
	0.000000 0.501200 -0.000000 0.578382 0.015642 -0.056035
	-0.162016 0.218096 -0.011498 -0.178372 -0.065891 -0.411765
	-0.000000 0.492872 0.000000 0.572994 -0.011486 0.051947
	0.142976 0.370391 -0.009384 -0.087493 0.007905 0.113828
	0.000000 0.422763 -0.000000 0.539072 -0.045456 0.115342
	-0.137594 0.373323 -0.014729 -0.104215 -0.010237 -0.116803
	-0.000000 0.421663 0.000000 0.565979 0.041638 -0.112470
	0.035670 -0.040818 0.060014 0.018181 -0.047887 0.998486
	-0.000000 0.026025 0.000000 0.002853 -0.033945 0.001202
	-0.027674 -0.041720 0.059816 0.052105 0.046784 -0.997231
	0.000000 0.025637 0.000000 0.001972 0.121503 -0.002943
	-0.050906 -0.034136 0.024111 0.058392 0.145779 -0.987384
	0.000000 0.049218 -0.000000 0.001273 0.130147 -0.004151
	0.059788 -0.034178 0.023788 0.058968 -0.144900 0.987571
	-0.000000 0.049218 -0.000000 0.001262 -0.129525 0.004153
	0.032298 -0.054366 -0.002832 0.005741 -0.051283 -0.998667
	-0.000000 0.018246 0.000000 0.000223 0.105798 0.003347
	-0.026453 -0.054341 -0.002832 0.011411 0.051462 0.998493
	0.000000 0.018247 -0.000000 0.000219 -0.104659 -0.003397
	-0.053205 -0.156103 -0.013104 -0.083867 0.236072 0.951085
	0.060800 -0.156152 -0.013104 -0.083973 -0.236037 -0.951008
	0.038704 -0.122207 0.051886 -0.000097 -0.468376 0.883529
	-0.031079 -0.122177 0.051886 -0.000097 -0.468376 0.883529
	0.031859 -0.116268 0.003550 -0.080502 -0.440954 -0.880320
	-0.024230 -0.116244 0.003550 -0.080308 0.440987 0.880387
	0.486871 0.061329 -0.402948 -0.000374 -0.707079 -0.000000
	0.252528 -0.529487 -0.555359 0.000000 0.250468 -0.968125
	-0.576959 0.070986 -0.831409 -0.000374 -0.707079 -0.000000
	-0.213911 -0.457952 -0.518543 -0.339129 0.234470 -0.906822
	0.493774 0.061326 0.400584 -0.000374 -0.707079 -0.000000
	0.252528 -0.529487 0.555269 -0.968125 0.000000 -0.000000
	-0.571130 0.070983 0.829043 -0.000374 -0.707107 -0.000000
	-0.223781 -0.456157 0.514222 -0.906822 0.087686 -0.339129
	-0.736979 0.070987 0.364709 -0.000374 -0.707079 -0.000000
	-0.450942 -0.330299 0.228546 -0.878231 0.076169 -0.447886
	-0.723199 0.070979 -0.367074 -0.000374 -0.707079 -0.000000
	-0.450942 -0.330299 -0.236787 0.865705 -0.166269 0.471641
	-0.768131 -0.554428 -0.001125 -0.576453 0.409514 -0.576453
}

frame 2 {
	0.000000 0.000000 0.100000 0.707107 -0.000000 -0.000000
	0.276525 -0.207120 -0.004892 -0.504590 0.495370 -0.504798
	-0.000000 0.520055 -0.000000 -0.272788 0.000953 0.003784
	-0.136732 0.038257 0.004402 -0.270842 -0.310571 -0.630146
	0.000000 0.447469 -0.000000 0.278922 0.231453 -0.887709
	0.151140 0.042027 0.014281 -0.253956 0.302779 0.646025
	-0.000000 0.437616 0.000000 0.277678 -0.239862 0.882096
	0.162623 0.221463 -0.011451 -0.236833 0.095738 0.421260
	0.000000 0.501200 0.000000 0.622825 0.016166 -0.058373
	-0.162016 0.218096 -0.011498 -0.237650 -0.091741 -0.415663
	-0.000000 0.492872 -0.000000 0.616944 -0.011858 0.054316
	0.142976 0.370391 -0.009384 -0.172184 0.016686 0.115161
	0.000000 0.422763 0.000000 0.610677 -0.043154 0.129333
	-0.137594 0.373323 -0.014729 -0.190777 -0.020470 -0.118731
	-0.000000 0.421663 0.000000 0.638874 0.039004 -0.126277
	0.035670 -0.040818 0.060014 0.018182 -0.047886 0.998486
	-0.000000 0.026025 -0.000000 0.002853 -0.033945 0.001202
	-0.027674 -0.041720 0.059816 0.052106 0.046785 -0.997231
	0.000000 0.025637 0.000000 0.001972 0.121503 -0.002943
	-0.050906 -0.034136 0.024111 0.058395 0.145779 -0.987384
	0.000000 0.049217 0.000000 0.001273 0.130147 -0.004151
	0.059788 -0.034178 0.023788 0.058969 -0.144900 0.987571
	-0.000000 0.049218 -0.000000 0.001261 -0.129525 0.004153
	0.032298 -0.054366 -0.002832 0.005732 -0.051283 -0.998667
	0.000000 0.018247 -0.000000 0.000223 0.105798 0.003347
	-0.026453 -0.054341 -0.002832 0.011410 0.051461 0.998493
	-0.000000 0.018246 0.000000 0.000219 -0.104659 -0.003397
	-0.053205 -0.156103 -0.013104 -0.083867 0.236072 0.951085
	0.060800 -0.156152 -0.013104 -0.083973 -0.236037 -0.951008
	0.038704 -0.122207 0.051886 -0.000097 -0.468377 0.883529
	-0.031079 -0.122177 0.051886 -0.000097 -0.468376 0.883529
	0.031859 -0.116268 0.003549 -0.080502 -0.440954 -0.880320
	-0.024230 -0.116244 0.003550 -0.080308 0.440987 0.880387
	0.497342 0.053977 -0.402948 -0.000374 -0.707079 -0.000000
	0.252528 -0.529487 -0.555359 0.000000 0.250468 -0.968125
	-0.575539 0.063638 -0.831409 -0.000374 -0.707079 -0.000000
	-0.213911 -0.457952 -0.518543 -0.339129 0.234470 -0.906822
	0.508927 0.053971 0.400586 -0.000374 -0.707079 -0.000000
	0.252528 -0.529487 0.555269 -0.968125 0.000000 -0.000000
	-0.567444 0.063634 0.829043 -0.000374 -0.707107 -0.000000
	-0.223781 -0.456157 0.514222 -0.906822 0.087686 -0.339129
	-0.734841 0.063639 0.364709 -0.000374 -0.707079 -0.000000
	-0.450942 -0.330299 0.228546 -0.878231 0.076169 -0.447886
	-0.716355 0.063629 -0.367074 -0.000374 -0.707079 -0.000000
	-0.450942 -0.330299 -0.236787 0.865705 -0.166269 0.471641
	-0.768131 -0.554428 -0.001125 -0.576453 0.409514 -0.576453
}

frame 3 {
	0.000000 0.000000 0.100000 0.707107 -0.000000 -0.000000
	0.276525 -0.221817 -0.004892 -0.504590 0.495370 -0.504798
	-0.000000 0.520055 -0.000000 -0.263112 0.000915 0.003798
	-0.136732 0.038257 0.004402 -0.261823 -0.304664 -0.634524
	-0.000000 0.447469 0.000000 0.276781 0.234223 -0.885612
	0.151140 0.042027 0.014281 -0.243728 0.296273 0.651154
	0.000000 0.437615 -0.000000 0.274911 -0.243153 0.879418
	0.162623 0.221463 -0.011451 -0.235182 0.094811 0.422179
	-0.000000 0.501200 -0.000000 0.622204 0.015876 -0.058817
	-0.162016 0.218096 -0.011498 -0.235885 -0.090666 -0.416559
	-0.000000 0.492872 -0.000000 0.616089 -0.011552 0.054799
	0.142976 0.370391 -0.009384 -0.169783 0.017439 0.114095
	0.000000 0.422763 -0.000000 0.610388 -0.042817 0.130073
	-0.137594 0.373323 -0.014729 -0.188363 -0.021131 -0.117729
	-0.000000 0.421663 0.000000 0.638634 0.038697 -0.126995
	0.035670 -0.040818 0.060014 0.018183 -0.047886 0.998486
	0.000000 0.026025 0.000000 0.002853 -0.033945 0.001202
	-0.027674 -0.041720 0.059816 0.052106 0.046785 -0.997231
	-0.000000 0.025637 0.000000 0.001972 0.121503 -0.002943
	-0.050906 -0.034136 0.024111 0.058395 0.145779 -0.987384
	0.000000 0.049218 0.000000 0.001273 0.130147 -0.004151
	0.059788 -0.034178 0.023788 0.058969 -0.144900 0.987571
	-0.000000 0.049218 -0.000000 0.001261 -0.129525 0.004153
	0.032298 -0.054366 -0.002832 0.005729 -0.051283 -0.998667
	0.000000 0.018247 -0.000000 0.000223 0.105798 0.003347
	-0.026453 -0.054341 -0.002832 0.011410 0.051461 0.998493
	-0.000000 0.018246 -0.000000 0.000219 -0.104659 -0.003397
	-0.053205 -0.156103 -0.013104 -0.083867 0.236072 0.951085
	0.060800 -0.156152 -0.013104 -0.083973 -0.236037 -0.951008
	0.038704 -0.122207 0.051886 -0.000097 -0.468377 0.883529
	-0.031079 -0.122177 0.051886 -0.000097 -0.468376 0.883529
	0.031859 -0.116268 0.003549 -0.080502 -0.440954 -0.880320
	-0.024230 -0.116244 0.003550 -0.080308 0.440987 0.880387
	0.505681 0.042027 -0.402947 -0.000374 -0.707079 -0.000000
	0.252528 -0.529487 -0.555359 0.000000 0.250468 -0.968125
	-0.575491 0.051693 -0.831409 -0.000374 -0.707079 -0.000000
	-0.213911 -0.457952 -0.518543 -0.339129 0.234470 -0.906822
	0.519147 0.042020 0.400586 -0.000374 -0.707079 -0.000000
	0.252528 -0.529487 0.555269 -0.968125 0.000000 -0.000000
	-0.567089 0.051689 0.829043 -0.000374 -0.707107 -0.000000
	-0.223781 -0.456157 0.514222 -0.906822 0.087686 -0.339129
	-0.733785 0.051693 0.364710 -0.000374 -0.707079 -0.000000
	-0.450942 -0.330299 0.228546 -0.878231 0.076169 -0.447886
	-0.715262 0.051683 -0.367074 -0.000374 -0.707079 -0.000000
	-0.450942 -0.330299 -0.236787 0.865705 -0.166269 0.471641
	-0.768131 -0.554428 -0.001125 -0.576453 0.409514 -0.576453
}

frame 4 {
	0.000000 0.000000 0.100000 0.707107 -0.000000 -0.000000
	0.276525 -0.265670 -0.004892 -0.504590 0.495370 -0.504798
	-0.000000 0.520055 -0.000000 -0.232635 0.000798 0.003839
	-0.136732 0.038257 0.004402 -0.231990 -0.270740 -0.651629
	0.000000 0.447469 -0.000000 0.274744 0.251556 -0.877217
	0.151140 0.042027 0.014281 -0.214232 0.262516 0.666458
	-0.000000 0.437615 -0.000000 0.273030 -0.260890 0.870650
	0.162623 0.221463 -0.011451 -0.215727 0.085468 0.425450
	0.000000 0.501200 0.000000 0.612073 0.015137 -0.059377
	-0.162016 0.218096 -0.011498 -0.216630 -0.081356 -0.420136
	-0.000000 0.492872 -0.000000 0.606321 -0.010875 0.055342
	0.142976 0.370391 -0.009384 -0.140955 0.015856 0.112913
	0.000000 0.422763 0.000000 0.595283 -0.042811 0.128388
	-0.137594 0.373323 -0.014729 -0.158217 -0.018782 -0.116655
	0.000000 0.421663 0.000000 0.621884 0.038942 -0.124820
	0.035670 -0.040818 0.060014 0.018182 -0.047886 0.998486
	-0.000000 0.026025 -0.000000 0.002853 -0.033945 0.001202
	-0.027674 -0.041720 0.059816 0.052106 0.046785 -0.997231
	0.000000 0.025637 -0.000000 0.001972 0.121503 -0.002943
	-0.050906 -0.034136 0.024111 0.058393 0.145779 -0.987384
	0.000000 0.049218 0.000000 0.001273 0.130147 -0.004151
	0.059788 -0.034178 0.023788 0.058969 -0.144900 0.987571
	-0.000000 0.049218 -0.000000 0.001262 -0.129525 0.004153
	0.032298 -0.054366 -0.002832 0.005720 -0.051283 -0.998667
	0.000000 0.018246 -0.000000 0.000223 0.105798 0.003347
	-0.026453 -0.054341 -0.002832 0.011409 0.051461 0.998493
	0.000000 0.018246 0.000000 0.000219 -0.104659 -0.003397
	-0.053205 -0.156103 -0.013104 -0.083867 0.236072 0.951085
	0.060800 -0.156152 -0.013104 -0.083973 -0.236037 -0.951008
	0.038704 -0.122207 0.051886 -0.000097 -0.468377 0.883529
	-0.031079 -0.122177 0.051886 -0.000097 -0.468376 0.883529
	0.031859 -0.116268 0.003549 -0.080502 -0.440954 -0.880320
	-0.024230 -0.116244 0.003550 -0.080308 0.440987 0.880387
	0.511152 0.026401 -0.402946 -0.000374 -0.707079 -0.000000
	0.252528 -0.529487 -0.555359 0.000000 0.250468 -0.968125
	-0.576157 0.036070 -0.831409 -0.000374 -0.707079 -0.000000
	-0.213911 -0.457952 -0.518543 -0.339129 0.234470 -0.906822
	0.523169 0.026395 0.400587 -0.000374 -0.707079 -0.000000
	0.252528 -0.529487 0.555269 -0.968125 0.000000 -0.000000
	-0.568565 0.036067 0.829043 -0.000374 -0.707107 -0.000000
	-0.223781 -0.456157 0.514222 -0.906822 0.087686 -0.339129
	-0.733772 0.036070 0.364710 -0.000374 -0.707079 -0.000000
	-0.450942 -0.330299 0.228546 -0.878231 0.076169 -0.447886
	-0.717551 0.036061 -0.367074 -0.000374 -0.707079 -0.000000
	-0.450942 -0.330299 -0.236787 0.865705 -0.166269 0.471641
	-0.768131 -0.554428 -0.001125 -0.576453 0.409514 -0.576453
}

frame 5 {
	0.000000 0.000000 0.100000 0.707107 -0.000000 -0.000000
	0.276526 -0.334692 -0.004892 -0.504590 0.495370 -0.504798
	-0.000000 0.520055 0.000000 -0.179790 0.000596 0.003890
	-0.136732 0.038257 0.004402 -0.183938 -0.213955 -0.673143
	-0.000000 0.447469 0.000000 0.272667 0.283070 -0.861442
	0.151140 0.042027 0.014281 -0.168309 0.206364 0.684303
	-0.000000 0.437615 -0.000000 0.271888 -0.292631 0.854764
	0.162623 0.221463 -0.011451 -0.179045 0.068099 0.430502
	0.000000 0.501200 0.000000 0.591014 0.013989 -0.059831
	-0.162016 0.218096 -0.011498 -0.180200 -0.064078 -0.425713
	0.000000 0.492872 -0.000000 0.585862 -0.009830 0.055790
	0.142976 0.370391 -0.009384 -0.086342 0.011918 0.111492
	-0.000000 0.422763 0.000000 0.561765 -0.043024 0.123870
	-0.137594 0.373323 -0.014729 -0.101933 -0.013703 -0.115308
	0.000000 0.421663 -0.000000 0.586330 0.039474 -0.119891
	0.035670 -0.040818 0.060015 0.018182 -0.047886 0.998486
	-0.000000 0.026025 -0.000000 0.002853 -0.033945 0.001202
	-0.027674 -0.041720 0.059816 0.052106 0.046785 -0.997231
	-0.000000 0.025637 0.000000 0.001972 0.121503 -0.002943
	-0.050906 -0.034136 0.024111 0.058395 0.145779 -0.987384
	-0.000000 0.049218 -0.000000 0.001273 0.130147 -0.004151
	0.059788 -0.034178 0.023788 0.058969 -0.144900 0.987571
	0.000000 0.049218 -0.000000 0.001261 -0.129525 0.004153
	0.032298 -0.054366 -0.002832 0.005720 -0.051283 -0.998667
	0.000000 0.018247 -0.000000 0.000223 0.105798 0.003347
	-0.026453 -0.054341 -0.002832 0.011409 0.051461 0.998493
	-0.000000 0.018246 -0.000000 0.000219 -0.104659 -0.003397
	-0.053205 -0.156103 -0.013103 -0.083867 0.236072 0.951085
	0.060800 -0.156152 -0.013104 -0.083973 -0.236037 -0.951008
	0.038704 -0.122207 0.051886 -0.000097 -0.468377 0.883529
	-0.031079 -0.122177 0.051886 -0.000097 -0.468376 0.883529
	0.031859 -0.116268 0.003550 -0.080502 -0.440954 -0.880320
	-0.024230 -0.116244 0.003550 -0.080308 0.440987 0.880387
	0.512666 0.008702 -0.402946 -0.000374 -0.707079 -0.000000
	0.252528 -0.529487 -0.555359 0.000000 0.250468 -0.968125
	-0.577192 0.018373 -0.831409 -0.000374 -0.707079 -0.000000
	-0.213911 -0.457952 -0.518543 -0.339129 0.234470 -0.906822
	0.520001 0.008699 0.400587 -0.000374 -0.707079 -0.000000
	0.252528 -0.529487 0.555269 -0.968125 0.000000 -0.000000
	-0.571017 0.018370 0.829043 -0.000374 -0.707107 -0.000000
	-0.223781 -0.456157 0.514222 -0.906822 0.087686 -0.339129
	-0.734623 0.018372 0.364709 -0.000374 -0.707079 -0.000000
	-0.450942 -0.330299 0.228546 -0.878231 0.076169 -0.447886
	-0.721721 0.018365 -0.367074 -0.000374 -0.707079 -0.000000
	-0.450942 -0.330299 -0.236787 0.865705 -0.166269 0.471641
	-0.768131 -0.554428 -0.001125 -0.576453 0.409514 -0.576453
}

frame 6 {
	0.000000 0.000000 0.100000 0.707107 -0.000000 -0.000000
	0.276527 -0.418780 -0.004892 -0.504590 0.495370 -0.504798
	-0.000000 0.520055 0.000000 -0.108157 0.000318 0.003962
	-0.136732 0.038257 0.004402 -0.126635 -0.146150 -0.688956
	-0.000000 0.447469 -0.000000 0.270031 0.324526 -0.838197
	0.151140 0.042027 0.014281 -0.114024 0.138854 0.696519
	0.000000 0.437615 -0.000000 0.270369 -0.334279 0.831363
	0.162623 0.221463 -0.011451 -0.129076 0.044488 0.435863
	0.000000 0.501200 -0.000000 0.557999 0.012478 -0.059898
	-0.162016 0.218096 -0.011498 -0.130334 -0.040566 -0.431701
	0.000000 0.492872 -0.000000 0.553458 -0.008430 0.055914
	0.142976 0.370391 -0.009384 -0.011593 0.005852 0.110705
	0.000000 0.422763 -0.000000 0.506402 -0.043432 0.115376
	-0.137594 0.373323 -0.014729 -0.025873 -0.006344 -0.114499
	-0.000000 0.421663 -0.000000 0.529228 0.040189 -0.111410
	0.035670 -0.040818 0.060015 0.018182 -0.047887 0.998486
	-0.000000 0.026025 -0.000000 0.002853 -0.033945 0.001202
	-0.027674 -0.041719 0.059816 0.052106 0.046785 -0.997231
	0.000000 0.025637 0.000000 0.001972 0.121503 -0.002943
	-0.050906 -0.034136 0.024111 0.058394 0.145779 -0.987384
	0.000000 0.049218 0.000000 0.001273 0.130147 -0.004151
	0.059788 -0.034178 0.023788 0.058968 -0.144900 0.987571
	0.000000 0.049218 -0.000000 0.001262 -0.129525 0.004153
	0.032298 -0.054366 -0.002832 0.005730 -0.051283 -0.998667
	0.000000 0.018247 -0.000000 0.000223 0.105798 0.003347
	-0.026453 -0.054341 -0.002832 0.011409 0.051462 0.998493
	0.000000 0.018247 -0.000000 0.000219 -0.104659 -0.003397
	-0.053205 -0.156103 -0.013104 -0.083867 0.236072 0.951085
	0.060800 -0.156152 -0.013104 -0.083973 -0.236037 -0.951008
	0.038704 -0.122207 0.051886 -0.000097 -0.468377 0.883529
	-0.031079 -0.122177 0.051886 -0.000097 -0.468376 0.883529
	0.031859 -0.116268 0.003550 -0.080502 -0.440954 -0.880320
	-0.024230 -0.116244 0.003550 -0.080308 0.440987 0.880387
	0.508829 -0.008994 -0.402947 -0.000374 -0.707079 -0.000000
	0.252528 -0.529487 -0.555359 0.000000 0.250468 -0.968125
	-0.578374 0.000675 -0.831409 -0.000374 -0.707079 -0.000000
	-0.213911 -0.457952 -0.518543 -0.339129 0.234470 -0.906822
	0.510160 -0.008994 0.400586 -0.000374 -0.707079 -0.000000
	0.252528 -0.529487 0.555269 -0.968125 0.000000 -0.000000
	-0.573874 0.000673 0.829043 -0.000374 -0.707107 -0.000000
	-0.223781 -0.456157 0.514222 -0.906822 0.087686 -0.339129
	-0.736020 0.000675 0.364709 -0.000374 -0.707079 -0.000000
	-0.450942 -0.330299 0.228546 -0.878231 0.076169 -0.447886
	-0.726710 0.000670 -0.367075 -0.000374 -0.707079 -0.000000
	-0.450942 -0.330299 -0.236787 0.865705 -0.166269 0.471641
	-0.768131 -0.554428 -0.001125 -0.576453 0.409514 -0.576453
}

frame 7 {
	0.000000 0.000000 0.100000 0.707107 -0.000000 -0.000000
	0.276527 -0.502912 -0.004892 -0.504590 0.495370 -0.504798
	-0.000000 0.520055 0.000000 -0.030319 0.000020 0.004005
	-0.136732 0.038257 0.004402 -0.073093 -0.081606 -0.694772
	0.000000 0.447469 -0.000000 0.266502 0.367477 -0.810609
	0.151140 0.042027 0.014281 -0.062188 0.073887 0.700391
	-0.000000 0.437615 -0.000000 0.267036 -0.377710 0.802900
	0.162623 0.221463 -0.011451 -0.074176 0.018669 0.439322
	0.000000 0.501200 -0.000000 0.515700 0.010962 -0.058932
	-0.162016 0.218096 -0.011498 -0.075331 -0.014874 -0.435727
	-0.000000 0.492872 -0.000000 0.511674 -0.007024 0.055071
	0.142976 0.370391 -0.009384 0.071918 -0.001219 0.111929
	-0.000000 0.422763 0.000000 0.430695 -0.044021 0.101865
	-0.137594 0.373323 -0.014729 0.058504 0.002008 -0.115485
	0.000000 0.421663 0.000000 0.452210 0.041024 -0.098493
	0.035670 -0.040818 0.060015 0.018182 -0.047887 0.998486
	-0.000000 0.026025 -0.000000 0.002853 -0.033945 0.001202
	-0.027674 -0.041719 0.059816 0.052106 0.046785 -0.997231
	0.000000 0.025637 0.000000 0.001972 0.121503 -0.002943
	-0.050906 -0.034136 0.024111 0.058394 0.145779 -0.987384
	0.000000 0.049218 -0.000000 0.001273 0.130147 -0.004151
	0.059788 -0.034178 0.023788 0.058968 -0.144900 0.987571
	0.000000 0.049218 -0.000000 0.001262 -0.129525 0.004153
	0.032298 -0.054366 -0.002832 0.005730 -0.051283 -0.998667
	-0.000000 0.018246 0.000000 0.000223 0.105798 0.003347
	-0.026453 -0.054341 -0.002832 0.011409 0.051461 0.998493
	0.000000 0.018247 0.000000 0.000219 -0.104659 -0.003397
	-0.053205 -0.156103 -0.013103 -0.083867 0.236072 0.951085
	0.060800 -0.156152 -0.013104 -0.083973 -0.236037 -0.951008
	0.038704 -0.122207 0.051886 -0.000097 -0.468377 0.883529
	-0.031079 -0.122177 0.051886 -0.000097 -0.468376 0.883529
	0.031859 -0.116268 0.003550 -0.080502 -0.440954 -0.880320
	-0.024230 -0.116244 0.003550 -0.080308 0.440987 0.880387
	0.499018 -0.024612 -0.402947 -0.000374 -0.707079 -0.000000
	0.252528 -0.529487 -0.555359 0.000000 0.250468 -0.968125
	-0.579537 -0.014947 -0.831409 -0.000374 -0.707079 -0.000000
	-0.213911 -0.457952 -0.518543 -0.339129 0.234470 -0.906822
	0.496898 -0.024611 0.400585 -0.000374 -0.707079 -0.000000
	0.252528 -0.529487 0.555269 -0.968125 0.000000 -0.000000
	-0.576707 -0.014949 0.829043 -0.000374 -0.707107 -0.000000
	-0.223781 -0.456157 0.514222 -0.906822 0.087686 -0.339129
	-0.737572 -0.014947 0.364709 -0.000374 -0.707079 -0.000000
	-0.450942 -0.330299 0.228546 -0.878231 0.076169 -0.447886
	-0.731698 -0.014951 -0.367075 -0.000374 -0.707079 -0.000000
	-0.450942 -0.330299 -0.236787 0.865705 -0.166269 0.471641
	-0.768131 -0.554428 -0.001125 -0.576453 0.409514 -0.576453
}

frame 8 {
	0.000000 0.000000 0.100000 0.707107 -0.000000 -0.000000
	0.276526 -0.572033 -0.004892 -0.504590 0.495370 -0.504798
	-0.000000 0.520055 0.000000 0.035374 -0.000231 0.004019
	-0.136732 0.038257 0.004402 -0.032463 -0.031215 -0.693986
	-0.000000 0.447469 0.000000 0.262222 0.403340 -0.784457
	0.151140 0.042027 0.014281 -0.021161 0.022731 0.699072
	0.000000 0.437615 -0.000000 0.261901 -0.414140 0.775184
	0.162623 0.221463 -0.011451 -0.025264 -0.004399 0.440072
	0.000000 0.501200 0.000000 0.472245 0.009719 -0.056825
	-0.162016 0.218096 -0.011498 -0.026206 0.008065 -0.436920
	0.000000 0.492872 0.000000 0.468621 -0.005836 0.053117
	0.142976 0.370391 -0.009384 0.150478 -0.007695 0.115670
	-0.000000 0.422763 0.000000 0.344350 -0.044693 0.084112
	-0.137594 0.373323 -0.014729 0.137231 0.009550 -0.118648
	0.000000 0.421663 0.000000 0.365406 0.041853 -0.081947
	0.035670 -0.040818 0.060014 0.018183 -0.047886 0.998486
	0.000000 0.026025 -0.000000 0.002853 -0.033945 0.001202
	-0.027674 -0.041719 0.059816 0.052106 0.046785 -0.997231
	0.000000 0.025637 0.000000 0.001972 0.121503 -0.002943
	-0.050906 -0.034136 0.024111 0.058395 0.145779 -0.987384
	0.000000 0.049218 0.000000 0.001273 0.130147 -0.004151
	0.059788 -0.034178 0.023788 0.058969 -0.144900 0.987571
	0.000000 0.049218 0.000000 0.001261 -0.129525 0.004153
	0.032298 -0.054366 -0.002832 0.005730 -0.051283 -0.998667
	0.000000 0.018246 0.000000 0.000223 0.105798 0.003347
	-0.026453 -0.054341 -0.002832 0.011409 0.051461 0.998493
	-0.000000 0.018247 -0.000000 0.000219 -0.104659 -0.003397
	-0.053205 -0.156103 -0.013104 -0.083867 0.236072 0.951085
	0.060800 -0.156152 -0.013104 -0.083973 -0.236037 -0.951008
	0.038704 -0.122207 0.051886 -0.000097 -0.468377 0.883529
	-0.031079 -0.122177 0.051886 -0.000097 -0.468376 0.883529
	0.031859 -0.116268 0.003549 -0.080502 -0.440954 -0.880320
	-0.024230 -0.116244 0.003550 -0.080308 0.440987 0.880387
	0.486515 -0.036550 -0.402948 -0.000374 -0.707079 -0.000000
	0.252528 -0.529487 -0.555359 0.000000 0.250468 -0.968125
	-0.580541 -0.026892 -0.831409 -0.000374 -0.707079 -0.000000
	-0.213911 -0.457952 -0.518543 -0.339129 0.234470 -0.906822
	0.484897 -0.036549 0.400584 -0.000374 -0.707079 -0.000000
	0.252528 -0.529487 0.555269 -0.968125 0.000000 -0.000000
	-0.579151 -0.026892 0.829043 -0.000374 -0.707107 -0.000000
	-0.223781 -0.456157 0.514222 -0.906822 0.087686 -0.339129
	-0.738925 -0.026892 0.364709 -0.000374 -0.707079 -0.000000
	-0.450942 -0.330299 0.228546 -0.878231 0.076169 -0.447886
	-0.736001 -0.026893 -0.367075 -0.000374 -0.707079 -0.000000
	-0.450942 -0.330299 -0.236787 0.865705 -0.166269 0.471641
	-0.768131 -0.554428 -0.001125 -0.576453 0.409514 -0.576453
}

frame 9 {
	0.000000 0.000000 0.100000 0.707107 -0.000000 -0.000000
	0.276525 -0.615977 -0.004892 -0.504590 0.495370 -0.504798
	-0.000000 0.520055 0.000000 0.076775 -0.000389 0.004019
	-0.136732 0.038257 0.004402 -0.007018 -0.000295 -0.691037
	-0.000000 0.447469 -0.000000 0.258207 0.426367 -0.765963
	0.151140 0.042027 0.014281 0.004992 -0.008699 0.696063
	0.000000 0.437616 -0.000000 0.257054 -0.437494 0.755393
	0.162623 0.221463 -0.011451 0.007948 -0.020183 0.439266
	-0.000000 0.501200 -0.000000 0.439435 0.008927 -0.054602
	-0.162016 0.218096 -0.011498 0.007178 0.023698 -0.436359
	-0.000000 0.492872 0.000000 0.436130 -0.005097 0.051013
	0.142976 0.370391 -0.009384 0.209517 -0.012281 0.120295
	0.000000 0.422763 0.000000 0.268788 -0.045291 0.067084
	-0.137594 0.373323 -0.014729 0.196069 0.014871 -0.122536
	0.000000 0.421663 0.000000 0.289920 0.042548 -0.066334
	0.035670 -0.040818 0.060014 0.018183 -0.047886 0.998486
	-0.000000 0.026025 -0.000000 0.002853 -0.033945 0.001202
	-0.027674 -0.041719 0.059816 0.052106 0.046785 -0.997231
	0.000000 0.025637 -0.000000 0.001972 0.121503 -0.002943
	-0.050906 -0.034136 0.024111 0.058395 0.145779 -0.987384
	0.000000 0.049218 -0.000000 0.001273 0.130147 -0.004151
	0.059788 -0.034178 0.023788 0.058969 -0.144900 0.987571
	-0.000000 0.049218 0.000000 0.001261 -0.129525 0.004153
	0.032298 -0.054366 -0.002832 0.005724 -0.051283 -0.998667
	-0.000000 0.018246 -0.000000 0.000223 0.105798 0.003347
	-0.026453 -0.054341 -0.002832 0.011409 0.051461 0.998493
	-0.000000 0.018246 -0.000000 0.000219 -0.104659 -0.003397
	-0.053205 -0.156103 -0.013104 -0.083867 0.236072 0.951085
	0.060800 -0.156152 -0.013104 -0.083973 -0.236037 -0.951008
	0.038704 -0.122207 0.051886 -0.000097 -0.468377 0.883529
	-0.031079 -0.122177 0.051886 -0.000097 -0.468376 0.883529
	0.031859 -0.116268 0.003549 -0.080502 -0.440954 -0.880320
	-0.024230 -0.116244 0.003550 -0.080308 0.440987 0.880387
	0.477598 -0.043892 -0.402949 -0.000374 -0.707079 -0.000000
	0.252528 -0.529487 -0.555359 0.000000 0.250468 -0.968125
	-0.581250 -0.034238 -0.831409 -0.000374 -0.707079 -0.000000
	-0.213911 -0.457952 -0.518543 -0.339129 0.234470 -0.906822
	0.477254 -0.043892 0.400583 -0.000374 -0.707079 -0.000000
	0.252528 -0.529487 0.555269 -0.968125 0.000000 -0.000000
	-0.580870 -0.034238 0.829043 -0.000374 -0.707107 -0.000000
	-0.223781 -0.456157 0.514222 -0.906822 0.087686 -0.339129
	-0.739827 -0.034238 0.364709 -0.000374 -0.707079 -0.000000
	-0.450942 -0.330299 0.228546 -0.878231 0.076169 -0.447886
	-0.739010 -0.034239 -0.367076 -0.000374 -0.707079 -0.000000
	-0.450942 -0.330299 -0.236787 0.865705 -0.166269 0.471641
	-0.768131 -0.554428 -0.001125 -0.576453 0.409514 -0.576453
}

frame 10 {
	0.000000 0.000000 0.100000 0.707107 -0.000000 -0.000000
	0.276525 -0.630711 -0.004892 -0.504590 0.495370 -0.504798
	0.000000 0.520055 0.000000 0.090445 -0.000441 0.004017
	-0.136732 0.038257 0.004402 0.001456 0.009866 -0.689927
	0.000000 0.447469 -0.000000 0.256587 0.434106 -0.759344
	0.151140 0.042027 0.014281 0.013658 -0.019016 0.694939
	0.000000 0.437615 0.000000 0.255170 -0.445334 0.748325
	0.162623 0.221463 -0.011451 0.019532 -0.025716 0.438708
	0.000000 0.501200 -0.000000 0.427303 0.008671 -0.053661
	-0.162016 0.218096 -0.011498 0.018814 0.029157 -0.435881
	-0.000000 0.492872 -0.000000 0.424145 -0.004865 0.050114
	0.142976 0.370391 -0.009384 0.232442 -0.013982 0.122558
	-0.000000 0.422763 -0.000000 0.236692 -0.045521 0.059493
	-0.137594 0.373323 -0.014729 0.218762 0.016842 -0.124424
	0.000000 0.421663 0.000000 0.258116 0.042812 -0.059450
	0.035670 -0.040818 0.060014 0.018182 -0.047887 0.998486
	-0.000000 0.026025 0.000000 0.002853 -0.033945 0.001202
	-0.027674 -0.041720 0.059816 0.052106 0.046785 -0.997231
	-0.000000 0.025637 0.000000 0.001972 0.121503 -0.002943
	-0.050906 -0.034136 0.024111 0.058394 0.145779 -0.987384
	0.000000 0.049218 0.000000 0.001273 0.130147 -0.004151
	0.059788 -0.034178 0.023788 0.058969 -0.144900 0.987571
	-0.000000 0.049218 0.000000 0.001261 -0.129525 0.004153
	0.032298 -0.054366 -0.002833 0.005720 -0.051283 -0.998667
	-0.000000 0.018247 0.000000 0.000223 0.105798 0.003347
	-0.026453 -0.054341 -0.002832 0.011410 0.051461 0.998493
	-0.000000 0.018246 -0.000000 0.000219 -0.104659 -0.003397
	-0.053205 -0.156103 -0.013104 -0.083867 0.236072 0.951085
	0.060800 -0.156152 -0.013104 -0.083973 -0.236037 -0.951008
	0.038704 -0.122207 0.051886 -0.000097 -0.468377 0.883529
	-0.031079 -0.122177 0.051886 -0.000097 -0.468376 0.883529
	0.031859 -0.116268 0.003549 -0.080502 -0.440954 -0.880320
	-0.024230 -0.116244 0.003550 -0.080308 0.440987 0.880387
	0.474768 -0.046332 -0.402949 -0.000374 -0.707079 -0.000000
	0.252528 -0.529487 -0.555359 0.000000 0.250468 -0.968125
	-0.581522 -0.036679 -0.831409 -0.000374 -0.707079 -0.000000
	-0.213911 -0.457952 -0.518543 -0.339129 0.234470 -0.906822
	0.474768 -0.046332 0.400583 -0.000374 -0.707079 -0.000000
	0.252528 -0.529487 0.555269 -0.968125 0.000000 -0.000000
	-0.581523 -0.036679 0.829043 -0.000374 -0.707107 -0.000000
	-0.223781 -0.456157 0.514222 -0.906822 0.087686 -0.339129
	-0.740141 -0.036679 0.364709 -0.000374 -0.707079 -0.000000
	-0.450942 -0.330299 0.228546 -0.878231 0.076169 -0.447886
	-0.740141 -0.036679 -0.367076 -0.000374 -0.707079 -0.000000
	-0.450942 -0.330299 -0.236787 0.865705 -0.166269 0.471641
	-0.768131 -0.554428 -0.001125 -0.576453 0.409514 -0.576453
}

