MD5Version 10
commandline ""

numFrames 11
numJoints 85
frameRate 60
numAnimatedComponents 510

hierarchy {
  "origin" -1 63 0 //
  "hips" 0 63 6 //
  "spine" 1 63 12 //
  "ribs" 2 63 18 //
  "neck" 3 63 24 //
  "neckcontol" 4 63 30 //
  "head" 4 63 36 //
  "jaw" 6 63 42 //
  "lower_lip0" 7 63 48 //
  "lip.003" 8 63 54 //
  "lip.002" 9 63 60 //
  "lip.001" 10 63 66 //
  "lip" 11 63 72 //
  "eye.L" 6 63 78 //
  "eye.R" 6 63 84 //
  "upper_lip0" 6 63 90 //
  "lip.004" 15 63 96 //
  "lip.005" 16 63 102 //
  "lip.006" 17 63 108 //
  "lip.007" 18 63 114 //
  "eyelidIK3.L" 6 63 120 //
  "eyelid2.L" 20 63 126 //
  "eyelid3.L" 21 63 132 //
  "eyelidIK2.L" 6 63 138 //
  "eyelid1.L" 23 63 144 //
  "eyelid.L" 24 63 150 //
  "eyelidIK3.R" 6 63 156 //
  "eyelid2.R" 26 63 162 //
  "eyelid3.R" 27 63 168 //
  "eyelidIK2.R" 6 63 174 //
  "eyelid1.R" 29 63 180 //
  "eyelid.R" 30 63 186 //
  "head_tag" 4 63 192 //
  "shoulder.R" 3 63 198 //
  "upper_arm.R" 33 63 204 //
  "forearm.R" 34 63 210 //
  "hand.R" 35 63 216 //
  "finger_index.01.R" 36 63 222 //
  "finger_index.02.R" 37 63 228 //
  "finger_index.03.R" 38 63 234 //
  "thumb.01.R" 36 63 240 //
  "thumb.02.R" 40 63 246 //
  "thumb.03.R" 41 63 252 //
  "tag_weapon" 36 63 258 //
  "finger_middle.01.R" 36 63 264 //
  "finger_middle.02.R" 44 63 270 //
  "finger_middle.03.R" 45 63 276 //
  "finger_ring.01.R" 36 63 282 //
  "finger_ring.02.R" 47 63 288 //
  "finger_ring.03.R" 48 63 294 //
  "finger_pinky.01.R" 36 63 300 //
  "finger_pinky.02.R" 50 63 306 //
  "finger_pinky.03.R" 51 63 312 //
  "hand_armor.R" 35 63 318 //
  "tag_gear" 3 63 324 //
  "shoulder.L" 3 63 330 //
  "upper_arm.L" 55 63 336 //
  "forearm.L" 56 63 342 //
  "hand_armor.L" 57 63 348 //
  "hand.L" 57 63 354 //
  "finger_index.01.L" 59 63 360 //
  "finger_index.02.L" 60 63 366 //
  "finger_index.03.L" 61 63 372 //
  "thumb.01.L" 59 63 378 //
  "thumb.02.L" 63 63 384 //
  "thumb.03.L" 64 63 390 //
  "finger_middle.01.L" 59 63 396 //
  "finger_middle.02.L" 66 63 402 //
  "finger_middle.03.L" 67 63 408 //
  "finger_ring.01.L" 59 63 414 //
  "finger_ring.02.L" 69 63 420 //
  "finger_ring.03.L" 70 63 426 //
  "finger_pinky.01.L" 59 63 432 //
  "finger_pinky.02.L" 72 63 438 //
  "finger_pinky.03.L" 73 63 444 //
  "thigh.R" 1 63 450 //
  "shin.R" 75 63 456 //
  "thigh.L" 1 63 462 //
  "shin.L" 77 63 468 //
  "ankle.R" 0 63 474 //
  "foot.R" 79 63 480 //
  "toe.R" 79 63 486 //
  "ankle.L" 0 63 492 //
  "toe.L" 82 63 498 //
  "foot.L" 82 63 504 //
}

bounds {
  ( -1.945048 -2.565454 -0.032603 ) ( 6.169288 2.008111 12.983417 )
  ( -1.945048 -2.565454 -0.032603 ) ( 6.160785 2.008111 12.983851 )
  ( -1.945048 -2.565454 -0.032603 ) ( 6.133831 2.008111 12.985114 )
  ( -1.945048 -2.565454 -0.032603 ) ( 6.085403 2.008111 12.986992 )
  ( -1.945048 -2.565454 -0.032603 ) ( 6.013197 2.008111 12.989134 )
  ( -1.945048 -2.565454 -0.032603 ) ( 5.918986 2.008111 12.991157 )
  ( -1.945048 -2.590558 -0.032603 ) ( 5.811371 2.008111 12.992849 )
  ( -1.945048 -2.609614 -0.032603 ) ( 5.705148 2.008111 12.993963 )
  ( -1.945048 -2.618520 -0.032603 ) ( 5.616799 2.008111 12.995656 )
  ( -1.945048 -2.621661 -0.032603 ) ( 5.559377 2.008111 12.996675 )
  ( -1.945048 -2.622255 -0.032603 ) ( 5.539758 2.008111 12.996995 )
}

baseframe {
  ( 0.000000 0.000000 0.000000 ) ( 0.000000 -0.707107 -0.707107 )
  ( 0.184526 6.906084 -0.013687 ) ( -0.063425 -0.704162 0.063709 )
  ( -0.000000 1.240110 0.000000 ) ( 0.191587 0.001295 -0.009840 )
  ( -0.000000 1.426178 -0.000000 ) ( -0.063779 -0.002332 0.012698 )
  ( -0.000000 1.821084 0.000000 ) ( -0.145265 -0.001328 -0.001879 )
  ( 0.000000 0.808121 0.000000 ) ( 0.001844 -0.515148 -0.857099 )
  ( -0.002195 0.809023 0.000794 ) ( 0.040325 0.000217 -0.001349 )
  ( -0.003138 0.224356 0.163703 ) ( -0.591717 0.381594 0.595702 )
  ( -0.263320 0.555491 -0.218415 ) ( -0.002580 0.003661 -0.873876 )
  ( 0.000000 0.017501 -0.000000 ) ( 0.220569 0.655870 0.690904 )
  ( 0.000000 0.135389 -0.000001 ) ( 0.037467 -0.018190 0.200649 )
  ( 0.000000 0.113742 0.000000 ) ( -0.125321 0.000000 0.210707 )
  ( 0.000000 0.113741 -0.000000 ) ( 0.037467 0.018190 0.200649 )
  ( 0.262165 0.811893 0.662538 ) ( -0.000000 -0.752543 -0.658544 )
  ( -0.244069 0.811856 0.663658 ) ( -0.000000 -0.752542 -0.658544 )
  ( 0.225828 0.266057 0.774515 ) ( 0.047000 0.705543 -0.047000 )
  ( -0.000000 0.017501 -0.000000 ) ( 0.186223 0.743981 0.598525 )
  ( -0.000000 0.145787 -0.000001 ) ( 0.114298 0.017382 0.174281 )
  ( -0.000000 0.112094 0.000000 ) ( -0.001650 -0.003770 0.248557 )
  ( -0.000000 0.111594 0.000000 ) ( 0.099455 -0.020017 0.173948 )
  ( 0.361090 0.810247 0.681599 ) ( 0.046999 0.705543 -0.046999 )
  ( -0.000000 0.011231 0.000000 ) ( 0.138551 0.777593 0.585011 )
  ( 0.000000 0.112704 0.000001 ) ( 0.248666 0.003044 0.385872 )
  ( 0.360328 0.777492 0.684141 ) ( 0.046999 0.705543 -0.046999 )
  ( -0.000000 0.010076 -0.000000 ) ( -0.135461 0.512721 0.787661 )
  ( -0.000000 0.108887 -0.000001 ) ( -0.349590 0.371748 0.224171 )
  ( -0.137678 0.812980 0.691455 ) ( 0.046999 0.705543 -0.046999 )
  ( -0.000000 0.011230 0.000000 ) ( 0.069059 0.752863 0.649633 )
  ( 0.000000 0.131865 -0.000000 ) ( 0.201215 -0.007965 0.324740 )
  ( -0.136810 0.780376 0.690930 ) ( 0.046999 0.705543 -0.046999 )
  ( -0.000000 0.010076 0.000000 ) ( 0.085597 0.645822 0.755134 )
  ( -0.000000 0.128464 -0.000001 ) ( -0.122912 -0.007699 0.282440 )
  ( -0.002195 0.809023 0.000794 ) ( 0.040325 0.000217 -0.001349 )
  ( -0.014833 1.825302 -0.071422 ) ( 0.548058 -0.398517 -0.527101 )
  ( 0.000000 1.493901 0.000000 ) ( 0.337192 0.599744 -0.369520 )
  ( 0.000000 2.103016 0.000000 ) ( -0.166080 0.071882 0.080628 )
  ( 0.000001 1.823368 0.000000 ) ( 0.026122 0.716524 0.005963 )
  ( 0.288927 0.945606 -0.016979 ) ( -0.100840 -0.682277 -0.030495 )
  ( 0.000000 0.310931 0.000000 ) ( -0.001887 -0.003346 -0.140544 )
  ( -0.000000 0.255058 0.000000 ) ( 0.014527 -0.020137 -0.079928 )
  ( 0.182657 0.102359 0.122068 ) ( 0.068809 0.469953 0.338161 )
  ( -0.000000 0.450617 0.000000 ) ( -0.099065 0.025937 0.025593 )
  ( 0.000000 0.295731 -0.000001 ) ( 0.108671 0.022517 0.026610 )
  ( 0.586577 1.443575 0.291631 ) ( 0.494772 0.504178 0.517254 )
  ( 0.081677 0.956433 -0.018380 ) ( -0.107088 -0.736173 -0.098262 )
  ( 0.000000 0.323707 0.000000 ) ( -0.004845 -0.051318 -0.175658 )
  ( 0.000000 0.229679 -0.000000 ) ( 0.016195 -0.015133 -0.050692 )
  ( -0.151893 0.951490 -0.015787 ) ( -0.155854 -0.744157 -0.130418 )
  ( -0.000001 0.298948 -0.000000 ) ( 0.022449 -0.039879 -0.150750 )
  ( -0.000000 0.222754 0.000000 ) ( 0.017543 -0.013115 -0.049400 )
  ( -0.332551 0.872253 0.059175 ) ( -0.270536 -0.079021 -0.029623 )
  ( 0.000000 0.247823 -0.000000 ) ( -0.085055 0.000243 0.004201 )
  ( 0.000000 0.155400 0.000000 ) ( -0.148243 -0.000940 -0.003131 )
  ( 0.531379 1.351308 -0.004340 ) ( 0.015885 0.004080 0.999865 )
  ( 0.002183 1.423120 -0.451181 ) ( 0.675237 0.001866 -0.002772 )
  ( 0.014634 1.825497 -0.071451 ) ( 0.552755 0.408370 0.515946 )
  ( 0.000000 1.493901 0.000000 ) ( 0.498017 -0.047311 0.047143 )
  ( 0.000000 2.103018 -0.000001 ) ( -0.075532 0.079375 0.168458 )
  ( 0.093228 1.351308 0.523154 ) ( 0.654641 0.002699 0.755929 )
  ( 0.000000 1.823368 -0.000000 ) ( -0.025836 0.094228 -0.007102 )
  ( 0.286576 1.006395 -0.107107 ) ( 0.072174 0.602406 -0.086389 )
  ( 0.000000 0.249955 0.000000 ) ( -0.000083 -0.010683 -0.125485 )
  ( -0.000000 0.254363 -0.000000 ) ( -0.016009 0.049143 -0.075943 )
  ( 0.120542 0.102358 -0.183667 ) ( 0.017564 -0.626009 0.348850 )
  ( -0.000000 0.445150 0.000000 ) ( 0.067621 -0.024966 0.008198 )
  ( 0.000000 0.302324 0.000000 ) ( -0.058338 0.684439 0.061834 )
  ( 0.073565 1.013167 -0.024132 ) ( 0.119028 -0.795213 0.100389 )
  ( -0.000000 0.266205 0.000000 ) ( 0.003820 0.009027 0.165078 )
  ( -0.000000 0.229740 -0.000000 ) ( -0.004806 0.012921 0.052363 )
  ( -0.127263 1.003840 0.060605 ) ( 0.184529 -0.779480 0.128005 )
  ( -0.000000 0.246800 0.000000 ) ( -0.001225 -0.003214 0.130582 )
  ( 0.000000 0.222126 -0.000000 ) ( 0.002051 0.007113 0.050428 )
  ( -0.358085 0.893698 0.063869 ) ( 0.227228 -0.775272 0.133791 )
  ( 0.000000 0.221431 -0.000000 ) ( -0.006730 0.001955 0.092569 )
  ( -0.000000 0.154458 0.000000 ) ( -0.003598 -0.015304 0.148050 )
  ( -0.810392 0.550812 -0.372493 ) ( -0.984551 0.027405 -0.000267 )
  ( 0.000000 3.626385 -0.000000 ) ( -0.211921 0.002430 0.007077 )
  ( 0.782400 0.551416 -0.372917 ) ( -0.984498 -0.026294 0.009171 )
  ( -0.000000 3.626384 0.000000 ) ( -0.211935 -0.017722 -0.006644 )
  ( -0.305859 0.828940 1.124649 ) ( -0.552637 0.176065 -0.801670 )
  ( -0.090614 0.138320 1.006144 ) ( 0.752092 0.018236 0.046746 )
  ( -0.090614 0.138320 1.006144 ) ( -0.854351 0.076975 -0.055594 )
  ( -0.305858 0.828940 -1.124649 ) ( 0.585870 -0.181993 -0.777713 )
  ( -0.005721 0.138319 -1.010200 ) ( -0.046568 0.515226 -0.854890 )
  ( -0.005721 0.138319 -1.010200 ) ( -0.753536 -0.000864 0.003278 )
}

frame 0 {
  -0.000000 0.000000 0.007046 -0.707107 -0.000000 -0.000000
  0.337932 6.437504 -0.106869 -0.075371 -0.540867 0.048998
  0.000000 1.240110 0.000000 0.052507 -0.000062 -0.047498
  0.000000 1.426178 0.000000 -0.184644 -0.006541 0.041914
  0.000000 1.821084 0.000000 -0.059450 -0.193375 -0.058793
  -0.000000 0.808123 -0.000000 0.001844 -0.515148 -0.857099
  -0.044148 0.766294 0.024775 0.045046 0.018595 0.043682
  -0.003138 0.224356 0.163703 -0.582226 0.395844 0.586146
  -0.259541 0.557511 -0.217253 0.918319 -0.378174 0.083463
  -0.000000 0.017501 0.000000 0.765468 -0.167786 -0.221257
  0.000000 0.135389 0.000000 0.077406 -0.083307 0.226101
  0.000000 0.113742 0.000000 -0.176718 -0.042501 0.164696
  -0.000000 0.113741 0.000001 -0.031558 -0.009163 0.230042
  0.262165 0.811893 0.662538 0.055834 0.849409 0.522493
  -0.244069 0.811854 0.663659 0.068580 0.847974 0.522145
  0.224683 0.261798 0.775026 0.065804 -0.706070 0.224798
  -0.000000 0.017499 0.000000 0.693018 -0.195434 -0.204222
  0.000000 0.145787 0.000001 0.140073 -0.029166 0.201369
  0.000000 0.112093 -0.000001 -0.076060 -0.067477 0.233265
  0.000000 0.111594 -0.000000 0.024045 -0.043243 0.223825
  0.365934 0.793584 0.683419 0.046999 0.705543 -0.046999
  -0.000000 0.011232 -0.000000 0.110789 0.814582 0.539600
  0.000000 0.112704 0.000000 0.319796 -0.081702 0.407313
  0.360328 0.777493 0.684141 0.046999 0.705543 -0.046999
  -0.000000 0.010074 -0.000000 -0.099298 0.457442 0.813066
  -0.000000 0.108886 -0.000000 -0.431279 0.352683 0.307499
  -0.136626 0.803881 0.692455 0.046999 0.705543 -0.046999
  -0.000000 0.011230 -0.000000 -0.001341 0.767768 0.615080
  0.000000 0.131865 -0.000002 0.168228 -0.091384 0.414111
  -0.136810 0.780376 0.690930 0.046999 0.705543 -0.046999
  0.000000 0.010076 -0.000000 0.062123 0.627371 0.752991
  0.000000 0.128464 -0.000000 -0.209364 -0.078930 0.364853
  -0.002195 0.809024 0.000794 0.040325 0.000217 -0.001349
  -0.014833 1.825301 -0.071422 0.467192 -0.533469 -0.463268
  -0.000000 1.493901 0.000002 0.120488 0.559200 -0.732578
  0.000002 2.103014 -0.000001 -0.821368 0.029832 0.398756
  -0.000000 1.823367 -0.000001 0.230811 0.499817 -0.261963
  0.288928 0.945606 -0.016979 -0.051789 -0.682652 -0.029508
  -0.000000 0.310930 -0.000003 0.000222 -0.001464 -0.002345
  -0.000000 0.255058 0.000001 -0.030008 -0.071884 -0.099345
  0.182659 0.102358 0.122067 -0.147775 0.530614 0.238940
  0.000000 0.450619 -0.000000 -0.221341 -0.001975 -0.022334
  0.000000 0.295730 0.000000 0.099235 0.155976 -0.150771
  0.586578 1.443575 0.291631 0.494772 0.504178 0.517254
  0.081679 0.956432 -0.018380 -0.233392 -0.644787 -0.351099
  0.000000 0.323706 -0.000000 0.060402 -0.029307 -0.532398
  -0.000000 0.229678 0.000000 0.030162 0.093522 -0.398678
  -0.151891 0.951490 -0.015787 -0.308176 -0.643959 -0.377342
  -0.000000 0.298947 -0.000001 0.096377 -0.030549 -0.429215
  -0.000000 0.222753 -0.000000 0.006242 0.070220 -0.362052
  -0.332550 0.872253 0.059175 -0.391617 -0.056769 -0.073584
  -0.000001 0.247823 0.000000 -0.418001 0.003182 -0.041898
  0.000000 0.155400 0.000000 -0.503481 -0.045728 -0.035952
  0.531378 1.351308 -0.004341 0.015885 0.004092 0.999865
  0.002183 1.423121 -0.451181 0.675237 0.001866 -0.002772
  0.014634 1.825496 -0.071451 0.349543 0.582230 0.568777
  0.000000 1.493901 -0.000001 0.352697 0.373872 0.474137
  -0.000000 2.103017 -0.000001 0.063767 0.490844 0.533688
  0.093226 1.351308 0.523154 0.654637 0.002690 0.755932
  -0.000002 1.823369 0.000001 -0.090738 0.597793 -0.344192
  0.286576 1.006395 -0.107106 0.024503 0.598350 -0.058859
  0.000001 0.249956 -0.000000 -0.029549 -0.012156 -0.324974
  0.000001 0.254362 -0.000000 -0.075874 0.172966 -0.419472
  0.120542 0.102358 -0.183667 0.006924 -0.621536 0.355333
  0.000001 0.445151 -0.000000 0.210696 -0.024495 0.024319
  -0.000001 0.302323 0.000000 -0.250417 0.522475 0.319672
  0.073564 1.013167 -0.024131 0.021240 -0.812622 0.006495
  -0.000000 0.266204 0.000001 0.056344 0.004777 0.582832
  0.000001 0.229740 -0.000000 -0.022646 0.184651 0.188143
  -0.127263 1.003841 0.060606 0.076612 -0.797056 0.046918
  0.000000 0.246801 0.000000 -0.008425 -0.002392 0.639483
  0.000000 0.222128 0.000000 -0.019202 0.249549 0.024962
  -0.358085 0.893699 0.063870 0.165853 -0.779888 0.118752
  0.000001 0.221431 -0.000000 -0.065229 0.003523 0.302297
  0.000000 0.154459 -0.000000 0.132021 0.263765 0.314684
  -0.810392 0.550812 -0.372493 -0.966787 0.112025 -0.084120
  -0.000000 3.626384 -0.000000 -0.371112 0.002308 0.012392
  0.782400 0.551418 -0.372917 -0.932548 -0.100033 0.051836
  0.000000 3.626384 0.000001 -0.306047 -0.017263 -0.009595
  -1.406109 0.838118 1.299208 -0.369178 0.203943 -0.901430
  -0.090614 0.138320 1.006144 0.752092 0.018236 0.046746
  -0.090614 0.138320 1.006144 -0.852404 0.078746 -0.052999
  2.241435 0.812477 -1.543512 0.711378 -0.142690 -0.667010
  -0.005721 0.138320 -1.010200 -0.025764 -0.537679 0.842437
  -0.005721 0.138320 -1.010200 -0.753536 -0.000863 0.003278
}

frame 1 {
  -0.000000 0.000000 0.007046 -0.707107 -0.000000 -0.000000
  0.337932 6.437504 -0.106869 -0.075371 -0.540867 0.048998
  0.000000 1.240110 0.000000 0.051816 0.000010 -0.047189
  -0.000000 1.426178 -0.000000 -0.184105 -0.006633 0.041686
  -0.000000 1.821083 -0.000000 -0.059243 -0.193430 -0.058825
  -0.000000 0.808120 -0.000000 0.001844 -0.515148 -0.857099
  -0.044143 0.766315 0.024819 0.045849 0.018368 0.043701
  -0.003138 0.224356 0.163703 -0.582226 0.395844 0.586146
  -0.259542 0.557510 -0.217253 0.917981 -0.378994 0.083390
  -0.000000 0.017501 0.000000 0.765178 -0.167952 -0.221266
  -0.000000 0.135389 -0.000000 0.077793 -0.083102 0.225905
  0.000000 0.113742 -0.000000 -0.176444 -0.042608 0.165005
  -0.000000 0.113741 -0.000001 -0.031185 -0.009350 0.230090
  0.262165 0.811893 0.662538 0.055683 0.848943 0.523278
  -0.244069 0.811855 0.663658 0.068430 0.847513 0.522927
  0.224683 0.261798 0.775027 0.065173 -0.706128 0.224201
  -0.000000 0.017499 0.000000 0.692709 -0.195497 -0.204090
  -0.000000 0.145787 -0.000000 0.140366 -0.029017 0.201132
  -0.000000 0.112094 -0.000000 -0.075578 -0.067497 0.233326
  0.000000 0.111594 -0.000001 0.024346 -0.043462 0.223807
  0.365934 0.793585 0.683418 0.046999 0.705543 -0.046999
  -0.000000 0.011230 0.000000 0.110788 0.814583 0.539597
  -0.000000 0.112704 0.000000 0.319797 -0.081703 0.407313
  0.360328 0.777493 0.684141 0.046999 0.705543 -0.046999
  0.000000 0.010074 -0.000000 -0.099297 0.457442 0.813066
  -0.000001 0.108887 -0.000000 -0.431282 0.352683 0.307498
  -0.136626 0.803882 0.692455 0.046999 0.705543 -0.046999
  0.000000 0.011231 0.000000 -0.000801 0.767925 0.615082
  0.000000 0.131865 -0.000001 0.168905 -0.091502 0.413834
  -0.136810 0.780377 0.690930 0.046999 0.705543 -0.046999
  -0.000000 0.010075 0.000000 0.062843 0.627555 0.752929
  -0.000000 0.128465 -0.000000 -0.208727 -0.079096 0.365218
  -0.002200 0.808999 0.000750 0.041117 -0.000046 -0.001314
  -0.014833 1.825302 -0.071422 0.467192 -0.533469 -0.463268
  0.000001 1.493901 0.000000 0.122545 0.565209 -0.728949
  -0.000002 2.103016 0.000000 -0.821759 0.029759 0.398947
  -0.000001 1.823369 0.000000 0.231824 0.498834 -0.258648
  0.288930 0.945606 -0.016979 -0.051774 -0.682654 -0.029493
  -0.000000 0.310931 -0.000001 0.000222 -0.001464 -0.002345
  0.000000 0.255058 -0.000001 -0.030007 -0.071884 -0.099359
  0.182659 0.102358 0.122067 -0.147766 0.530614 0.238936
  0.000001 0.450618 0.000001 -0.221344 -0.001974 -0.022337
  0.000000 0.295730 0.000000 0.099237 0.155978 -0.150768
  0.586579 1.443575 0.291630 0.494772 0.504178 0.517254
  0.081680 0.956433 -0.018380 -0.233371 -0.644796 -0.351078
  -0.000000 0.323706 -0.000002 0.060406 -0.029306 -0.532445
  0.000000 0.229678 -0.000001 0.030161 0.093524 -0.398651
  -0.151891 0.951490 -0.015787 -0.308154 -0.643974 -0.377315
  0.000000 0.298948 -0.000000 0.096391 -0.030548 -0.429278
  -0.000000 0.222754 0.000000 0.006235 0.070224 -0.362016
  -0.332548 0.872253 0.059175 -0.391575 -0.056768 -0.073583
  0.000001 0.247823 -0.000000 -0.418075 0.003181 -0.041906
  0.000000 0.155400 0.000000 -0.503444 -0.045727 -0.035947
  0.531378 1.351309 -0.004340 0.015929 0.004076 0.999865
  0.002183 1.423120 -0.451181 0.675237 0.001866 -0.002772
  0.014634 1.825496 -0.071451 0.349543 0.582230 0.568777
  0.000000 1.493901 0.000001 0.356530 0.367729 0.472105
  -0.000001 2.103015 0.000001 0.064080 0.489862 0.536306
  0.093227 1.351308 0.523155 0.654646 0.002704 0.755924
  -0.000001 1.823367 0.000001 -0.089239 0.600403 -0.341367
  0.286577 1.006395 -0.107108 0.024455 0.598351 -0.058789
  0.000001 0.249955 0.000001 -0.029573 -0.012156 -0.325168
  -0.000001 0.254363 0.000000 -0.075834 0.172957 -0.419369
  0.120542 0.102358 -0.183668 0.006855 -0.621499 0.355396
  0.000001 0.445151 -0.000001 0.210944 -0.024493 0.024358
  0.000001 0.302323 -0.000000 -0.250558 0.522415 0.319725
  0.073565 1.013167 -0.024134 0.021229 -0.812625 0.006484
  -0.000001 0.266204 0.000000 0.056362 0.004776 0.582908
  0.000000 0.229739 0.000001 -0.022682 0.184630 0.188072
  -0.127264 1.003840 0.060604 0.076615 -0.797059 0.046916
  -0.000001 0.246800 -0.000001 -0.008410 -0.002393 0.639535
  0.000000 0.222127 -0.000000 -0.019234 0.249527 0.024899
  -0.358086 0.893698 0.063868 0.165828 -0.779900 0.118707
  0.000000 0.221431 -0.000001 -0.065251 0.003523 0.302471
  -0.000000 0.154459 -0.000000 0.131990 0.263768 0.314562
  -0.810392 0.550812 -0.372493 -0.966787 0.112025 -0.084120
  -0.000000 3.626384 -0.000000 -0.371112 0.002308 0.012392
  0.782400 0.551418 -0.372917 -0.932548 -0.100033 0.051836
  0.000000 3.626384 0.000001 -0.306047 -0.017263 -0.009595
  -1.406109 0.838118 1.299208 -0.369178 0.203943 -0.901430
  -0.090614 0.138320 1.006144 0.752092 0.018236 0.046746
  -0.090614 0.138320 1.006144 -0.852404 0.078746 -0.052999
  2.241435 0.812477 -1.543512 0.711378 -0.142690 -0.667010
  -0.005721 0.138320 -1.010200 -0.025764 -0.537679 0.842437
  -0.005721 0.138320 -1.010200 -0.753536 -0.000863 0.003278
}

frame 2 {
  -0.000000 0.000000 0.007046 -0.707107 -0.000000 -0.000000
  0.337932 6.437504 -0.106869 -0.075371 -0.540867 0.048998
  0.000000 1.240110 0.000000 0.049737 0.000228 -0.046256
  0.000000 1.426177 0.000000 -0.182481 -0.006910 0.040998
  0.000000 1.821084 0.000000 -0.058620 -0.193594 -0.058922
  -0.000000 0.808120 0.000000 0.001844 -0.515148 -0.857099
  -0.044128 0.766384 0.024951 0.048267 0.017684 0.043757
  -0.003137 0.224357 0.163703 -0.582226 0.395844 0.586146
  -0.259542 0.557511 -0.217253 0.916959 -0.381461 0.083169
  -0.000000 0.017501 0.000000 0.764296 -0.168452 -0.221285
  0.000000 0.135389 0.000000 0.078975 -0.082479 0.225305
  0.000000 0.113742 0.000001 -0.175609 -0.042930 0.165938
  0.000000 0.113741 0.000001 -0.030075 -0.009916 0.230229
  0.262165 0.811892 0.662538 0.055228 0.847538 0.525636
  -0.244069 0.811855 0.663658 0.067979 0.846123 0.525277
  0.224683 0.261798 0.775026 0.063275 -0.706301 0.222403
  -0.000000 0.017499 0.000000 0.691779 -0.195681 -0.203691
  -0.000000 0.145787 0.000000 0.141251 -0.028569 0.200411
  0.000000 0.112094 -0.000000 -0.074119 -0.067558 0.233504
  -0.000000 0.111594 -0.000000 0.025243 -0.044127 0.223752
  0.365935 0.793584 0.683418 0.046999 0.705543 -0.046999
  -0.000000 0.011232 -0.000000 0.110788 0.814582 0.539599
  0.000000 0.112704 -0.000001 0.319798 -0.081703 0.407312
  0.360328 0.777493 0.684141 0.046999 0.705543 -0.046999
  -0.000000 0.010076 -0.000000 -0.099297 0.457443 0.813065
  -0.000000 0.108887 0.000000 -0.431282 0.352683 0.307497
  -0.136626 0.803881 0.692455 0.046999 0.705543 -0.046999
  -0.000000 0.011233 -0.000000 0.000824 0.768396 0.615081
  -0.000000 0.131865 -0.000000 0.170930 -0.091846 0.413001
  -0.136810 0.780376 0.690930 0.046999 0.705543 -0.046999
  0.000000 0.010076 -0.000000 0.065011 0.628093 0.752746
  0.000000 0.128464 -0.000000 -0.206818 -0.079594 0.366298
  -0.002215 0.808932 0.000617 0.043500 -0.000838 -0.001209
  -0.014833 1.825302 -0.071422 0.467192 -0.533469 -0.463268
  0.000000 1.493901 -0.000001 0.128677 0.583009 -0.717918
  0.000000 2.103016 -0.000000 -0.822715 0.029585 0.399411
  0.000000 1.823368 0.000000 0.234579 0.496032 -0.248210
  0.288928 0.945606 -0.016979 -0.051747 -0.682657 -0.029465
  0.000001 0.310931 0.000001 0.000222 -0.001464 -0.002345
  0.000000 0.255058 0.000001 -0.030004 -0.071883 -0.099385
  0.182658 0.102358 0.122067 -0.147739 0.530608 0.238941
  0.000000 0.450618 0.000001 -0.221399 -0.001973 -0.022346
  -0.000000 0.295730 0.000000 0.099271 0.155976 -0.150765
  0.586577 1.443575 0.291631 0.494772 0.504178 0.517254
  0.081677 0.956433 -0.018380 -0.233336 -0.644810 -0.351043
  0.000000 0.323706 -0.000001 0.060417 -0.029303 -0.532538
  -0.000000 0.229678 -0.000001 0.030158 0.093529 -0.398588
  -0.151892 0.951490 -0.015787 -0.308118 -0.643999 -0.377269
  0.000000 0.298948 -0.000002 0.096418 -0.030546 -0.429401
  -0.000000 0.222753 -0.000000 0.006221 0.070232 -0.361937
  -0.332550 0.872253 0.059175 -0.391495 -0.056766 -0.073582
  -0.000000 0.247823 0.000000 -0.418237 0.003181 -0.041923
  -0.000000 0.155400 0.000000 -0.503354 -0.045722 -0.035932
  0.531378 1.351308 -0.004340 0.015897 0.004085 0.999865
  0.002183 1.423121 -0.451181 0.675237 0.001866 -0.002772
  0.014634 1.825497 -0.071451 0.349543 0.582230 0.568777
  -0.000000 1.493901 -0.000000 0.367353 0.348871 0.466143
  0.000000 2.103015 -0.000001 0.064913 0.487215 0.543279
  0.093227 1.351308 0.523154 0.654637 0.002704 0.755933
  0.000000 1.823369 -0.000001 -0.083989 0.608472 -0.332311
  0.286576 1.006395 -0.107107 0.024695 0.598347 -0.059147
  -0.000001 0.249956 -0.000001 -0.029454 -0.012158 -0.324175
  -0.000002 0.254364 0.000000 -0.076040 0.172998 -0.419906
  0.120543 0.102358 -0.183666 0.007225 -0.621693 0.355064
  0.000000 0.445149 0.000000 0.209612 -0.024502 0.024152
  0.000001 0.302323 -0.000000 -0.249804 0.522740 0.319434
  0.073565 1.013166 -0.024132 0.021284 -0.812610 0.006539
  -0.000001 0.266206 -0.000001 0.056276 0.004782 0.582518
  -0.000000 0.229740 0.000000 -0.022502 0.184734 0.188447
  -0.127263 1.003840 0.060604 0.076595 -0.797046 0.046928
  -0.000001 0.246799 -0.000000 -0.008489 -0.002390 0.639257
  0.000000 0.222127 -0.000000 -0.019061 0.249643 0.025240
  -0.358086 0.893698 0.063868 0.165976 -0.779832 0.118969
  0.000001 0.221431 0.000001 -0.065126 0.003526 0.301483
  0.000000 0.154459 -0.000000 0.132164 0.263746 0.315253
  -0.810392 0.550812 -0.372493 -0.966787 0.112025 -0.084120
  -0.000000 3.626384 -0.000000 -0.371112 0.002308 0.012392
  0.782400 0.551418 -0.372917 -0.932548 -0.100033 0.051836
  0.000000 3.626384 0.000001 -0.306047 -0.017263 -0.009595
  -1.406109 0.838118 1.299208 -0.369178 0.203943 -0.901430
  -0.090614 0.138320 1.006144 0.752092 0.018236 0.046746
  -0.090614 0.138320 1.006144 -0.852404 0.078746 -0.052999
  2.241435 0.812477 -1.543512 0.711378 -0.142690 -0.667010
  -0.005721 0.138320 -1.010200 -0.025764 -0.537679 0.842437
  -0.005721 0.138320 -1.010200 -0.753536 -0.000863 0.003278
}

frame 3 {
  -0.000000 0.000000 0.007046 -0.707107 -0.000000 -0.000000
  0.337932 6.437504 -0.106869 -0.075371 -0.540867 0.048998
  0.000000 1.240110 0.000000 0.046356 0.000582 -0.044740
  -0.000000 1.426178 -0.000000 -0.179839 -0.007361 0.039880
  -0.000000 1.821084 0.000000 -0.057608 -0.193860 -0.059080
  -0.000000 0.808122 -0.000000 0.001844 -0.515148 -0.857099
  -0.044105 0.766495 0.025166 0.052198 0.016572 0.043849
  -0.003138 0.224357 0.163703 -0.582226 0.395844 0.586146
  -0.259542 0.557510 -0.217254 0.915283 -0.385465 0.082809
  -0.000000 0.017501 0.000000 0.762867 -0.169255 -0.221303
  0.000000 0.135389 -0.000000 0.080874 -0.081463 0.224316
  0.000000 0.113742 -0.000001 -0.174235 -0.043451 0.167447
  -0.000000 0.113741 -0.000002 -0.028274 -0.010837 0.230442
  0.262165 0.811894 0.662538 0.054490 0.845239 0.529459
  -0.244069 0.811857 0.663658 0.067243 0.843849 0.529088
  0.224683 0.261800 0.775026 0.060187 -0.706571 0.219476
  -0.000000 0.017499 0.000000 0.690270 -0.195970 -0.203032
  -0.000000 0.145787 0.000000 0.142676 -0.027844 0.199229
  0.000000 0.112094 -0.000001 -0.071741 -0.067653 0.233781
  -0.000000 0.111594 -0.000000 0.026699 -0.045204 0.223651
  0.365934 0.793586 0.683418 0.046999 0.705543 -0.046999
  -0.000000 0.011231 0.000000 0.110788 0.814584 0.539596
  -0.000000 0.112704 0.000001 0.319799 -0.081703 0.407314
  0.360327 0.777494 0.684141 0.046999 0.705543 -0.046999
  -0.000000 0.010076 -0.000000 -0.099298 0.457444 0.813065
  0.000001 0.108887 -0.000000 -0.431279 0.352682 0.307497
  -0.136626 0.803883 0.692455 0.046999 0.705543 -0.046999
  -0.000000 0.011232 0.000000 0.003470 0.769146 0.615075
  0.000000 0.131865 0.000001 0.174212 -0.092396 0.411624
  -0.136810 0.780377 0.690930 0.046999 0.705543 -0.046999
  0.000000 0.010076 -0.000000 0.068531 0.628957 0.752433
  -0.000000 0.128464 0.000001 -0.203708 -0.080396 0.368037
  -0.002239 0.808822 0.000402 0.047375 -0.002125 -0.001039
  -0.014833 1.825302 -0.071421 0.467192 -0.533469 -0.463268
  -0.000000 1.493901 0.000001 0.138694 0.610773 -0.699842
  -0.000002 2.103017 0.000001 -0.823595 0.029421 0.399837
  0.000001 1.823369 0.000000 0.237855 0.492104 -0.230013
  0.288927 0.945606 -0.016979 -0.051752 -0.682658 -0.029459
  0.000000 0.310931 -0.000001 0.000222 -0.001465 -0.002345
  -0.000000 0.255058 -0.000001 -0.029996 -0.071883 -0.099390
  0.182656 0.102358 0.122067 -0.147710 0.530599 0.238967
  0.000000 0.450619 -0.000002 -0.221481 -0.001973 -0.022355
  0.000000 0.295730 -0.000000 0.099314 0.155968 -0.150765
  0.586576 1.443575 0.291630 0.494772 0.504178 0.517254
  0.081676 0.956433 -0.018380 -0.233342 -0.644812 -0.351036
  0.000000 0.323706 0.000001 0.060414 -0.029303 -0.532566
  -0.000000 0.229678 0.000000 0.030159 0.093516 -0.398561
  -0.151894 0.951490 -0.015787 -0.308123 -0.644003 -0.377261
  -0.000000 0.298948 -0.000001 0.096421 -0.030546 -0.429436
  -0.000000 0.222754 -0.000000 0.006221 0.070222 -0.361907
  -0.332551 0.872254 0.059175 -0.391486 -0.056768 -0.073574
  -0.000001 0.247823 0.000000 -0.418294 0.003181 -0.041922
  -0.000001 0.155400 -0.000000 -0.503311 -0.045735 -0.035931
  0.531379 1.351308 -0.004340 0.015899 0.004074 0.999865
  0.002183 1.423121 -0.451181 0.675237 0.001866 -0.002772
  0.014634 1.825498 -0.071451 0.349543 0.582230 0.568777
  -0.000000 1.493901 0.000001 0.382288 0.317118 0.457249
  0.000001 2.103015 -0.000001 0.065861 0.484142 0.551214
  0.093228 1.351308 0.523154 0.654642 0.002699 0.755928
  0.000001 1.823368 -0.000001 -0.072666 0.622335 -0.315860
  0.286576 1.006395 -0.107107 0.024668 0.598348 -0.059105
  -0.000001 0.249955 0.000000 -0.029466 -0.012157 -0.324285
  -0.000001 0.254362 0.000000 -0.076019 0.172996 -0.419848
  0.120542 0.102359 -0.183667 0.007189 -0.621674 0.355098
  0.000001 0.445151 -0.000001 0.209742 -0.024501 0.024174
  0.000001 0.302323 -0.000000 -0.249879 0.522708 0.319459
  0.073565 1.013167 -0.024131 0.021276 -0.812612 0.006533
  -0.000003 0.266206 0.000000 0.056284 0.004781 0.582560
  -0.000000 0.229740 -0.000001 -0.022520 0.184725 0.188407
  -0.127263 1.003841 0.060605 0.076597 -0.797046 0.046928
  -0.000002 0.246798 -0.000001 -0.008483 -0.002390 0.639285
  0.000000 0.222126 0.000000 -0.019077 0.249633 0.025203
  -0.358086 0.893699 0.063868 0.165958 -0.779839 0.118940
  -0.000000 0.221430 0.000001 -0.065141 0.003526 0.301595
  0.000000 0.154457 -0.000000 0.132146 0.263751 0.315174
  -0.810392 0.550812 -0.372493 -0.966787 0.112025 -0.084120
  -0.000000 3.626384 -0.000000 -0.371112 0.002308 0.012392
  0.782400 0.551418 -0.372917 -0.932548 -0.100033 0.051836
  0.000000 3.626384 0.000001 -0.306047 -0.017263 -0.009595
  -1.406109 0.838118 1.299208 -0.369178 0.203943 -0.901430
  -0.090614 0.138320 1.006144 0.752092 0.018236 0.046746
  -0.090614 0.138320 1.006144 -0.852404 0.078746 -0.052999
  2.241435 0.812477 -1.543512 0.711378 -0.142690 -0.667010
  -0.005721 0.138320 -1.010200 -0.025764 -0.537679 0.842437
  -0.005721 0.138320 -1.010200 -0.753536 -0.000863 0.003278
}

frame 4 {
  -0.000000 0.000000 0.007046 -0.707107 -0.000000 -0.000000
  0.337932 6.437504 -0.106869 -0.075371 -0.540867 0.048998
  0.000000 1.240110 0.000000 0.041932 0.001046 -0.042755
  0.000000 1.426177 -0.000000 -0.176381 -0.007951 0.038418
  -0.000000 1.821082 -0.000000 -0.056284 -0.194208 -0.059285
  -0.000000 0.808122 -0.000000 0.001844 -0.515148 -0.857099
  -0.044074 0.766638 0.025448 0.057339 0.015117 0.043969
  -0.003138 0.224355 0.163703 -0.582226 0.395844 0.586146
  -0.259541 0.557511 -0.217254 0.913064 -0.390692 0.082336
  -0.000000 0.017501 0.000000 0.760990 -0.170294 -0.221299
  0.000000 0.135389 -0.000000 0.083363 -0.080129 0.222998
  -0.000000 0.113741 0.000000 -0.172434 -0.044128 0.169404
  -0.000000 0.113741 -0.000001 -0.025907 -0.012041 0.230699
  0.262164 0.811892 0.662538 0.053522 0.842210 0.534439
  -0.244069 0.811856 0.663658 0.066281 0.840852 0.534052
  0.224683 0.261798 0.775026 0.056146 -0.706903 0.215642
  -0.000000 0.017499 0.000000 0.688293 -0.196327 -0.202150
  -0.000000 0.145787 -0.000002 0.144537 -0.026901 0.197664
  0.000000 0.112094 -0.000001 -0.068630 -0.067766 0.234111
  0.000000 0.111594 -0.000000 0.028603 -0.046607 0.223502
  0.365934 0.793584 0.683418 0.046999 0.705543 -0.046999
  0.000000 0.011232 -0.000000 0.110789 0.814582 0.539599
  -0.000000 0.112704 -0.000001 0.319794 -0.081701 0.407313
  0.360328 0.777492 0.684141 0.046999 0.705543 -0.046999
  -0.000000 0.010076 -0.000000 -0.099297 0.457444 0.813064
  0.000001 0.108887 0.000001 -0.431279 0.352682 0.307499
  -0.136626 0.803880 0.692455 0.046999 0.705543 -0.046999
  0.000000 0.011231 -0.000000 0.006930 0.770108 0.615046
  -0.000000 0.131865 -0.000001 0.178507 -0.093089 0.409781
  -0.136810 0.780375 0.690931 0.046999 0.705543 -0.046999
  0.000000 0.010077 0.000000 0.073124 0.630062 0.752002
  0.000000 0.128464 0.000002 -0.199628 -0.081432 0.370268
  -0.002270 0.808679 0.000121 0.052443 -0.003808 -0.000815
  -0.014833 1.825301 -0.071422 0.467192 -0.533469 -0.463268
  0.000000 1.493901 -0.000000 0.152165 0.644298 -0.676409
  -0.000001 2.103017 0.000000 -0.823497 0.029439 0.399790
  0.000000 1.823368 -0.000000 0.239493 0.488202 -0.204589
  0.288929 0.945606 -0.016979 -0.051764 -0.682659 -0.029448
  -0.000000 0.310931 -0.000001 0.000222 -0.001466 -0.002345
  -0.000000 0.255058 -0.000002 -0.029980 -0.071883 -0.099392
  0.182660 0.102358 0.122067 -0.147690 0.530592 0.238987
  -0.000001 0.450618 0.000001 -0.221524 -0.001973 -0.022359
  0.000000 0.295730 -0.000000 0.099328 0.155964 -0.150765
  0.586579 1.443575 0.291630 0.494772 0.504178 0.517254
  0.081679 0.956433 -0.018380 -0.233353 -0.644816 -0.351027
  -0.000000 0.323706 -0.000001 0.060407 -0.029304 -0.532583
  0.000000 0.229678 0.000000 0.030164 0.093494 -0.398548
  -0.151891 0.951490 -0.015788 -0.308135 -0.644007 -0.377249
  0.000000 0.298947 0.000001 0.096415 -0.030547 -0.429454
  0.000000 0.222754 0.000002 0.006229 0.070200 -0.361893
  -0.332549 0.872253 0.059175 -0.391482 -0.056775 -0.073556
  0.000001 0.247822 0.000000 -0.418330 0.003180 -0.041906
  0.000000 0.155400 0.000000 -0.503283 -0.045769 -0.035943
  0.531378 1.351308 -0.004341 0.015894 0.004094 0.999865
  0.002183 1.423119 -0.451181 0.675237 0.001866 -0.002772
  0.014634 1.825495 -0.071451 0.349543 0.582230 0.568777
  0.000000 1.493901 -0.000002 0.396411 0.273216 0.447577
  -0.000000 2.103016 0.000000 0.066395 0.482382 0.555686
  0.093227 1.351308 0.523154 0.654642 0.002699 0.755928
  -0.000002 1.823368 0.000000 -0.052994 0.642212 -0.290650
  0.286577 1.006395 -0.107108 0.024662 0.598348 -0.059098
  -0.000002 0.249957 -0.000001 -0.029472 -0.012157 -0.324328
  -0.000000 0.254364 0.000000 -0.076006 0.172993 -0.419816
  0.120543 0.102358 -0.183667 0.007173 -0.621665 0.355115
  -0.000000 0.445150 -0.000000 0.209809 -0.024500 0.024186
  0.000001 0.302323 0.000000 -0.249921 0.522690 0.319470
  0.073565 1.013166 -0.024134 0.021280 -0.812612 0.006534
  -0.000001 0.266205 0.000000 0.056288 0.004781 0.582578
  0.000000 0.229740 -0.000000 -0.022531 0.184720 0.188381
  -0.127262 1.003841 0.060604 0.076605 -0.797047 0.046931
  0.000001 0.246800 0.000001 -0.008477 -0.002390 0.639297
  -0.000000 0.222126 -0.000000 -0.019089 0.249626 0.025181
  -0.358085 0.893698 0.063869 0.165957 -0.779842 0.118932
  -0.000001 0.221431 0.000001 -0.065145 0.003526 0.301641
  0.000000 0.154458 -0.000000 0.132134 0.263750 0.315135
  -0.810392 0.550812 -0.372493 -0.966787 0.112025 -0.084120
  -0.000000 3.626384 -0.000000 -0.371112 0.002308 0.012392
  0.782400 0.551418 -0.372917 -0.932548 -0.100033 0.051836
  0.000000 3.626384 0.000001 -0.306047 -0.017263 -0.009595
  -1.406109 0.838118 1.299208 -0.369178 0.203943 -0.901430
  -0.090614 0.138320 1.006144 0.752092 0.018236 0.046746
  -0.090614 0.138320 1.006144 -0.852404 0.078746 -0.052999
  2.241435 0.812477 -1.543512 0.711378 -0.142690 -0.667010
  -0.005721 0.138320 -1.010200 -0.025764 -0.537679 0.842437
  -0.005721 0.138320 -1.010200 -0.753536 -0.000863 0.003278
}

frame 5 {
  -0.000000 0.000000 0.007046 -0.707107 -0.000000 -0.000000
  0.337932 6.437504 -0.106869 -0.075371 -0.540867 0.048998
  0.000000 1.240110 0.000000 0.036919 0.001571 -0.040506
  0.000000 1.426179 -0.000000 -0.172460 -0.008620 0.036760
  0.000000 1.821085 -0.000000 -0.054784 -0.194602 -0.059518
  0.000000 0.808122 0.000000 0.001844 -0.515148 -0.857099
  -0.044038 0.766802 0.025767 0.063162 0.013467 0.044102
  -0.003137 0.224358 0.163703 -0.582226 0.395844 0.586146
  -0.259542 0.557511 -0.217253 0.910514 -0.396598 0.081797
  -0.000000 0.017501 0.000000 0.758859 -0.171454 -0.221262
  0.000000 0.135389 -0.000001 0.086158 -0.078612 0.221477
  0.000000 0.113741 0.000001 -0.170364 -0.044885 0.171594
  0.000000 0.113741 0.000001 -0.023217 -0.013409 0.230962
  0.262165 0.811895 0.662538 0.052425 0.838744 0.540051
  -0.244069 0.811857 0.663659 0.065189 0.837423 0.539647
  0.224683 0.261800 0.775027 0.051566 -0.707252 0.211289
  -0.000000 0.017499 -0.000000 0.686055 -0.196702 -0.201127
  0.000000 0.145787 0.000001 0.146617 -0.025840 0.195865
  -0.000000 0.112094 -0.000000 -0.065086 -0.067880 0.234447
  0.000000 0.111594 0.000001 0.030764 -0.048192 0.223307
  0.365934 0.793586 0.683418 0.046999 0.705543 -0.046999
  -0.000001 0.011232 -0.000000 0.110790 0.814581 0.539601
  -0.000000 0.112704 0.000002 0.319792 -0.081700 0.407313
  0.360328 0.777496 0.684141 0.046999 0.705543 -0.046999
  -0.000000 0.010075 0.000000 -0.099298 0.457444 0.813065
  -0.000000 0.108887 -0.000001 -0.431281 0.352683 0.307497
  -0.136625 0.803882 0.692455 0.046999 0.705543 -0.046999
  -0.000000 0.011231 -0.000000 0.010848 0.771171 0.614988
  -0.000000 0.131865 0.000001 0.183374 -0.093841 0.407630
  -0.136810 0.780378 0.690930 0.046999 0.705543 -0.046999
  -0.000000 0.010075 -0.000000 0.078308 0.631283 0.751481
  0.000000 0.128464 0.000001 -0.194983 -0.082588 0.372736
  -0.002305 0.808516 -0.000197 0.058182 -0.005716 -0.000563
  -0.014832 1.825302 -0.071422 0.467192 -0.533469 -0.463268
  -0.000000 1.493901 0.000001 0.168162 0.677729 -0.650845
  -0.000000 2.103017 -0.000000 -0.821691 0.029772 0.398913
  0.000000 1.823368 0.000001 0.237468 0.485358 -0.174656
  0.288925 0.945606 -0.016979 -0.051774 -0.682662 -0.029430
  0.000001 0.310931 0.000002 0.000222 -0.001467 -0.002344
  0.000000 0.255058 0.000000 -0.029959 -0.071882 -0.099398
  0.182655 0.102359 0.122067 -0.147678 0.530589 0.238995
  0.000000 0.450619 0.000001 -0.221512 -0.001973 -0.022358
  -0.000000 0.295730 -0.000000 0.099302 0.155967 -0.150762
  0.586576 1.443575 0.291630 0.494772 0.504178 0.517254
  0.081674 0.956433 -0.018380 -0.233358 -0.644826 -0.351004
  0.000000 0.323706 0.000002 0.060398 -0.029305 -0.532605
  0.000001 0.229678 0.000001 0.030172 0.093466 -0.398539
  -0.151896 0.951491 -0.015787 -0.308141 -0.644020 -0.377222
  0.000000 0.298947 0.000001 0.096409 -0.030549 -0.429482
  0.000000 0.222753 -0.000000 0.006240 0.070172 -0.361882
  -0.332554 0.872254 0.059175 -0.391466 -0.056785 -0.073534
  -0.000003 0.247823 0.000000 -0.418360 0.003179 -0.041886
  -0.000001 0.155400 0.000000 -0.503269 -0.045810 -0.035960
  0.531378 1.351308 -0.004340 0.015881 0.004093 0.999865
  0.002183 1.423120 -0.451181 0.675237 0.001866 -0.002772
  0.014634 1.825497 -0.071452 0.349543 0.582230 0.568777
  0.000000 1.493901 0.000002 0.403810 0.219750 0.440459
  0.000000 2.103016 0.000001 0.066033 0.483578 0.552654
  0.093227 1.351308 0.523154 0.654643 0.002704 0.755927
  -0.000000 1.823368 0.000001 -0.024192 0.667658 -0.256233
  0.286576 1.006395 -0.107108 0.024671 0.598348 -0.059112
  -0.000001 0.249956 0.000001 -0.029467 -0.012157 -0.324280
  -0.000001 0.254364 -0.000000 -0.076016 0.172995 -0.419843
  0.120542 0.102358 -0.183668 0.007194 -0.621675 0.355097
  -0.000001 0.445151 0.000001 0.209739 -0.024501 0.024177
  -0.000000 0.302323 0.000000 -0.249885 0.522705 0.319453
  0.073564 1.013167 -0.024133 0.021282 -0.812612 0.006535
  0.000001 0.266205 0.000000 0.056286 0.004781 0.582560
  -0.000000 0.229740 0.000000 -0.022525 0.184723 0.188398
  -0.127263 1.003841 0.060604 0.076600 -0.797047 0.046929
  -0.000002 0.246800 0.000001 -0.008481 -0.002390 0.639286
  0.000000 0.222126 0.000001 -0.019081 0.249631 0.025196
  -0.358086 0.893698 0.063868 0.165967 -0.779838 0.118947
  0.000001 0.221431 0.000000 -0.065136 0.003526 0.301582
  0.000000 0.154458 0.000000 0.132141 0.263747 0.315174
  -0.810392 0.550812 -0.372493 -0.966787 0.112025 -0.084120
  -0.000000 3.626384 -0.000000 -0.371112 0.002308 0.012392
  0.782400 0.551418 -0.372917 -0.932548 -0.100033 0.051836
  0.000000 3.626384 0.000001 -0.306047 -0.017263 -0.009595
  -1.406109 0.838118 1.299208 -0.369178 0.203943 -0.901430
  -0.090614 0.138320 1.006144 0.752092 0.018236 0.046746
  -0.090614 0.138320 1.006144 -0.852404 0.078746 -0.052999
  2.241435 0.812477 -1.543512 0.711378 -0.142690 -0.667010
  -0.005721 0.138320 -1.010200 -0.025764 -0.537679 0.842437
  -0.005721 0.138320 -1.010200 -0.753536 -0.000863 0.003278
}

frame 6 {
  -0.000000 0.000000 0.007046 -0.707107 -0.000000 -0.000000
  0.337932 6.437504 -0.106869 -0.075371 -0.540867 0.048998
  0.000000 1.240110 0.000000 0.031904 0.002096 -0.038255
  0.000000 1.426178 -0.000000 -0.168536 -0.009288 0.035102
  -0.000000 1.821083 0.000000 -0.053283 -0.194995 -0.059751
  0.000000 0.808121 0.000000 0.001844 -0.515148 -0.857099
  -0.044003 0.766964 0.026086 0.068982 0.011818 0.044234
  -0.003138 0.224356 0.163703 -0.582226 0.395844 0.586146
  -0.259542 0.557510 -0.217253 0.907926 -0.402487 0.081253
  -0.000000 0.017501 0.000000 0.756722 -0.172594 -0.221187
  0.000000 0.135389 0.000001 0.088939 -0.077089 0.219919
  -0.000000 0.113742 -0.000001 -0.168269 -0.045636 0.173762
  0.000000 0.113742 0.000000 -0.020529 -0.014778 0.231193
  0.262165 0.811894 0.662537 0.051328 0.835246 0.545630
  -0.244069 0.811855 0.663658 0.064098 0.833960 0.545212
  0.224683 0.261799 0.775026 0.046984 -0.707571 0.206928
  -0.000000 0.017499 -0.000000 0.683819 -0.197045 -0.200079
  0.000000 0.145787 0.000000 0.148682 -0.024789 0.194039
  -0.000000 0.112094 0.000001 -0.061538 -0.067980 0.234738
  -0.000000 0.111594 0.000001 0.032923 -0.049769 0.223089
  0.365934 0.793584 0.683418 0.046999 0.705543 -0.046999
  0.000000 0.011230 0.000000 0.110788 0.814584 0.539596
  0.000000 0.112704 0.000001 0.319800 -0.081704 0.407314
  0.360328 0.777493 0.684141 0.046999 0.705543 -0.046999
  -0.000000 0.010076 -0.000000 -0.099297 0.457443 0.813065
  0.000000 0.108887 0.000000 -0.431280 0.352683 0.307497
  -0.136626 0.803882 0.692454 0.046999 0.705543 -0.046999
  0.000000 0.011232 -0.000000 0.014762 0.772202 0.614906
  0.000000 0.131865 0.000000 0.188230 -0.094556 0.405408
  -0.136810 0.780377 0.690930 0.046999 0.705543 -0.046999
  -0.000000 0.010075 -0.000000 0.083471 0.632474 0.750922
  0.000000 0.128465 0.000001 -0.190306 -0.083723 0.375144
  -0.002340 0.808352 -0.000516 0.063919 -0.007623 -0.000310
  -0.014833 1.825301 -0.071422 0.467192 -0.533469 -0.463268
  0.000001 1.493901 0.000000 0.184896 0.705906 -0.626956
  0.000000 2.103015 -0.000001 -0.818081 0.030422 0.397161
  -0.000000 1.823368 0.000000 0.231472 0.483841 -0.144647
  0.288929 0.945606 -0.016980 -0.051788 -0.682663 -0.029415
  -0.000000 0.310931 -0.000000 0.000222 -0.001468 -0.002344
  0.000000 0.255058 0.000001 -0.029938 -0.071881 -0.099399
  0.182658 0.102358 0.122067 -0.147697 0.530597 0.238975
  0.000000 0.450618 -0.000002 -0.221401 -0.001972 -0.022346
  0.000000 0.295730 -0.000001 0.099218 0.155981 -0.150754
  0.586578 1.443574 0.291630 0.494772 0.504178 0.517254
  0.081677 0.956432 -0.018380 -0.233368 -0.644838 -0.350979
  0.000000 0.323706 0.000000 0.060383 -0.029309 -0.532600
  0.000000 0.229678 -0.000001 0.030184 0.093430 -0.398560
  -0.151892 0.951490 -0.015788 -0.308149 -0.644032 -0.377199
  -0.000000 0.298947 -0.000001 0.096396 -0.030551 -0.429474
  -0.000000 0.222754 0.000002 0.006258 0.070141 -0.361905
  -0.332550 0.872253 0.059175 -0.391466 -0.056797 -0.073509
  0.000001 0.247822 0.000000 -0.418317 0.003177 -0.041857
  -0.000001 0.155400 -0.000000 -0.503310 -0.045858 -0.035988
  0.531378 1.351308 -0.004340 0.015918 0.004076 0.999865
  0.002183 1.423119 -0.451181 0.675237 0.001866 -0.002772
  0.014634 1.825496 -0.071451 0.349543 0.582230 0.568777
  -0.000001 1.493901 0.000001 0.400430 0.161645 0.439068
  0.000000 2.103018 -0.000002 0.064602 0.488210 0.540674
  0.093229 1.351308 0.523154 0.654641 0.002690 0.755929
  0.000000 1.823368 0.000000 0.011356 0.696702 -0.214577
  0.286576 1.006395 -0.107107 0.024713 0.598347 -0.059175
  0.000001 0.249957 0.000000 -0.029446 -0.012158 -0.324113
  0.000000 0.254364 -0.000000 -0.076051 0.173002 -0.419933
  0.120542 0.102359 -0.183665 0.007256 -0.621708 0.355042
  0.000000 0.445150 0.000001 0.209513 -0.024502 0.024141
  -0.000000 0.302324 -0.000000 -0.249755 0.522762 0.319405
  0.073565 1.013167 -0.024131 0.021292 -0.812610 0.006546
  -0.000001 0.266205 -0.000001 0.056271 0.004782 0.582492
  -0.000000 0.229740 -0.000000 -0.022493 0.184741 0.188463
  -0.127264 1.003841 0.060605 0.076599 -0.797044 0.046933
  0.000000 0.246799 -0.000000 -0.008494 -0.002390 0.639237
  0.000000 0.222127 -0.000000 -0.019051 0.249651 0.025255
  -0.358086 0.893699 0.063870 0.166013 -0.779820 0.119016
  -0.000001 0.221431 0.000001 -0.065098 0.003527 0.301337
  0.000000 0.154458 0.000000 0.132176 0.263734 0.315339
  -0.810392 0.550812 -0.372493 -0.966787 0.112025 -0.084120
  -0.000000 3.626384 -0.000000 -0.371112 0.002308 0.012392
  0.782400 0.551418 -0.372917 -0.932548 -0.100033 0.051836
  0.000000 3.626384 0.000001 -0.306047 -0.017263 -0.009595
  -1.406109 0.838118 1.299208 -0.369178 0.203943 -0.901430
  -0.090614 0.138320 1.006144 0.752092 0.018236 0.046746
  -0.090614 0.138320 1.006144 -0.852404 0.078746 -0.052999
  2.241435 0.812477 -1.543512 0.711378 -0.142690 -0.667010
  -0.005721 0.138320 -1.010200 -0.025764 -0.537679 0.842437
  -0.005721 0.138320 -1.010200 -0.753536 -0.000863 0.003278
}

frame 7 {
  -0.000000 0.000000 0.007046 -0.707107 -0.000000 -0.000000
  0.337932 6.437504 -0.106869 -0.075371 -0.540867 0.048998
  0.000000 1.240110 0.000000 0.027477 0.002559 -0.036267
  0.000000 1.426177 0.000000 -0.165070 -0.009877 0.033637
  0.000000 1.821085 0.000000 -0.051959 -0.195342 -0.059956
  0.000000 0.808120 0.000000 0.001844 -0.515148 -0.857099
  -0.043972 0.767108 0.026367 0.074117 0.010361 0.044349
  -0.003138 0.224356 0.163703 -0.582226 0.395844 0.586146
  -0.259542 0.557511 -0.217254 0.905610 -0.407671 0.080772
  -0.000000 0.017501 0.000000 0.754831 -0.173584 -0.221090
  0.000000 0.135389 0.000000 0.091376 -0.075739 0.218516
  0.000000 0.113741 0.000001 -0.166394 -0.046292 0.175651
  -0.000000 0.113741 -0.000000 -0.018156 -0.015988 0.231373
  0.262165 0.811893 0.662536 0.050356 0.832130 0.550530
  -0.244069 0.811854 0.663658 0.063132 0.830875 0.550098
  0.224683 0.261799 0.775026 0.042938 -0.707828 0.203071
  -0.000000 0.017499 -0.000000 0.681843 -0.197322 -0.199131
  0.000000 0.145787 -0.000000 0.150492 -0.023869 0.192404
  -0.000000 0.112094 0.000000 -0.058398 -0.068056 0.234960
  0.000000 0.111594 -0.000001 0.034831 -0.051155 0.222874
  0.365935 0.793584 0.683418 0.046999 0.705543 -0.046999
  0.000000 0.011230 -0.000000 0.110789 0.814580 0.539602
  -0.000000 0.112704 0.000000 0.319790 -0.081698 0.407313
  0.360328 0.777492 0.684140 0.046999 0.705543 -0.046999
  -0.000000 0.010076 0.000000 -0.099298 0.457443 0.813066
  -0.000001 0.108887 0.000000 -0.431285 0.352683 0.307497
  -0.136625 0.803881 0.692455 0.046999 0.705543 -0.046999
  -0.000000 0.011232 -0.000000 0.018219 0.773086 0.614812
  0.000000 0.131865 -0.000001 0.192505 -0.095154 0.403398
  -0.136810 0.780376 0.690930 0.046999 0.705543 -0.046999
  -0.000000 0.010074 0.000000 0.088013 0.633495 0.750403
  -0.000000 0.128464 -0.000000 -0.186165 -0.084710 0.377217
  -0.002371 0.808207 -0.000798 0.068981 -0.009306 -0.000086
  -0.014832 1.825302 -0.071422 0.467192 -0.533469 -0.463268
  0.000000 1.493902 -0.000002 0.200037 0.726411 -0.607620
  0.000001 2.103014 -0.000002 -0.813377 0.031245 0.394877
  0.000000 1.823368 -0.000000 0.223294 0.483241 -0.118828
  0.288927 0.945606 -0.016979 -0.051802 -0.682665 -0.029403
  -0.000000 0.310931 -0.000001 0.000221 -0.001469 -0.002343
  0.000000 0.255058 -0.000000 -0.029919 -0.071881 -0.099397
  0.182658 0.102358 0.122067 -0.147733 0.530610 0.238940
  -0.000000 0.450618 -0.000000 -0.221237 -0.001971 -0.022327
  0.000000 0.295730 0.000000 0.099103 0.156001 -0.150745
  0.586579 1.443574 0.291630 0.494772 0.504178 0.517254
  0.081677 0.956432 -0.018380 -0.233375 -0.644849 -0.350958
  0.000000 0.323706 -0.000001 0.060370 -0.029313 -0.532574
  0.000000 0.229678 0.000000 0.030196 0.093401 -0.398602
  -0.151891 0.951490 -0.015787 -0.308154 -0.644041 -0.377181
  0.000000 0.298947 -0.000000 0.096381 -0.030554 -0.429442
  0.000000 0.222753 0.000001 0.006277 0.070117 -0.361949
  -0.332551 0.872253 0.059175 -0.391470 -0.056809 -0.073487
  -0.000001 0.247824 -0.000000 -0.418239 0.003176 -0.041826
  0.000001 0.155400 0.000000 -0.503379 -0.045901 -0.036019
  0.531378 1.351308 -0.004341 0.015889 0.004082 0.999865
  0.002183 1.423121 -0.451181 0.675237 0.001866 -0.002772
  0.014634 1.825497 -0.071451 0.349543 0.582230 0.568777
  -0.000000 1.493901 0.000001 0.387075 0.106008 0.444163
  0.000000 2.103016 -0.000000 0.062366 0.495157 0.521965
  0.093227 1.351308 0.523154 0.654643 0.002690 0.755927
  -0.000001 1.823368 0.000000 0.048231 0.725369 -0.171118
  0.286576 1.006395 -0.107108 0.024630 0.598348 -0.059048
  -0.000001 0.249956 0.000001 -0.029488 -0.012157 -0.324483
  0.000000 0.254364 0.000000 -0.075974 0.172992 -0.419717
  0.120542 0.102358 -0.183667 0.007138 -0.621642 0.355158
  0.000000 0.445150 0.000000 0.209968 -0.024499 0.024220
  -0.000000 0.302324 0.000000 -0.250029 0.522645 0.319488
  0.073565 1.013167 -0.024132 0.021281 -0.812614 0.006533
  0.000001 0.266204 -0.000000 0.056299 0.004780 0.582637
  0.000000 0.229739 -0.000000 -0.022561 0.184708 0.188305
  -0.127263 1.003841 0.060605 0.076623 -0.797047 0.046941
  -0.000001 0.246800 -0.000000 -0.008466 -0.002391 0.639331
  -0.000000 0.222127 -0.000000 -0.019118 0.249610 0.025112
  -0.358085 0.893699 0.063868 0.165950 -0.779848 0.118907
  0.000000 0.221430 -0.000000 -0.065159 0.003525 0.301777
  0.000000 0.154457 0.000000 0.132104 0.263754 0.315015
  -0.810392 0.550812 -0.372493 -0.966787 0.112025 -0.084120
  -0.000000 3.626384 -0.000000 -0.371112 0.002308 0.012392
  0.782400 0.551418 -0.372917 -0.932548 -0.100033 0.051836
  0.000000 3.626384 0.000001 -0.306047 -0.017263 -0.009595
  -1.406109 0.838118 1.299208 -0.369178 0.203943 -0.901430
  -0.090614 0.138320 1.006144 0.752092 0.018236 0.046746
  -0.090614 0.138320 1.006144 -0.852404 0.078746 -0.052999
  2.241435 0.812477 -1.543512 0.711378 -0.142690 -0.667010
  -0.005721 0.138320 -1.010200 -0.025764 -0.537679 0.842437
  -0.005721 0.138320 -1.010200 -0.753536 -0.000863 0.003278
}

frame 8 {
  -0.000000 0.000000 0.007046 -0.707107 -0.000000 -0.000000
  0.337932 6.437504 -0.106869 -0.075371 -0.540867 0.048998
  0.000000 1.240110 0.000000 0.024093 0.002914 -0.034747
  0.000000 1.426177 0.000000 -0.162418 -0.010328 0.032517
  0.000000 1.821084 0.000000 -0.050946 -0.195607 -0.060113
  -0.000000 0.808120 0.000000 0.001844 -0.515148 -0.857099
  -0.043948 0.767218 0.026582 0.078041 0.009248 0.044436
  -0.003138 0.224357 0.163703 -0.582226 0.395844 0.586146
  -0.259542 0.557510 -0.217254 0.903820 -0.411626 0.080401
  -0.000000 0.017501 0.000000 0.753386 -0.174329 -0.220998
  -0.000000 0.135389 0.000002 0.093222 -0.074705 0.217426
  -0.000000 0.113741 0.000001 -0.164947 -0.046787 0.177083
  -0.000000 0.113741 0.000000 -0.016334 -0.016913 0.231495
  0.262165 0.811895 0.662537 0.049616 0.829729 0.554258
  -0.244069 0.811857 0.663658 0.062396 0.828499 0.553818
  0.224683 0.261800 0.775026 0.039844 -0.708009 0.200117
  -0.000000 0.017499 -0.000000 0.680336 -0.197517 -0.198394
  0.000000 0.145787 0.000000 0.151859 -0.023171 0.191140
  0.000000 0.112094 0.000000 -0.055987 -0.068106 0.235104
  -0.000000 0.111594 0.000001 0.036285 -0.052210 0.222698
  0.365934 0.793584 0.683419 0.046999 0.705543 -0.046999
  -0.000000 0.011231 -0.000000 0.110788 0.814582 0.539599
  -0.000001 0.112704 0.000001 0.319795 -0.081701 0.407313
  0.360328 0.777494 0.684141 0.046999 0.705543 -0.046999
  -0.000000 0.010075 0.000000 -0.099298 0.457444 0.813065
  0.000000 0.108887 -0.000000 -0.431280 0.352683 0.307497
  -0.136626 0.803882 0.692455 0.046999 0.705543 -0.046999
  -0.000000 0.011230 -0.000000 0.020862 0.773743 0.614730
  0.000000 0.131865 0.000002 0.195766 -0.095592 0.401824
  -0.136810 0.780377 0.690930 0.046999 0.705543 -0.046999
  -0.000000 0.010075 0.000000 0.091475 0.634259 0.749988
  -0.000000 0.128465 0.000000 -0.182989 -0.085452 0.378770
  -0.002395 0.808097 -0.001013 0.072850 -0.010592 0.000084
  -0.014832 1.825302 -0.071422 0.467192 -0.533469 -0.463268
  0.000000 1.493901 -0.000000 0.211681 0.739451 -0.594081
  -0.000000 2.103015 -0.000001 -0.808805 0.032019 0.392657
  0.000001 1.823368 0.000001 0.215504 0.483073 -0.099810
  0.288927 0.945606 -0.016980 -0.051814 -0.682666 -0.029395
  -0.000000 0.310930 0.000000 0.000221 -0.001470 -0.002343
  0.000000 0.255058 0.000001 -0.029904 -0.071880 -0.099395
  0.182658 0.102358 0.122067 -0.147773 0.530625 0.238902
  0.000000 0.450618 -0.000001 -0.221066 -0.001970 -0.022309
  -0.000001 0.295730 -0.000000 0.098986 0.156021 -0.150736
  0.586577 1.443575 0.291630 0.494772 0.504178 0.517254
  0.081678 0.956432 -0.018380 -0.233382 -0.644859 -0.350939
  0.000000 0.323706 -0.000000 0.060357 -0.029317 -0.532542
  -0.000000 0.229678 -0.000001 0.030208 0.093374 -0.398648
  -0.151891 0.951490 -0.015788 -0.308160 -0.644050 -0.377164
  -0.000000 0.298947 -0.000001 0.096363 -0.030556 -0.429406
  -0.000000 0.222753 -0.000001 0.006297 0.070090 -0.361997
  -0.332549 0.872253 0.059175 -0.391479 -0.056819 -0.073470
  -0.000000 0.247823 -0.000001 -0.418143 0.003175 -0.041799
  0.000000 0.155400 0.000000 -0.503459 -0.045935 -0.036047
  0.531379 1.351308 -0.004340 0.015886 0.004104 0.999865
  0.002183 1.423120 -0.451180 0.675237 0.001866 -0.002772
  0.014634 1.825496 -0.071451 0.349543 0.582230 0.568777
  0.000001 1.493901 0.000000 0.369716 0.060613 0.452908
  -0.000000 2.103016 0.000000 0.059980 0.502203 0.501995
  0.093227 1.351308 0.523155 0.654640 0.002695 0.755929
  -0.000001 1.823368 0.000000 0.079668 0.748852 -0.133581
  0.286577 1.006395 -0.107107 0.024668 0.598348 -0.059105
  -0.000000 0.249956 0.000000 -0.029470 -0.012157 -0.324320
  0.000000 0.254363 0.000000 -0.076006 0.172997 -0.419807
  0.120542 0.102358 -0.183668 0.007196 -0.621673 0.355106
  0.000000 0.445150 0.000000 0.209759 -0.024501 0.024188
  0.000000 0.302323 -0.000000 -0.249912 0.522695 0.319443
  0.073565 1.013166 -0.024132 0.021291 -0.812612 0.006542
  -0.000001 0.266205 0.000000 0.056286 0.004781 0.582569
  -0.000000 0.229739 0.000000 -0.022533 0.184723 0.188370
  -0.127263 1.003840 0.060604 0.076620 -0.797045 0.046943
  0.000001 0.246800 -0.000000 -0.008480 -0.002390 0.639281
  0.000000 0.222126 0.000000 -0.019088 0.249628 0.025172
  -0.358086 0.893698 0.063868 0.165976 -0.779836 0.118953
  -0.000000 0.221431 -0.000001 -0.065135 0.003526 0.301600
  0.000001 0.154458 0.000000 0.132133 0.263747 0.315141
  -0.810392 0.550812 -0.372493 -0.966787 0.112025 -0.084120
  -0.000000 3.626384 -0.000000 -0.371112 0.002308 0.012392
  0.782400 0.551418 -0.372917 -0.932548 -0.100033 0.051836
  0.000000 3.626384 0.000001 -0.306047 -0.017263 -0.009595
  -1.406109 0.838118 1.299208 -0.369178 0.203943 -0.901430
  -0.090614 0.138320 1.006144 0.752092 0.018236 0.046746
  -0.090614 0.138320 1.006144 -0.852404 0.078746 -0.052999
  2.241435 0.812477 -1.543512 0.711378 -0.142690 -0.667010
  -0.005721 0.138320 -1.010200 -0.025764 -0.537679 0.842437
  -0.005721 0.138320 -1.010200 -0.753536 -0.000863 0.003278
}

frame 9 {
  -0.000000 0.000000 0.007046 -0.707107 -0.000000 -0.000000
  0.337932 6.437504 -0.106869 -0.075371 -0.540867 0.048998
  0.000000 1.240110 0.000000 0.022011 0.003132 -0.033812
  0.000000 1.426178 -0.000000 -0.160787 -0.010605 0.031829
  0.000000 1.821082 0.000000 -0.050323 -0.195770 -0.060209
  0.000000 0.808123 0.000000 0.001844 -0.515148 -0.857099
  -0.043933 0.767288 0.026714 0.080454 0.008563 0.044489
  -0.003138 0.224356 0.163703 -0.582226 0.395844 0.586146
  -0.259541 0.557511 -0.217253 0.902710 -0.414054 0.080173
  -0.000000 0.017501 0.000000 0.752491 -0.174784 -0.220932
  0.000000 0.135389 0.000000 0.094361 -0.074067 0.216748
  0.000000 0.113741 -0.000001 -0.164055 -0.047089 0.177960
  -0.000000 0.113741 -0.000000 -0.015210 -0.017481 0.231561
  0.262165 0.811893 0.662538 0.049157 0.828246 0.556545
  -0.244069 0.811856 0.663659 0.061941 0.827030 0.556099
  0.224683 0.261799 0.775027 0.037940 -0.708114 0.198299
  -0.000000 0.017499 -0.000000 0.679407 -0.197628 -0.197933
  0.000000 0.145787 -0.000000 0.152704 -0.022744 0.190355
  -0.000000 0.112094 -0.000001 -0.054515 -0.068132 0.235183
  0.000000 0.111594 0.000001 0.037190 -0.052857 0.222585
  0.365934 0.793585 0.683419 0.046999 0.705543 -0.046999
  0.000000 0.011231 0.000000 0.110789 0.814582 0.539599
  -0.000000 0.112704 -0.000000 0.319796 -0.081702 0.407313
  0.360328 0.777493 0.684141 0.046999 0.705543 -0.046999
  -0.000000 0.010075 -0.000000 -0.099298 0.457445 0.813064
  0.000000 0.108887 -0.000001 -0.431281 0.352682 0.307497
  -0.136625 0.803881 0.692455 0.046999 0.705543 -0.046999
  -0.000000 0.011231 0.000000 0.022485 0.774143 0.614670
  -0.000000 0.131865 -0.000000 0.197773 -0.095850 0.400842
  -0.136810 0.780377 0.690931 0.046999 0.705543 -0.046999
  -0.000000 0.010075 0.000000 0.093598 0.634720 0.749726
  -0.000000 0.128464 0.000000 -0.181030 -0.085904 0.379708
  -0.002409 0.808032 -0.001145 0.075229 -0.011383 0.000189
  -0.014832 1.825300 -0.071421 0.467192 -0.533469 -0.463268
  0.000000 1.493901 0.000002 0.218854 0.746386 -0.586328
  0.000000 2.103015 -0.000001 -0.805563 0.032555 0.391083
  0.000000 1.823368 0.000000 0.210118 0.483069 -0.088503
  0.288926 0.945606 -0.016979 -0.051822 -0.682667 -0.029390
  -0.000000 0.310930 0.000002 0.000221 -0.001470 -0.002343
  0.000000 0.255058 -0.000000 -0.029896 -0.071880 -0.099392
  0.182656 0.102358 0.122067 -0.147802 0.530635 0.238875
  0.000000 0.450618 0.000000 -0.220944 -0.001969 -0.022295
  0.000000 0.295730 0.000000 0.098902 0.156035 -0.150729
  0.586575 1.443575 0.291631 0.494772 0.504178 0.517254
  0.081675 0.956433 -0.018380 -0.233384 -0.644866 -0.350927
  -0.000000 0.323707 0.000000 0.060349 -0.029320 -0.532518
  0.000000 0.229678 -0.000001 0.030215 0.093358 -0.398681
  -0.151894 0.951490 -0.015787 -0.308163 -0.644055 -0.377154
  -0.000000 0.298947 -0.000002 0.096352 -0.030558 -0.429377
  -0.000000 0.222753 -0.000001 0.006311 0.070075 -0.362034
  -0.332553 0.872254 0.059175 -0.391486 -0.056825 -0.073458
  0.000000 0.247823 0.000000 -0.418075 0.003175 -0.041781
  0.000000 0.155400 -0.000000 -0.503517 -0.045957 -0.036067
  0.531378 1.351308 -0.004340 0.015894 0.004086 0.999865
  0.002183 1.423119 -0.451180 0.675237 0.001866 -0.002772
  0.014634 1.825495 -0.071450 0.349543 0.582230 0.568777
  0.000000 1.493901 0.000000 0.355890 0.031577 0.460644
  -0.000000 2.103014 0.000000 0.058183 0.507265 0.486958
  0.093227 1.351308 0.523154 0.654643 0.002695 0.755927
  0.000001 1.823368 -0.000000 0.100340 0.763688 -0.108807
  0.286576 1.006395 -0.107108 0.024699 0.598347 -0.059154
  -0.000001 0.249956 -0.000000 -0.029454 -0.012157 -0.324184
  0.000000 0.254363 0.000000 -0.076034 0.173001 -0.419884
  0.120542 0.102358 -0.183667 0.007243 -0.621698 0.355062
  0.000000 0.445151 -0.000001 0.209586 -0.024502 0.024160
  -0.000001 0.302324 0.000000 -0.249812 0.522738 0.319409
  0.073565 1.013166 -0.024133 0.021297 -0.812610 0.006548
  0.000000 0.266205 0.000001 0.056275 0.004782 0.582517
  -0.000000 0.229740 0.000001 -0.022508 0.184735 0.188425
  -0.127262 1.003840 0.060604 0.076612 -0.797044 0.046940
  0.000000 0.246800 -0.000000 -0.008487 -0.002390 0.639248
  -0.000000 0.222126 0.000000 -0.019067 0.249641 0.025223
  -0.358085 0.893698 0.063868 0.166016 -0.779821 0.119011
  -0.000001 0.221430 0.000001 -0.065100 0.003526 0.301384
  -0.000000 0.154457 0.000000 0.132160 0.263731 0.315292
  -0.810392 0.550812 -0.372493 -0.966787 0.112025 -0.084120
  -0.000000 3.626384 -0.000000 -0.371112 0.002308 0.012392
  0.782400 0.551418 -0.372917 -0.932548 -0.100033 0.051836
  0.000000 3.626384 0.000001 -0.306047 -0.017263 -0.009595
  -1.406109 0.838118 1.299208 -0.369178 0.203943 -0.901430
  -0.090614 0.138320 1.006144 0.752092 0.018236 0.046746
  -0.090614 0.138320 1.006144 -0.852404 0.078746 -0.052999
  2.241435 0.812477 -1.543512 0.711378 -0.142690 -0.667010
  -0.005721 0.138320 -1.010200 -0.025764 -0.537679 0.842437
  -0.005721 0.138320 -1.010200 -0.753536 -0.000863 0.003278
}

frame 10 {
  -0.000000 0.000000 0.007046 -0.707107 -0.000000 -0.000000
  0.337932 6.437504 -0.106869 -0.075371 -0.540867 0.048998
  0.000000 1.240110 0.000000 0.021319 0.003204 -0.033501
  0.000000 1.426178 -0.000000 -0.160245 -0.010697 0.031600
  0.000000 1.821084 0.000000 -0.050116 -0.195824 -0.060241
  0.000000 0.808121 0.000000 0.001844 -0.515148 -0.857099
  -0.043929 0.767308 0.026758 0.081255 0.008335 0.044507
  -0.003137 0.224358 0.163702 -0.582226 0.395844 0.586146
  -0.259542 0.557511 -0.217253 0.902340 -0.414860 0.080097
  -0.000000 0.017501 0.000000 0.752196 -0.174934 -0.220909
  0.000000 0.135389 -0.000001 0.094735 -0.073856 0.216522
  0.000000 0.113742 -0.000001 -0.163758 -0.047189 0.178249
  0.000000 0.113741 0.000000 -0.014834 -0.017670 0.231581
  0.262165 0.811895 0.662538 0.049005 0.827752 0.557303
  -0.244068 0.811856 0.663659 0.061790 0.826541 0.556855
  0.224683 0.261799 0.775026 0.037308 -0.708147 0.197695
  -0.000000 0.017499 -0.000000 0.679098 -0.197665 -0.197780
  -0.000000 0.145788 0.000001 0.152982 -0.022603 0.190095
  0.000000 0.112094 -0.000002 -0.054026 -0.068139 0.235208
  0.000000 0.111594 -0.000000 0.037494 -0.053071 0.222546
  0.365935 0.793586 0.683418 0.046999 0.705543 -0.046999
  0.000000 0.011231 0.000000 0.110789 0.814582 0.539600
  0.000000 0.112704 -0.000000 0.319792 -0.081699 0.407314
  0.360328 0.777495 0.684141 0.046999 0.705543 -0.046999
  -0.000000 0.010077 -0.000000 -0.099297 0.457445 0.813063
  0.000000 0.108887 0.000000 -0.431277 0.352681 0.307499
  -0.136625 0.803882 0.692455 0.046999 0.705543 -0.046999
  0.000000 0.011232 -0.000000 0.023026 0.774276 0.614649
  -0.000000 0.131865 -0.000001 0.198437 -0.095934 0.400515
  -0.136810 0.780378 0.690930 0.046999 0.705543 -0.046999
  0.000000 0.010076 -0.000000 0.094304 0.634870 0.749641
  0.000000 0.128465 0.000000 -0.180384 -0.086054 0.380016
  -0.002414 0.808007 -0.001189 0.076019 -0.011646 0.000224
  -0.014832 1.825301 -0.071422 0.467192 -0.533469 -0.463268
  -0.000000 1.493901 0.000001 0.221260 0.748504 -0.583856
  0.000001 2.103017 0.000002 -0.804412 0.032743 0.390524
  -0.000000 1.823368 -0.000001 0.208213 0.483095 -0.084823
  0.288928 0.945606 -0.016980 -0.051825 -0.682667 -0.029389
  0.000001 0.310931 0.000000 0.000221 -0.001470 -0.002343
  -0.000000 0.255058 0.000000 -0.029892 -0.071880 -0.099391
  0.182657 0.102358 0.122067 -0.147809 0.530638 0.238868
  0.000000 0.450618 -0.000002 -0.220911 -0.001969 -0.022291
  0.000000 0.295730 0.000001 0.098879 0.156039 -0.150728
  0.586577 1.443574 0.291630 0.494772 0.504178 0.517254
  0.081678 0.956432 -0.018381 -0.233387 -0.644868 -0.350923
  -0.000000 0.323706 -0.000002 0.060346 -0.029321 -0.532511
  -0.000000 0.229678 -0.000001 0.030218 0.093353 -0.398690
  -0.151892 0.951490 -0.015788 -0.308167 -0.644058 -0.377150
  -0.000000 0.298947 0.000001 0.096347 -0.030559 -0.429368
  -0.000000 0.222754 0.000001 0.006316 0.070066 -0.362043
  -0.332551 0.872253 0.059175 -0.391489 -0.056828 -0.073453
  0.000000 0.247823 -0.000000 -0.418057 0.003174 -0.041773
  -0.000000 0.155400 -0.000000 -0.503531 -0.045969 -0.036074
  0.531379 1.351308 -0.004340 0.015883 0.004094 0.999865
  0.002183 1.423120 -0.451181 0.675237 0.001866 -0.002772
  0.014634 1.825497 -0.071451 0.349543 0.582230 0.568777
  0.000000 1.493901 0.000001 0.350773 0.021764 0.463636
  -0.000000 2.103016 0.000001 0.057526 0.509066 0.481458
  0.093228 1.351308 0.523154 0.654642 0.002695 0.755928
  -0.000000 1.823368 0.000000 0.107422 0.768642 -0.100323
  0.286576 1.006395 -0.107108 0.024709 0.598347 -0.059166
  -0.000002 0.249956 0.000000 -0.029448 -0.012157 -0.324138
  -0.000001 0.254363 -0.000000 -0.076046 0.173003 -0.419914
  0.120541 0.102358 -0.183667 0.007257 -0.621706 0.355046
  0.000000 0.445149 0.000001 0.209525 -0.024502 0.024147
  0.000000 0.302324 0.000000 -0.249771 0.522755 0.319400
  0.073565 1.013166 -0.024131 0.021293 -0.812610 0.006546
  0.000000 0.266204 0.000001 0.056272 0.004782 0.582502
  0.000000 0.229739 0.000000 -0.022498 0.184740 0.188447
  -0.127263 1.003840 0.060605 0.076603 -0.797044 0.046936
  -0.000000 0.246801 -0.000000 -0.008495 -0.002390 0.639240
  0.000000 0.222127 -0.000000 -0.019054 0.249650 0.025242
  -0.358085 0.893698 0.063869 0.166020 -0.779819 0.119022
  0.000000 0.221432 0.000000 -0.065096 0.003527 0.301338
  -0.000000 0.154459 -0.000000 0.132170 0.263732 0.315328
  -0.810392 0.550812 -0.372493 -0.966787 0.112025 -0.084120
  -0.000000 3.626384 -0.000000 -0.371112 0.002308 0.012392
  0.782400 0.551418 -0.372917 -0.932548 -0.100033 0.051836
  0.000000 3.626384 0.000001 -0.306047 -0.017263 -0.009595
  -1.406109 0.838118 1.299208 -0.369178 0.203943 -0.901430
  -0.090614 0.138320 1.006144 0.752092 0.018236 0.046746
  -0.090614 0.138320 1.006144 -0.852404 0.078746 -0.052999
  2.241435 0.812477 -1.543512 0.711378 -0.142690 -0.667010
  -0.005721 0.138320 -1.010200 -0.025764 -0.537679 0.842437
  -0.005721 0.138320 -1.010200 -0.753536 -0.000863 0.003278
}

