MD5Version 10
commandline ""

numFrames 11
numJoints 85
frameRate 60
numAnimatedComponents 510

hierarchy {
  "origin" -1 63 0 //
  "hips" 0 63 6 //
  "spine" 1 63 12 //
  "ribs" 2 63 18 //
  "neck" 3 63 24 //
  "neckcontol" 4 63 30 //
  "head" 4 63 36 //
  "jaw" 6 63 42 //
  "lower_lip0" 7 63 48 //
  "lip.003" 8 63 54 //
  "lip.002" 9 63 60 //
  "lip.001" 10 63 66 //
  "lip" 11 63 72 //
  "eye.L" 6 63 78 //
  "eye.R" 6 63 84 //
  "upper_lip0" 6 63 90 //
  "lip.004" 15 63 96 //
  "lip.005" 16 63 102 //
  "lip.006" 17 63 108 //
  "lip.007" 18 63 114 //
  "eyelidIK3.L" 6 63 120 //
  "eyelid2.L" 20 63 126 //
  "eyelid3.L" 21 63 132 //
  "eyelidIK2.L" 6 63 138 //
  "eyelid1.L" 23 63 144 //
  "eyelid.L" 24 63 150 //
  "eyelidIK3.R" 6 63 156 //
  "eyelid2.R" 26 63 162 //
  "eyelid3.R" 27 63 168 //
  "eyelidIK2.R" 6 63 174 //
  "eyelid1.R" 29 63 180 //
  "eyelid.R" 30 63 186 //
  "head_tag" 4 63 192 //
  "shoulder.R" 3 63 198 //
  "upper_arm.R" 33 63 204 //
  "forearm.R" 34 63 210 //
  "hand.R" 35 63 216 //
  "finger_index.01.R" 36 63 222 //
  "finger_index.02.R" 37 63 228 //
  "finger_index.03.R" 38 63 234 //
  "thumb.01.R" 36 63 240 //
  "thumb.02.R" 40 63 246 //
  "thumb.03.R" 41 63 252 //
  "tag_weapon" 36 63 258 //
  "finger_middle.01.R" 36 63 264 //
  "finger_middle.02.R" 44 63 270 //
  "finger_middle.03.R" 45 63 276 //
  "finger_ring.01.R" 36 63 282 //
  "finger_ring.02.R" 47 63 288 //
  "finger_ring.03.R" 48 63 294 //
  "finger_pinky.01.R" 36 63 300 //
  "finger_pinky.02.R" 50 63 306 //
  "finger_pinky.03.R" 51 63 312 //
  "hand_armor.R" 35 63 318 //
  "tag_gear" 3 63 324 //
  "shoulder.L" 3 63 330 //
  "upper_arm.L" 55 63 336 //
  "forearm.L" 56 63 342 //
  "hand_armor.L" 57 63 348 //
  "hand.L" 57 63 354 //
  "finger_index.01.L" 59 63 360 //
  "finger_index.02.L" 60 63 366 //
  "finger_index.03.L" 61 63 372 //
  "thumb.01.L" 59 63 378 //
  "thumb.02.L" 63 63 384 //
  "thumb.03.L" 64 63 390 //
  "finger_middle.01.L" 59 63 396 //
  "finger_middle.02.L" 66 63 402 //
  "finger_middle.03.L" 67 63 408 //
  "finger_ring.01.L" 59 63 414 //
  "finger_ring.02.L" 69 63 420 //
  "finger_ring.03.L" 70 63 426 //
  "finger_pinky.01.L" 59 63 432 //
  "finger_pinky.02.L" 72 63 438 //
  "finger_pinky.03.L" 73 63 444 //
  "thigh.R" 1 63 450 //
  "shin.R" 75 63 456 //
  "thigh.L" 1 63 462 //
  "shin.L" 77 63 468 //
  "ankle.R" 0 63 474 //
  "foot.R" 79 63 480 //
  "toe.R" 79 63 486 //
  "ankle.L" 0 63 492 //
  "toe.L" 82 63 498 //
  "foot.L" 82 63 504 //
}

bounds {
  ( -0.843645 -4.080544 2.749288 ) ( 6.019297 1.836067 12.797876 )
  ( -0.907536 -4.029416 2.406865 ) ( 5.921962 1.821057 12.861777 )
  ( -1.122535 -3.831435 1.652333 ) ( 5.838345 1.819077 12.999497 )
  ( -1.544030 -3.407155 0.867437 ) ( 5.941958 1.903281 13.128947 )
  ( -1.847895 -2.756253 0.278290 ) ( 6.132406 1.977579 13.202662 )
  ( -1.952029 -2.595396 0.003342 ) ( 6.232508 2.023272 13.216489 )
  ( -1.945048 -2.627050 -0.011606 ) ( 6.179560 2.007174 13.037207 )
  ( -1.945048 -2.720178 -0.015713 ) ( 6.101045 2.008111 12.828569 )
  ( -1.945048 -2.716936 -0.015713 ) ( 6.084997 2.008111 12.852141 )
  ( -1.945048 -2.707340 -0.015713 ) ( 6.057463 2.008111 12.899407 )
  ( -1.945048 -2.697315 -0.015713 ) ( 6.024831 2.008111 12.949477 )
}

baseframe {
  ( 0.000000 0.000000 0.000000 ) ( 0.000000 -0.707107 -0.707107 )
  ( 0.184526 6.906084 -0.013687 ) ( -0.063425 -0.704162 0.063709 )
  ( -0.000000 1.240110 0.000000 ) ( 0.191587 0.001295 -0.009840 )
  ( -0.000000 1.426178 -0.000000 ) ( -0.063779 -0.002332 0.012698 )
  ( -0.000000 1.821084 0.000000 ) ( -0.145265 -0.001328 -0.001879 )
  ( 0.000000 0.808121 0.000000 ) ( 0.001844 -0.515148 -0.857099 )
  ( -0.002195 0.809023 0.000794 ) ( 0.040325 0.000217 -0.001349 )
  ( -0.003138 0.224356 0.163703 ) ( -0.591717 0.381594 0.595702 )
  ( -0.263320 0.555491 -0.218415 ) ( -0.002580 0.003661 -0.873876 )
  ( 0.000000 0.017501 -0.000000 ) ( 0.220569 0.655870 0.690904 )
  ( 0.000000 0.135389 -0.000001 ) ( 0.037467 -0.018190 0.200649 )
  ( 0.000000 0.113742 0.000000 ) ( -0.125321 0.000000 0.210707 )
  ( 0.000000 0.113741 -0.000000 ) ( 0.037467 0.018190 0.200649 )
  ( 0.262165 0.811893 0.662538 ) ( -0.000000 -0.752543 -0.658544 )
  ( -0.244069 0.811856 0.663658 ) ( -0.000000 -0.752542 -0.658544 )
  ( 0.225828 0.266057 0.774515 ) ( 0.047000 0.705543 -0.047000 )
  ( -0.000000 0.017501 -0.000000 ) ( 0.186223 0.743981 0.598525 )
  ( -0.000000 0.145787 -0.000001 ) ( 0.114298 0.017382 0.174281 )
  ( -0.000000 0.112094 0.000000 ) ( -0.001650 -0.003770 0.248557 )
  ( -0.000000 0.111594 0.000000 ) ( 0.099455 -0.020017 0.173948 )
  ( 0.361090 0.810247 0.681599 ) ( 0.046999 0.705543 -0.046999 )
  ( -0.000000 0.011231 0.000000 ) ( 0.138551 0.777593 0.585011 )
  ( 0.000000 0.112704 0.000001 ) ( 0.248666 0.003044 0.385872 )
  ( 0.360328 0.777492 0.684141 ) ( 0.046999 0.705543 -0.046999 )
  ( -0.000000 0.010076 -0.000000 ) ( -0.135461 0.512721 0.787661 )
  ( -0.000000 0.108887 -0.000001 ) ( -0.349590 0.371748 0.224171 )
  ( -0.137678 0.812980 0.691455 ) ( 0.046999 0.705543 -0.046999 )
  ( -0.000000 0.011230 0.000000 ) ( 0.069059 0.752863 0.649633 )
  ( 0.000000 0.131865 -0.000000 ) ( 0.201215 -0.007965 0.324740 )
  ( -0.136810 0.780376 0.690930 ) ( 0.046999 0.705543 -0.046999 )
  ( -0.000000 0.010076 0.000000 ) ( 0.085597 0.645822 0.755134 )
  ( -0.000000 0.128464 -0.000001 ) ( -0.122912 -0.007699 0.282440 )
  ( -0.002195 0.809023 0.000794 ) ( 0.040325 0.000217 -0.001349 )
  ( -0.014833 1.825302 -0.071422 ) ( 0.548058 -0.398517 -0.527101 )
  ( 0.000000 1.493901 0.000000 ) ( 0.337192 0.599744 -0.369520 )
  ( 0.000000 2.103016 0.000000 ) ( -0.166080 0.071882 0.080628 )
  ( 0.000001 1.823368 0.000000 ) ( 0.026122 0.716524 0.005963 )
  ( 0.288927 0.945606 -0.016979 ) ( -0.100840 -0.682277 -0.030495 )
  ( 0.000000 0.310931 0.000000 ) ( -0.001887 -0.003346 -0.140544 )
  ( -0.000000 0.255058 0.000000 ) ( 0.014527 -0.020137 -0.079928 )
  ( 0.182657 0.102359 0.122068 ) ( 0.068809 0.469953 0.338161 )
  ( -0.000000 0.450617 0.000000 ) ( -0.099065 0.025937 0.025593 )
  ( 0.000000 0.295731 -0.000001 ) ( 0.108671 0.022517 0.026610 )
  ( 0.586577 1.443575 0.291631 ) ( 0.494772 0.504178 0.517254 )
  ( 0.081677 0.956433 -0.018380 ) ( -0.107088 -0.736173 -0.098262 )
  ( 0.000000 0.323707 0.000000 ) ( -0.004845 -0.051318 -0.175658 )
  ( 0.000000 0.229679 -0.000000 ) ( 0.016195 -0.015133 -0.050692 )
  ( -0.151893 0.951490 -0.015787 ) ( -0.155854 -0.744157 -0.130418 )
  ( -0.000001 0.298948 -0.000000 ) ( 0.022449 -0.039879 -0.150750 )
  ( -0.000000 0.222754 0.000000 ) ( 0.017543 -0.013115 -0.049400 )
  ( -0.332551 0.872253 0.059175 ) ( -0.270536 -0.079021 -0.029623 )
  ( 0.000000 0.247823 -0.000000 ) ( -0.085055 0.000243 0.004201 )
  ( 0.000000 0.155400 0.000000 ) ( -0.148243 -0.000940 -0.003131 )
  ( 0.531379 1.351308 -0.004340 ) ( 0.015885 0.004080 0.999865 )
  ( 0.002183 1.423120 -0.451181 ) ( 0.675237 0.001866 -0.002772 )
  ( 0.014634 1.825497 -0.071451 ) ( 0.552755 0.408370 0.515946 )
  ( 0.000000 1.493901 0.000000 ) ( 0.498017 -0.047311 0.047143 )
  ( 0.000000 2.103018 -0.000001 ) ( -0.075532 0.079375 0.168458 )
  ( 0.093228 1.351308 0.523154 ) ( 0.654641 0.002699 0.755929 )
  ( 0.000000 1.823368 -0.000000 ) ( -0.025836 0.094228 -0.007102 )
  ( 0.286576 1.006395 -0.107107 ) ( 0.072174 0.602406 -0.086389 )
  ( 0.000000 0.249955 0.000000 ) ( -0.000083 -0.010683 -0.125485 )
  ( -0.000000 0.254363 -0.000000 ) ( -0.016009 0.049143 -0.075943 )
  ( 0.120542 0.102358 -0.183667 ) ( 0.017564 -0.626009 0.348850 )
  ( -0.000000 0.445150 0.000000 ) ( 0.067621 -0.024966 0.008198 )
  ( 0.000000 0.302324 0.000000 ) ( -0.058338 0.684439 0.061834 )
  ( 0.073565 1.013167 -0.024132 ) ( 0.119028 -0.795213 0.100389 )
  ( -0.000000 0.266205 0.000000 ) ( 0.003820 0.009027 0.165078 )
  ( -0.000000 0.229740 -0.000000 ) ( -0.004806 0.012921 0.052363 )
  ( -0.127263 1.003840 0.060605 ) ( 0.184529 -0.779480 0.128005 )
  ( -0.000000 0.246800 0.000000 ) ( -0.001225 -0.003214 0.130582 )
  ( 0.000000 0.222126 -0.000000 ) ( 0.002051 0.007113 0.050428 )
  ( -0.358085 0.893698 0.063869 ) ( 0.227228 -0.775272 0.133791 )
  ( 0.000000 0.221431 -0.000000 ) ( -0.006730 0.001955 0.092569 )
  ( -0.000000 0.154458 0.000000 ) ( -0.003598 -0.015304 0.148050 )
  ( -0.810392 0.550812 -0.372493 ) ( -0.984551 0.027405 -0.000267 )
  ( 0.000000 3.626385 -0.000000 ) ( -0.211921 0.002430 0.007077 )
  ( 0.782400 0.551416 -0.372917 ) ( -0.984498 -0.026294 0.009171 )
  ( -0.000000 3.626384 0.000000 ) ( -0.211935 -0.017722 -0.006644 )
  ( -0.305859 0.828940 1.124649 ) ( -0.552637 0.176065 -0.801670 )
  ( -0.090614 0.138320 1.006144 ) ( 0.752092 0.018236 0.046746 )
  ( -0.090614 0.138320 1.006144 ) ( -0.854351 0.076975 -0.055594 )
  ( -0.305858 0.828940 -1.124649 ) ( 0.585870 -0.181993 -0.777713 )
  ( -0.005721 0.138319 -1.010200 ) ( -0.046568 0.515226 -0.854890 )
  ( -0.005721 0.138319 -1.010200 ) ( -0.753536 -0.000864 0.003278 )
}

frame 0 {
  -0.000000 0.000000 0.023935 -0.707107 -0.000000 -0.000000
  0.309123 6.236876 -0.106869 -0.077304 -0.540594 0.051988
  0.000000 1.240110 -0.000000 0.024186 0.002904 -0.034789
  -0.000000 1.426177 -0.000000 -0.129468 -0.009846 0.016730
  -0.000000 1.821084 0.000000 -0.081795 -0.211893 -0.090694
  0.000000 0.808123 -0.000000 0.001844 -0.515148 -0.857099
  -0.044148 0.766294 0.024775 0.027185 0.014681 0.061466
  -0.003138 0.224357 0.163703 -0.582226 0.395844 0.586146
  -0.259541 0.557511 -0.217253 0.916923 -0.373847 0.079459
  0.000000 0.017501 -0.000000 0.774550 -0.173201 -0.239986
  0.000000 0.135389 0.000000 0.082233 -0.094948 0.221280
  0.000000 0.113742 0.000000 -0.176053 -0.052768 0.164477
  -0.000000 0.113741 -0.000001 -0.038605 -0.020923 0.229127
  0.262165 0.811892 0.662538 0.047907 0.854341 0.515799
  -0.244069 0.811854 0.663660 0.060686 0.853077 0.515517
  0.224683 0.261799 0.775027 0.050217 -0.688166 0.244436
  -0.000000 0.017499 0.000000 0.705562 -0.200485 -0.219948
  -0.000000 0.145787 0.000001 0.142950 -0.037020 0.196471
  0.000000 0.112094 -0.000000 -0.073264 -0.082605 0.230780
  -0.000000 0.111594 0.000002 0.015656 -0.055485 0.225992
  0.365935 0.793585 0.683420 0.046999 0.705543 -0.046999
  0.000000 0.011231 -0.000000 0.125929 0.784490 0.580788
  0.000000 0.112704 0.000001 0.249010 -0.023435 0.387488
  0.360328 0.777494 0.684141 0.046999 0.705543 -0.046999
  -0.000001 0.010076 -0.000000 -0.099297 0.457443 0.813065
  -0.000000 0.108887 0.000001 -0.431278 0.352683 0.307499
  -0.136625 0.803881 0.692456 0.046999 0.705543 -0.046999
  -0.000000 0.011230 -0.000000 -0.005591 0.731270 0.661937
  -0.000000 0.131865 -0.000000 0.062069 -0.104541 0.376629
  -0.136810 0.780377 0.690931 0.046999 0.705543 -0.046999
  -0.000000 0.010075 0.000000 0.068236 0.628882 0.752462
  -0.000000 0.128464 0.000001 -0.211667 -0.099299 0.363525
  -0.002195 0.809024 0.000794 0.040325 0.000217 -0.001349
  -0.014833 1.825302 -0.071421 0.467192 -0.533469 -0.463268
  0.000001 1.493901 0.000001 0.056159 0.646165 -0.666203
  0.000001 2.103014 -0.000001 -0.813048 0.031301 0.394717
  0.000000 1.823369 0.000001 0.256739 0.420988 -0.220361
  0.288927 0.945606 -0.016979 -0.051788 -0.682658 -0.029461
  0.000000 0.310930 -0.000000 0.000222 -0.001466 -0.002344
  0.000000 0.255058 0.000000 -0.029972 -0.071882 -0.099376
  0.182656 0.102358 0.122067 -0.147791 0.530627 0.238893
  0.000000 0.450617 0.000002 -0.221154 -0.001971 -0.022319
  -0.000000 0.295730 -0.000001 0.099093 0.156008 -0.150737
  0.586577 1.443575 0.291630 0.494772 0.504178 0.517254
  0.081676 0.956432 -0.018380 -0.233366 -0.644824 -0.351019
  0.000000 0.323706 -0.000001 0.060388 -0.029311 -0.532461
  0.000000 0.229678 -0.000000 0.030183 0.093470 -0.398689
  -0.151893 0.951490 -0.015787 -0.308146 -0.644007 -0.377251
  0.000000 0.298948 0.000001 0.096379 -0.030551 -0.429308
  -0.000000 0.222754 -0.000002 0.006265 0.070177 -0.362046
  -0.332553 0.872253 0.059175 -0.391534 -0.056788 -0.073543
  0.000002 0.247823 -0.000000 -0.418044 0.003179 -0.041863
  -0.000001 0.155400 0.000000 -0.503511 -0.045801 -0.035994
  0.531378 1.351309 -0.004339 0.015897 0.004077 0.999865
  0.002183 1.423121 -0.451180 0.675237 0.001866 -0.002772
  0.014634 1.825496 -0.071450 0.428741 0.516759 0.554093
  -0.000000 1.493901 -0.000001 0.403196 0.283672 0.518224
  -0.000000 2.103016 -0.000000 0.021028 0.448878 0.498601
  0.093228 1.351308 0.523154 0.654646 0.002704 0.755925
  0.000001 1.823368 -0.000001 -0.020983 0.641702 -0.283919
  0.286576 1.006396 -0.107108 0.024709 0.598348 -0.059166
  -0.000001 0.249956 0.000000 -0.029446 -0.012157 -0.324128
  0.000000 0.254364 -0.000000 -0.076052 0.173004 -0.419928
  0.120543 0.102359 -0.183667 0.007249 -0.621705 0.355046
  -0.000000 0.445149 -0.000000 0.209529 -0.024502 0.024142
  -0.000000 0.302325 0.000000 -0.249760 0.522760 0.319410
  0.073565 1.013168 -0.024132 0.021290 -0.812609 0.006546
  -0.000001 0.266206 -0.000001 0.056270 0.004782 0.582498
  0.000000 0.229739 -0.000000 -0.022492 0.184743 0.188459
  -0.127263 1.003841 0.060605 0.076594 -0.797045 0.046929
  -0.000001 0.246799 -0.000000 -0.008494 -0.002390 0.639247
  0.000000 0.222126 0.000001 -0.019053 0.249650 0.025249
  -0.358085 0.893699 0.063870 0.166010 -0.779821 0.119013
  0.000000 0.221431 -0.000000 -0.065102 0.003527 0.301352
  0.000000 0.154459 0.000000 0.132176 0.263737 0.315329
  -0.810392 0.550812 -0.372493 -0.650327 0.182901 -0.247116
  -0.000000 3.626384 0.000000 -0.928574 0.000920 0.031008
  0.782400 0.551417 -0.372917 -0.563289 -0.172149 0.169173
  0.000000 3.626384 0.000001 -0.899839 -0.007894 -0.028211
  -0.174225 4.277575 0.868138 -0.391951 0.396733 -0.829931
  -0.090614 0.138320 1.006144 0.934929 -0.003559 0.064254
  -0.090614 0.138320 1.006144 -0.715854 -0.014973 -0.017931
  1.694646 4.328063 -1.025876 0.620083 -0.235191 -0.702833
  -0.005721 0.138319 -1.010200 -0.038428 -0.730474 0.680940
  -0.005721 0.138319 -1.010200 -0.936095 0.005850 -0.010951
}

frame 1 {
  -0.000000 0.000000 0.023935 -0.707107 -0.000000 -0.000000
  0.224554 6.294651 -0.106690 -0.076338 -0.540731 0.050493
  -0.000000 1.240109 0.000000 0.024621 0.002858 -0.034985
  -0.000000 1.426177 -0.000000 -0.130315 -0.009701 0.017093
  0.000000 1.821084 0.000000 -0.081453 -0.211611 -0.090205
  0.000000 0.808122 0.000000 0.001844 -0.515148 -0.857099
  -0.044148 0.766295 0.024775 0.027460 0.014741 0.061192
  -0.003138 0.224356 0.163703 -0.582226 0.395844 0.586146
  -0.259542 0.557511 -0.217253 0.916298 -0.375505 0.079438
  0.000000 0.017500 -0.000000 0.773864 -0.173430 -0.239654
  0.000000 0.135388 0.000000 0.082898 -0.094316 0.220960
  -0.000000 0.113742 0.000001 -0.175527 -0.052836 0.165084
  0.000000 0.113741 -0.000001 -0.037786 -0.021090 0.229256
  0.262164 0.811893 0.662538 0.047199 0.852287 0.519301
  -0.244069 0.811855 0.663659 0.059890 0.851054 0.519013
  0.224682 0.261798 0.775026 0.049239 -0.688613 0.242977
  -0.000000 0.017499 0.000000 0.704793 -0.200519 -0.219398
  0.000000 0.145788 0.000000 0.143454 -0.036577 0.196083
  0.000000 0.112094 0.000000 -0.072373 -0.082395 0.230937
  -0.000000 0.111594 -0.000000 0.016370 -0.055715 0.225943
  0.365934 0.793584 0.683419 0.046999 0.705543 -0.046999
  -0.000000 0.011232 -0.000000 0.125931 0.784490 0.580787
  0.000000 0.112704 -0.000002 0.249014 -0.023437 0.387488
  0.360327 0.777493 0.684141 0.046999 0.705543 -0.046999
  -0.000000 0.010075 -0.000000 -0.099297 0.457446 0.813063
  0.000000 0.108886 -0.000000 -0.431280 0.352680 0.307499
  -0.136626 0.803880 0.692455 0.046999 0.705543 -0.046999
  -0.000001 0.011232 -0.000000 -0.004494 0.731543 0.661944
  -0.000000 0.131865 -0.000000 0.063354 -0.104451 0.376418
  -0.136810 0.780376 0.690930 0.046999 0.705543 -0.046999
  0.000000 0.010075 -0.000000 0.069544 0.629204 0.752339
  0.000000 0.128464 -0.000000 -0.210398 -0.099309 0.364258
  -0.002195 0.809024 0.000794 0.040325 0.000217 -0.001349
  -0.014832 1.825302 -0.071422 0.467192 -0.533469 -0.463268
  -0.000001 1.493901 -0.000002 0.052882 0.647807 -0.664454
  -0.000000 2.103016 0.000000 -0.813065 0.031298 0.394725
  0.000001 1.823368 0.000001 0.259441 0.418784 -0.218415
  0.288928 0.945606 -0.016979 -0.051790 -0.682658 -0.029459
  0.000000 0.310931 0.000000 0.000222 -0.001466 -0.002344
  0.000000 0.255058 -0.000001 -0.029970 -0.071882 -0.099377
  0.182657 0.102358 0.122067 -0.147791 0.530627 0.238892
  0.000000 0.450617 0.000001 -0.221150 -0.001971 -0.022318
  0.000000 0.295730 -0.000001 0.099088 0.156009 -0.150736
  0.586577 1.443575 0.291630 0.494772 0.504178 0.517254
  0.081677 0.956433 -0.018380 -0.233366 -0.644825 -0.351017
  0.000000 0.323705 -0.000001 0.060387 -0.029311 -0.532464
  0.000000 0.229678 0.000000 0.030184 0.093468 -0.398687
  -0.151893 0.951490 -0.015788 -0.308148 -0.644009 -0.377248
  0.000000 0.298947 0.000001 0.096378 -0.030552 -0.429311
  0.000000 0.222754 0.000000 0.006267 0.070172 -0.362045
  -0.332551 0.872253 0.059175 -0.391533 -0.056789 -0.073539
  0.000000 0.247823 0.000000 -0.418050 0.003179 -0.041860
  0.000001 0.155400 -0.000000 -0.503507 -0.045808 -0.035997
  0.531378 1.351308 -0.004340 0.015870 0.004077 0.999866
  0.002183 1.423120 -0.451181 0.675237 0.001866 -0.002772
  0.014634 1.825497 -0.071451 0.428741 0.516759 0.554093
  -0.000000 1.493901 0.000000 0.384141 0.270351 0.520548
  -0.000000 2.103017 -0.000001 0.021041 0.448780 0.498929
  0.093228 1.351308 0.523154 0.654641 0.002699 0.755929
  0.000000 1.823368 0.000001 -0.018237 0.661372 -0.270941
  0.286576 1.006396 -0.107110 0.024702 0.598348 -0.059157
  -0.000001 0.249956 0.000000 -0.029450 -0.012157 -0.324152
  -0.000001 0.254363 -0.000001 -0.076046 0.173003 -0.419916
  0.120541 0.102358 -0.183669 0.007241 -0.621700 0.355053
  -0.000000 0.445151 -0.000000 0.209560 -0.024502 0.024148
  0.000000 0.302324 -0.000000 -0.249778 0.522753 0.319415
  0.073565 1.013167 -0.024134 0.021287 -0.812610 0.006543
  0.000001 0.266205 -0.000000 0.056272 0.004782 0.582510
  0.000000 0.229740 0.000000 -0.022497 0.184741 0.188449
  -0.127263 1.003841 0.060603 0.076593 -0.797045 0.046928
  -0.000002 0.246799 -0.000001 -0.008493 -0.002390 0.639256
  0.000000 0.222126 -0.000000 -0.019056 0.249649 0.025240
  -0.358086 0.893698 0.063867 0.166005 -0.779822 0.119007
  0.000000 0.221431 0.000000 -0.065107 0.003527 0.301377
  0.000000 0.154457 0.000000 0.132174 0.263740 0.315311
  -0.810392 0.550811 -0.372493 -0.694557 0.179698 -0.240255
  -0.000000 3.626385 0.000000 -0.904755 0.001056 0.030212
  0.782400 0.551416 -0.372917 -0.607735 -0.166104 0.170682
  0.000000 3.626385 0.000000 -0.871218 -0.008888 -0.027314
  -0.320558 3.893762 0.896791 -0.390718 0.380357 -0.837981
  -0.090614 0.138320 1.006144 0.927093 -0.002218 0.063411
  -0.090614 0.138320 1.006144 -0.730047 -0.012604 -0.018007
  1.741724 3.962396 -1.071554 0.628861 -0.227203 -0.700384
  -0.005721 0.138319 -1.010200 -0.034216 -0.713706 0.698794
  -0.005721 0.138319 -1.010200 -0.928225 0.005455 -0.010109
}

frame 2 {
  -0.000000 0.000000 0.023935 -0.707107 -0.000000 -0.000000
  0.153844 6.426406 -0.106540 -0.075371 -0.540867 0.048998
  0.000000 1.240110 0.000000 0.025936 0.002721 -0.035575
  0.000000 1.426178 0.000000 -0.132871 -0.009265 0.018188
  0.000000 1.821082 -0.000000 -0.080419 -0.210761 -0.088728
  -0.000000 0.808122 0.000000 0.001844 -0.515148 -0.857099
  -0.044147 0.766295 0.024775 0.028289 0.014923 0.060368
  -0.003137 0.224356 0.163703 -0.582226 0.395844 0.586146
  -0.259542 0.557511 -0.217254 0.915758 -0.377202 0.079789
  -0.000000 0.017501 -0.000000 0.773033 -0.173318 -0.238537
  -0.000000 0.135389 0.000001 0.083339 -0.093376 0.220824
  -0.000000 0.113741 0.000001 -0.175059 -0.052564 0.165642
  -0.000000 0.113741 -0.000001 -0.036813 -0.020871 0.229400
  0.262165 0.811894 0.662538 0.046546 0.849009 0.524745
  -0.244068 0.811855 0.663659 0.059163 0.847809 0.524442
  0.224683 0.261800 0.775026 0.048769 -0.689778 0.241031
  -0.000000 0.017499 0.000000 0.703772 -0.200214 -0.218199
  0.000000 0.145787 -0.000001 0.143813 -0.035933 0.195884
  0.000000 0.112094 -0.000000 -0.071659 -0.081718 0.231155
  0.000000 0.111594 0.000002 0.017301 -0.055529 0.225831
  0.365935 0.793586 0.683418 0.046999 0.705543 -0.046999
  0.000001 0.011230 0.000000 0.125930 0.784489 0.580789
  0.000000 0.112704 0.000000 0.249010 -0.023435 0.387488
  0.360328 0.777494 0.684141 0.046999 0.705543 -0.046999
  -0.000001 0.010076 0.000000 -0.099298 0.457443 0.813066
  0.000000 0.108888 -0.000000 -0.431285 0.352683 0.307497
  -0.136625 0.803882 0.692455 0.046999 0.705543 -0.046999
  0.000000 0.011230 0.000000 -0.003587 0.731765 0.661950
  0.000000 0.131865 0.000000 0.064699 -0.103694 0.376188
  -0.136810 0.780377 0.690930 0.046999 0.705543 -0.046999
  -0.000000 0.010076 0.000000 0.070537 0.629445 0.752246
  -0.000000 0.128464 0.000000 -0.209175 -0.098664 0.364961
  -0.002195 0.809023 0.000794 0.040325 0.000217 -0.001349
  -0.014833 1.825300 -0.071422 0.467192 -0.533469 -0.463268
  -0.000001 1.493901 -0.000001 0.057852 0.643884 -0.668057
  0.000001 2.103015 -0.000001 -0.813115 0.031290 0.394750
  0.000001 1.823369 -0.000001 0.254058 0.423160 -0.220816
  0.288927 0.945606 -0.016980 -0.051790 -0.682658 -0.029459
  -0.000000 0.310930 -0.000000 0.000222 -0.001466 -0.002344
  -0.000000 0.255058 0.000002 -0.029970 -0.071882 -0.099376
  0.182656 0.102358 0.122067 -0.147792 0.530627 0.238893
  -0.000000 0.450619 -0.000001 -0.221142 -0.001971 -0.022317
  -0.000000 0.295730 -0.000001 0.099081 0.156009 -0.150739
  0.586577 1.443575 0.291630 0.494772 0.504178 0.517254
  0.081676 0.956433 -0.018380 -0.233368 -0.644825 -0.351016
  -0.000000 0.323706 0.000000 0.060386 -0.029311 -0.532463
  0.000000 0.229678 0.000001 0.030184 0.093465 -0.398687
  -0.151892 0.951490 -0.015788 -0.308148 -0.644009 -0.377248
  -0.000000 0.298948 0.000000 0.096377 -0.030552 -0.429310
  0.000000 0.222753 0.000002 0.006267 0.070172 -0.362044
  -0.332552 0.872254 0.059175 -0.391533 -0.056789 -0.073539
  0.000001 0.247824 0.000000 -0.418049 0.003179 -0.041860
  -0.000001 0.155400 -0.000001 -0.503506 -0.045808 -0.035996
  0.531379 1.351308 -0.004341 0.015902 0.004081 0.999865
  0.002183 1.423119 -0.451181 0.675237 0.001866 -0.002772
  0.014634 1.825496 -0.071451 0.428741 0.516759 0.554093
  0.000000 1.493902 -0.000002 0.352886 0.249520 0.523541
  -0.000000 2.103016 -0.000000 0.021083 0.448485 0.499913
  0.093227 1.351308 0.523154 0.654641 0.002695 0.755929
  0.000001 1.823370 0.000000 -0.014368 0.691307 -0.250261
  0.286575 1.006395 -0.107109 0.024695 0.598347 -0.059148
  -0.000001 0.249956 0.000001 -0.029454 -0.012157 -0.324171
  -0.000000 0.254364 -0.000000 -0.076041 0.173001 -0.419908
  0.120542 0.102358 -0.183667 0.007234 -0.621697 0.355058
  -0.000001 0.445150 -0.000000 0.209578 -0.024502 0.024149
  -0.000000 0.302323 -0.000000 -0.249786 0.522749 0.319419
  0.073564 1.013167 -0.024133 0.021282 -0.812611 0.006538
  0.000001 0.266205 0.000000 0.056276 0.004782 0.582519
  -0.000000 0.229740 -0.000001 -0.022502 0.184738 0.188445
  -0.127264 1.003840 0.060604 0.076593 -0.797045 0.046927
  0.000000 0.246800 -0.000000 -0.008492 -0.002390 0.639259
  0.000001 0.222127 -0.000000 -0.019059 0.249648 0.025236
  -0.358086 0.893699 0.063868 0.165973 -0.779832 0.118968
  -0.000000 0.221430 0.000000 -0.065131 0.003526 0.301497
  -0.000000 0.154459 -0.000000 0.132166 0.263753 0.315239
  -0.810392 0.550812 -0.372493 -0.783081 0.174650 -0.227120
  0.000000 3.626385 0.000000 -0.826290 0.001399 0.027592
  0.782400 0.551417 -0.372918 -0.709009 -0.149362 0.169072
  -0.000000 3.626384 0.000000 -0.782299 -0.011287 -0.024526
  -0.648303 2.991461 0.999920 -0.386391 0.333178 -0.859002
  -0.090614 0.138319 1.006144 0.901443 0.001733 0.060748
  -0.090614 0.138319 1.006144 -0.768556 -0.004789 -0.018684
  1.879264 3.048848 -1.201425 0.652960 -0.204396 -0.692694
  -0.005721 0.138319 -1.010200 -0.022131 -0.663698 0.747106
  -0.005721 0.138319 -1.010200 -0.902518 0.004278 -0.007603
}

frame 3 {
  -0.000000 0.000000 0.023935 -0.707107 -0.000000 -0.000000
  0.245396 6.561896 -0.106734 -0.076287 -0.540738 0.050415
  0.000000 1.240110 -0.000000 0.028105 0.002494 -0.036549
  0.000000 1.426178 0.000000 -0.137085 -0.008544 0.019993
  0.000000 1.821084 -0.000000 -0.078714 -0.209356 -0.086293
  0.000000 0.808121 0.000000 0.001844 -0.515148 -0.857099
  -0.044147 0.766294 0.024775 0.029656 0.015223 0.059009
  -0.003138 0.224357 0.163703 -0.582226 0.395844 0.586146
  -0.259541 0.557511 -0.217253 0.916608 -0.375749 0.080873
  0.000000 0.017501 -0.000000 0.773228 -0.172132 -0.236574
  0.000000 0.135389 0.000001 0.082089 -0.093049 0.221660
  -0.000000 0.113741 0.000001 -0.175761 -0.051511 0.164937
  -0.000000 0.113741 -0.000001 -0.037143 -0.019570 0.229342
  0.262164 0.811894 0.662538 0.047463 0.847752 0.526630
  -0.244069 0.811856 0.663659 0.060171 0.846524 0.526312
  0.224683 0.261800 0.775026 0.051198 -0.691458 0.240971
  -0.000000 0.017499 0.000000 0.703717 -0.199228 -0.216831
  -0.000000 0.145787 0.000000 0.142945 -0.035744 0.196812
  0.000000 0.112093 -0.000001 -0.072991 -0.080548 0.231199
  -0.000000 0.111594 0.000000 0.017225 -0.054093 0.225703
  0.365934 0.793586 0.683419 0.046999 0.705543 -0.046999
  0.000000 0.011230 -0.000000 0.125929 0.784490 0.580788
  0.000000 0.112704 0.000000 0.249009 -0.023435 0.387487
  0.360328 0.777495 0.684141 0.046999 0.705543 -0.046999
  0.000000 0.010075 -0.000000 -0.099298 0.457442 0.813066
  -0.000000 0.108886 0.000001 -0.431285 0.352683 0.307497
  -0.136626 0.803883 0.692455 0.046999 0.705543 -0.046999
  0.000000 0.011230 -0.000000 -0.005170 0.731374 0.661941
  -0.000000 0.131864 0.000000 0.063665 -0.101813 0.376364
  -0.136810 0.780377 0.690931 0.046999 0.705543 -0.046999
  0.000000 0.010077 -0.000000 0.068378 0.628921 0.752446
  0.000000 0.128465 -0.000001 -0.210482 -0.096732 0.364207
  -0.002195 0.809023 0.000794 0.040325 0.000217 -0.001349
  -0.014832 1.825301 -0.071422 0.467192 -0.533469 -0.463268
  -0.000001 1.493901 -0.000003 0.075721 0.631330 -0.679573
  0.000002 2.103014 -0.000001 -0.813197 0.031275 0.394788
  -0.000000 1.823370 -0.000000 0.236183 0.437377 -0.230110
  0.288928 0.945606 -0.016980 -0.051798 -0.682657 -0.029468
  -0.000000 0.310931 0.000001 0.000222 -0.001466 -0.002344
  0.000000 0.255058 -0.000001 -0.029970 -0.071882 -0.099364
  0.182658 0.102358 0.122067 -0.147807 0.530631 0.238889
  0.000000 0.450618 0.000002 -0.221115 -0.001972 -0.022312
  0.000000 0.295730 -0.000001 0.099067 0.156009 -0.150745
  0.586576 1.443575 0.291630 0.494772 0.504178 0.517254
  0.081677 0.956432 -0.018380 -0.233381 -0.644818 -0.351032
  0.000000 0.323706 0.000000 0.060383 -0.029312 -0.532426
  0.000000 0.229678 0.000001 0.030184 0.093467 -0.398707
  -0.151892 0.951490 -0.015787 -0.308163 -0.643998 -0.377267
  -0.000000 0.298947 0.000002 0.096367 -0.030553 -0.429260
  0.000000 0.222753 0.000000 0.006271 0.070169 -0.362072
  -0.332552 0.872253 0.059175 -0.391566 -0.056789 -0.073541
  -0.000000 0.247823 -0.000000 -0.417983 0.003179 -0.041854
  -0.000001 0.155400 -0.000000 -0.503539 -0.045807 -0.036000
  0.531378 1.351309 -0.004340 0.015859 0.004060 0.999866
  0.002183 1.423120 -0.451181 0.675237 0.001866 -0.002772
  0.014634 1.825497 -0.071451 0.428741 0.516759 0.554093
  0.000000 1.493901 -0.000002 0.351231 0.251725 0.524186
  0.000000 2.103017 0.000001 0.021150 0.448007 0.501507
  0.093228 1.351308 0.523154 0.654647 0.002699 0.755923
  0.000001 1.823368 0.000000 -0.016096 0.690506 -0.251264
  0.286577 1.006396 -0.107109 0.024694 0.598348 -0.059145
  0.000001 0.249955 0.000001 -0.029454 -0.012157 -0.324178
  0.000000 0.254363 0.000001 -0.076041 0.173002 -0.419903
  0.120542 0.102359 -0.183668 0.007232 -0.621696 0.355061
  -0.000000 0.445151 0.000000 0.209588 -0.024502 0.024151
  0.000000 0.302323 -0.000000 -0.249793 0.522746 0.319421
  0.073566 1.013168 -0.024133 0.021280 -0.812610 0.006538
  -0.000000 0.266204 0.000000 0.056275 0.004782 0.582524
  -0.000000 0.229739 -0.000000 -0.022501 0.184739 0.188441
  -0.127262 1.003841 0.060604 0.076592 -0.797045 0.046927
  0.000001 0.246800 -0.000000 -0.008493 -0.002390 0.639262
  -0.000001 0.222127 0.000000 -0.019059 0.249649 0.025232
  -0.358085 0.893699 0.063867 0.165972 -0.779832 0.118969
  -0.000000 0.221431 -0.000000 -0.065133 0.003527 0.301500
  0.000000 0.154459 -0.000000 0.132168 0.263756 0.315235
  -0.810392 0.550812 -0.372493 -0.868995 0.160774 -0.215352
  0.000000 3.626384 0.000000 -0.673514 0.001837 0.022490
  0.782400 0.551416 -0.372917 -0.817609 -0.124915 0.154842
  0.000000 3.626384 0.000000 -0.622242 -0.014191 -0.019508
  -1.010248 1.958034 1.147395 -0.379027 0.270859 -0.882115
  -0.090614 0.138320 1.006144 0.857415 0.007466 0.056418
  -0.090614 0.138320 1.006144 -0.814264 0.008184 -0.020817
  2.056198 1.968893 -1.368064 0.682392 -0.174576 -0.681145
  -0.005721 0.138319 -1.010200 -0.006367 -0.594289 0.803901
  -0.005721 0.138319 -1.010200 -0.858515 0.002533 -0.003899
}

frame 4 {
  -0.000000 0.000000 0.023935 -0.707107 -0.000000 -0.000000
  0.404828 6.651370 -0.107072 -0.078643 -0.540401 0.054059
  -0.000000 1.240109 0.000000 0.031031 0.002188 -0.037863
  0.000000 1.426178 -0.000000 -0.142769 -0.007571 0.022429
  0.000000 1.821084 -0.000000 -0.076411 -0.207456 -0.083003
  0.000000 0.808121 -0.000000 0.001844 -0.515148 -0.857099
  -0.044148 0.766294 0.024775 0.031501 0.015627 0.057173
  -0.003138 0.224356 0.163703 -0.582226 0.395844 0.586146
  -0.259541 0.557510 -0.217254 0.918510 -0.371889 0.082506
  0.000000 0.017501 -0.000000 0.774143 -0.170122 -0.233890
  0.000000 0.135389 -0.000000 0.079510 -0.093107 0.223244
  0.000000 0.113741 0.000000 -0.177336 -0.049823 0.163256
  -0.000000 0.113741 0.000000 -0.038441 -0.017386 0.229132
  0.262164 0.811892 0.662538 0.049834 0.848784 0.524577
  -0.244069 0.811856 0.663658 0.062715 0.847478 0.524249
  0.224683 0.261798 0.775027 0.055928 -0.693575 0.242259
  -0.000000 0.017499 0.000000 0.704331 -0.197721 -0.215274
  -0.000000 0.145787 -0.000000 0.141105 -0.035847 0.198605
  -0.000000 0.112094 0.000000 -0.075889 -0.078920 0.231105
  -0.000000 0.111594 -0.000000 0.016426 -0.051645 0.225549
  0.365934 0.793585 0.683419 0.046999 0.705543 -0.046999
  0.000000 0.011230 0.000000 0.125931 0.784487 0.580791
  -0.000000 0.112704 0.000001 0.249008 -0.023435 0.387488
  0.360328 0.777493 0.684141 0.046999 0.705543 -0.046999
  -0.000000 0.010077 0.000000 -0.099298 0.457444 0.813065
  -0.000000 0.108887 -0.000000 -0.431279 0.352682 0.307497
  -0.136625 0.803881 0.692455 0.046999 0.705543 -0.046999
  -0.000000 0.011232 -0.000000 -0.008667 0.730496 0.661906
  0.000000 0.131865 -0.000001 0.060851 -0.098956 0.376829
  -0.136810 0.780377 0.690930 0.046999 0.705543 -0.046999
  0.000000 0.010076 -0.000000 0.063791 0.627789 0.752851
  0.000000 0.128464 -0.000000 -0.213703 -0.093719 0.362328
  -0.002195 0.809022 0.000794 0.040325 0.000217 -0.001349
  -0.014832 1.825302 -0.071422 0.467192 -0.533469 -0.463268
  0.000000 1.493901 0.000001 0.091350 0.619198 -0.689899
  0.000001 2.103015 -0.000000 -0.813301 0.031257 0.394839
  0.000000 1.823368 -0.000000 0.219594 0.450109 -0.237897
  0.288927 0.945606 -0.016980 -0.051805 -0.682657 -0.029475
  0.000001 0.310931 0.000000 0.000222 -0.001466 -0.002345
  0.000000 0.255058 0.000000 -0.029971 -0.071882 -0.099354
  0.182656 0.102358 0.122067 -0.147819 0.530633 0.238888
  -0.000000 0.450618 0.000000 -0.221094 -0.001973 -0.022308
  0.000000 0.295730 -0.000000 0.099055 0.156008 -0.150753
  0.586577 1.443575 0.291630 0.494772 0.504178 0.517254
  0.081678 0.956433 -0.018380 -0.233393 -0.644813 -0.351045
  -0.000000 0.323706 0.000001 0.060380 -0.029313 -0.532395
  -0.000000 0.229678 -0.000000 0.030184 0.093466 -0.398722
  -0.151892 0.951490 -0.015788 -0.308177 -0.643988 -0.377285
  0.000000 0.298948 0.000001 0.096357 -0.030553 -0.429217
  0.000000 0.222754 0.000000 0.006275 0.070167 -0.362093
  -0.332550 0.872253 0.059175 -0.391595 -0.056789 -0.073543
  0.000001 0.247823 -0.000000 -0.417930 0.003179 -0.041851
  -0.000001 0.155400 -0.000000 -0.503562 -0.045805 -0.036002
  0.531378 1.351309 -0.004340 0.015904 0.004089 0.999865
  0.002183 1.423120 -0.451181 0.675237 0.001866 -0.002772
  0.014634 1.825496 -0.071451 0.428741 0.516759 0.554093
  0.000000 1.493901 -0.000000 0.365541 0.266691 0.524016
  -0.000000 2.103016 0.000000 0.021238 0.447375 0.503600
  0.093227 1.351308 0.523154 0.654642 0.002695 0.755927
  0.000000 1.823369 -0.000001 -0.021072 0.672960 -0.264258
  0.286576 1.006395 -0.107108 0.024692 0.598348 -0.059142
  -0.000001 0.249955 -0.000000 -0.029455 -0.012157 -0.324198
  0.000001 0.254363 -0.000000 -0.076036 0.173002 -0.419888
  0.120542 0.102358 -0.183668 0.007221 -0.621690 0.355071
  0.000002 0.445151 0.000001 0.209629 -0.024502 0.024159
  -0.000000 0.302324 0.000000 -0.249816 0.522736 0.319429
  0.073565 1.013167 -0.024133 0.021285 -0.812610 0.006541
  -0.000001 0.266204 -0.000000 0.056277 0.004782 0.582529
  0.000000 0.229741 -0.000000 -0.022506 0.184736 0.188430
  -0.127263 1.003840 0.060604 0.076597 -0.797045 0.046930
  -0.000001 0.246801 -0.000000 -0.008490 -0.002390 0.639266
  -0.000000 0.222126 -0.000001 -0.019064 0.249645 0.025222
  -0.358086 0.893699 0.063868 0.165967 -0.779834 0.118958
  -0.000001 0.221431 -0.000000 -0.065137 0.003526 0.301535
  0.000000 0.154458 0.000000 0.132161 0.263755 0.315212
  -0.810392 0.550812 -0.372493 -0.933108 0.133508 -0.196780
  0.000000 3.626384 0.000000 -0.448192 0.002222 0.014966
  0.782400 0.551416 -0.372917 -0.902242 -0.101216 0.125863
  -0.000000 3.626384 -0.000000 -0.397568 -0.016638 -0.012464
  -1.293596 1.150197 1.261729 -0.371953 0.221528 -0.896886
  -0.090614 0.138320 1.006144 0.805832 0.013129 0.051589
  -0.090614 0.138320 1.006144 -0.846383 0.023779 -0.025023
  2.193213 1.128254 -1.497607 0.704002 -0.151071 -0.670899
  -0.005721 0.138319 -1.010200 0.005879 -0.537155 0.843273
  -0.005721 0.138319 -1.010200 -0.807070 0.000767 -0.000161
}

frame 5 {
  -0.000000 0.000000 0.023935 -0.707107 -0.000000 -0.000000
  0.477022 6.680388 -0.107225 -0.080778 -0.540086 0.057361
  -0.000000 1.240109 0.000000 0.034535 0.001821 -0.039436
  0.000000 1.426177 -0.000000 -0.149569 -0.006406 0.025346
  0.000000 1.821084 0.000000 -0.073651 -0.205176 -0.079061
  0.000000 0.808121 0.000000 0.001844 -0.515148 -0.857099
  -0.044148 0.766293 0.024775 0.033711 0.016111 0.054975
  -0.003138 0.224357 0.163703 -0.582226 0.395844 0.586146
  -0.259541 0.557511 -0.217253 0.920281 -0.368430 0.084237
  0.000000 0.017501 0.000000 0.774735 -0.168045 -0.230760
  0.000000 0.135388 0.000000 0.076954 -0.092779 0.224823
  -0.000000 0.113742 0.000000 -0.178792 -0.047974 0.161704
  0.000000 0.113741 -0.000000 -0.039418 -0.015017 0.228960
  0.262164 0.811896 0.662538 0.052656 0.850498 0.521304
  -0.244069 0.811858 0.663658 0.065630 0.849108 0.520971
  0.224683 0.261800 0.775026 0.060742 -0.696112 0.242887
  -0.000000 0.017499 0.000000 0.704554 -0.196110 -0.213289
  -0.000000 0.145788 0.000000 0.139289 -0.035692 0.200392
  0.000000 0.112094 -0.000001 -0.078655 -0.076953 0.231071
  0.000000 0.111594 -0.000000 0.015958 -0.049021 0.225340
  0.365934 0.793585 0.683418 0.046999 0.705543 -0.046999
  0.000000 0.011231 -0.000000 0.125931 0.784489 0.580789
  -0.000000 0.112704 0.000000 0.249010 -0.023435 0.387488
  0.360327 0.777494 0.684141 0.046999 0.705543 -0.046999
  -0.000000 0.010074 0.000000 -0.099297 0.457445 0.813064
  0.000000 0.108887 0.000000 -0.431278 0.352682 0.307497
  -0.136626 0.803883 0.692454 0.046999 0.705543 -0.046999
  0.000000 0.011232 -0.000000 -0.011984 0.729644 0.661856
  0.000000 0.131865 -0.000000 0.058420 -0.095673 0.377212
  -0.136810 0.780377 0.690930 0.046999 0.705543 -0.046999
  -0.000000 0.010075 0.000000 0.059374 0.626684 0.753209
  -0.000000 0.128464 0.000000 -0.216586 -0.090337 0.360612
  -0.002195 0.809022 0.000794 0.040325 0.000217 -0.001349
  -0.014832 1.825302 -0.071422 0.467192 -0.533469 -0.463268
  0.000000 1.493901 0.000001 0.095904 0.613556 -0.694201
  0.000001 2.103014 -0.000000 -0.813420 0.031237 0.394898
  -0.000000 1.823368 0.000000 0.212820 0.455091 -0.239449
  0.288928 0.945606 -0.016980 -0.051808 -0.682656 -0.029478
  -0.000000 0.310930 0.000002 0.000222 -0.001466 -0.002345
  -0.000000 0.255058 -0.000001 -0.029972 -0.071882 -0.099350
  0.182658 0.102358 0.122067 -0.147824 0.530634 0.238887
  -0.000000 0.450617 0.000001 -0.221088 -0.001973 -0.022307
  0.000000 0.295730 0.000001 0.099053 0.156008 -0.150755
  0.586578 1.443575 0.291630 0.494772 0.504178 0.517254
  0.081679 0.956432 -0.018380 -0.233398 -0.644810 -0.351051
  -0.000000 0.323706 -0.000000 0.060379 -0.029313 -0.532384
  -0.000000 0.229678 -0.000000 0.030183 0.093467 -0.398727
  -0.151892 0.951490 -0.015788 -0.308181 -0.643985 -0.377292
  -0.000000 0.298947 -0.000001 0.096354 -0.030554 -0.429202
  -0.000000 0.222754 0.000001 0.006275 0.070167 -0.362100
  -0.332548 0.872253 0.059175 -0.391606 -0.056789 -0.073545
  -0.000001 0.247823 0.000000 -0.417912 0.003179 -0.041850
  -0.000000 0.155400 -0.000000 -0.503569 -0.045803 -0.036002
  0.531378 1.351308 -0.004340 0.015891 0.004081 0.999865
  0.002183 1.423121 -0.451181 0.675237 0.001866 -0.002772
  0.014634 1.825498 -0.071451 0.428741 0.516759 0.554093
  0.000001 1.493901 -0.000002 0.370926 0.276027 0.524674
  0.000001 2.103018 -0.000002 0.021341 0.446640 0.506022
  0.093227 1.351308 0.523154 0.654641 0.002695 0.755929
  0.000001 1.823369 -0.000001 -0.025085 0.663327 -0.271564
  0.286575 1.006396 -0.107108 0.024676 0.598348 -0.059116
  0.000001 0.249955 0.000001 -0.029462 -0.012157 -0.324261
  -0.000000 0.254363 -0.000000 -0.076026 0.173002 -0.419856
  0.120542 0.102359 -0.183667 0.007203 -0.621681 0.355086
  0.000001 0.445150 -0.000000 0.209686 -0.024501 0.024167
  0.000000 0.302324 -0.000000 -0.249846 0.522723 0.319440
  0.073564 1.013167 -0.024132 0.021275 -0.812611 0.006534
  0.000001 0.266205 0.000001 0.056280 0.004781 0.582560
  0.000000 0.229739 0.000000 -0.022515 0.184734 0.188405
  -0.127263 1.003841 0.060604 0.076594 -0.797046 0.046927
  0.000001 0.246800 0.000000 -0.008489 -0.002390 0.639291
  0.000000 0.222126 -0.000000 -0.019072 0.249643 0.025195
  -0.358086 0.893699 0.063868 0.165959 -0.779837 0.118946
  0.000001 0.221430 -0.000000 -0.065147 0.003526 0.301596
  0.000001 0.154460 -0.000000 0.132153 0.263761 0.315164
  -0.810392 0.550811 -0.372493 -0.966252 0.109306 -0.158671
  0.000000 3.626385 0.000000 -0.267453 0.002395 0.008931
  0.782400 0.551416 -0.372917 -0.944108 -0.090987 0.091216
  -0.000000 3.626384 -0.000000 -0.218867 -0.017694 -0.006862
  -1.406109 0.838118 1.299208 -0.369178 0.203943 -0.901430
  -0.090614 0.138320 1.006144 0.766263 0.016953 0.048008
  -0.090614 0.138320 1.006144 -0.856666 0.039334 -0.031257
  2.241435 0.812477 -1.543512 0.711378 -0.142690 -0.667010
  -0.005721 0.138320 -1.010200 0.010181 -0.516404 0.856133
  -0.005721 0.138320 -1.010200 -0.767649 -0.000450 0.002408
}

frame 6 {
  -0.000000 0.000000 0.023935 -0.707107 -0.000000 -0.000000
  0.399634 6.515222 -0.107061 -0.082631 -0.539805 0.060230
  0.000000 1.240110 -0.000000 0.038353 0.001421 -0.041150
  0.000000 1.426177 0.000000 -0.156970 -0.005135 0.028524
  -0.000000 1.821083 -0.000000 -0.070640 -0.202683 -0.074762
  -0.000001 0.808120 0.000000 0.001844 -0.515148 -0.857099
  -0.044149 0.766292 0.024776 0.036118 0.016639 0.052578
  -0.003137 0.224356 0.163702 -0.582226 0.395844 0.586146
  -0.259541 0.557511 -0.217254 0.921851 -0.365468 0.085934
  -0.000000 0.017501 -0.000000 0.774996 -0.166035 -0.227439
  0.000000 0.135389 0.000001 0.074559 -0.092130 0.226326
  -0.000000 0.113742 -0.000000 -0.180075 -0.046084 0.160332
  0.000000 0.113741 0.000001 -0.040094 -0.012603 0.228837
  0.262165 0.811892 0.662538 0.056460 0.855011 0.513154
  -0.244069 0.811855 0.663659 0.069386 0.853519 0.512839
  0.224683 0.261797 0.775027 0.065410 -0.698854 0.242920
  -0.000000 0.017499 0.000000 0.704406 -0.194518 -0.211068
  0.000000 0.145787 -0.000001 0.137597 -0.035313 0.202084
  -0.000000 0.112094 0.000001 -0.081164 -0.074799 0.231095
  0.000000 0.111594 -0.000001 0.015774 -0.046377 0.225094
  0.365934 0.793584 0.683419 0.046999 0.705543 -0.046999
  -0.000001 0.011231 0.000000 0.125929 0.784490 0.580788
  0.000000 0.112704 0.000002 0.249011 -0.023436 0.387486
  0.360328 0.777494 0.684141 0.046999 0.705543 -0.046999
  -0.000001 0.010076 0.000000 -0.099298 0.457443 0.813066
  0.000000 0.108886 -0.000001 -0.431279 0.352683 0.307498
  -0.136625 0.803880 0.692455 0.046999 0.705543 -0.046999
  -0.000000 0.011232 -0.000000 -0.014985 0.728861 0.661792
  -0.000000 0.131865 -0.000001 0.056436 -0.092186 0.377515
  -0.136810 0.780376 0.690930 0.046999 0.705543 -0.046999
  -0.000001 0.010075 -0.000000 0.055326 0.625646 0.753520
  0.000000 0.128464 -0.000001 -0.219049 -0.086813 0.359120
  -0.002196 0.809022 0.000795 0.040325 0.000217 -0.001349
  -0.014833 1.825300 -0.071422 0.467192 -0.533469 -0.463268
  0.000000 1.493901 0.000000 0.080200 0.620786 -0.687250
  -0.000000 2.103017 0.000000 -0.813542 0.031216 0.394957
  -0.000001 1.823369 -0.000000 0.224921 0.445813 -0.229793
  0.288926 0.945606 -0.016979 -0.051805 -0.682657 -0.029470
  -0.000000 0.310930 -0.000000 0.000222 -0.001466 -0.002344
  -0.000000 0.255058 0.000001 -0.029967 -0.071882 -0.099358
  0.182656 0.102358 0.122068 -0.147808 0.530630 0.238895
  0.000000 0.450618 -0.000001 -0.221119 -0.001973 -0.022311
  -0.000000 0.295730 0.000000 0.099067 0.156006 -0.150752
  0.586576 1.443575 0.291630 0.494772 0.504178 0.517254
  0.081675 0.956433 -0.018380 -0.233391 -0.644815 -0.351039
  -0.000000 0.323706 -0.000001 0.060380 -0.029313 -0.532414
  -0.000000 0.229679 0.000000 0.030184 0.093462 -0.398708
  -0.151895 0.951491 -0.015787 -0.308173 -0.643993 -0.377277
  0.000000 0.298947 0.000001 0.096361 -0.030553 -0.429240
  -0.000000 0.222754 -0.000000 0.006274 0.070165 -0.362078
  -0.332553 0.872253 0.059175 -0.391583 -0.056790 -0.073540
  0.000001 0.247823 -0.000001 -0.417965 0.003179 -0.041851
  -0.000001 0.155400 0.000000 -0.503540 -0.045810 -0.036001
  0.531378 1.351309 -0.004341 0.015886 0.004068 0.999865
  0.002183 1.423119 -0.451181 0.675237 0.001866 -0.002772
  0.014634 1.825495 -0.071452 0.428741 0.516759 0.554093
  -0.000000 1.493901 0.000001 0.356197 0.271489 0.526814
  0.000000 2.103017 -0.000000 0.021448 0.445865 0.508558
  0.093227 1.351308 0.523154 0.654641 0.002690 0.755929
  -0.000001 1.823369 -0.000000 -0.026080 0.673761 -0.265111
  0.286575 1.006395 -0.107107 0.024673 0.598348 -0.059113
  0.000001 0.249955 0.000001 -0.029464 -0.012157 -0.324274
  -0.000000 0.254364 0.000000 -0.076022 0.173000 -0.419848
  0.120541 0.102358 -0.183667 0.007202 -0.621680 0.355090
  0.000001 0.445151 0.000000 0.209698 -0.024501 0.024170
  0.000001 0.302324 -0.000001 -0.249857 0.522719 0.319441
  0.073565 1.013167 -0.024133 0.021279 -0.812611 0.006536
  0.000003 0.266205 0.000000 0.056282 0.004781 0.582558
  -0.000000 0.229738 -0.000000 -0.022518 0.184731 0.188402
  -0.127264 1.003840 0.060604 0.076597 -0.797046 0.046929
  -0.000001 0.246799 0.000001 -0.008487 -0.002390 0.639288
  0.000000 0.222127 0.000000 -0.019075 0.249639 0.025195
  -0.358087 0.893698 0.063870 0.165961 -0.779837 0.118947
  0.000000 0.221430 0.000000 -0.065145 0.003526 0.301592
  -0.000000 0.154458 -0.000000 0.132152 0.263759 0.315167
  -0.810392 0.550812 -0.372493 -0.967354 0.106927 -0.108868
  0.000000 3.626385 0.000000 -0.329947 0.002347 0.011018
  0.782400 0.551416 -0.372917 -0.933696 -0.100366 0.062033
  0.000000 3.626384 -0.000000 -0.281821 -0.017398 -0.008835
  -1.406109 0.838118 1.299208 -0.369178 0.203943 -0.901430
  -0.090614 0.138320 1.006144 0.752092 0.018236 0.046746
  -0.090614 0.138320 1.006144 -0.854489 0.063445 -0.044215
  2.241435 0.812477 -1.543512 0.711378 -0.142690 -0.667010
  -0.005721 0.138320 -1.010200 -0.007795 -0.527173 0.849495
  -0.005721 0.138320 -1.010200 -0.753536 -0.000863 0.003278
}

frame 7 {
  -0.000000 0.000000 0.023935 -0.707107 -0.000000 -0.000000
  0.309123 6.314777 -0.106869 -0.083551 -0.539664 0.061654
  -0.000000 1.240111 0.000000 0.042170 0.001021 -0.042862
  0.000000 1.426178 -0.000000 -0.164361 -0.003864 0.031699
  -0.000000 1.821083 -0.000000 -0.067626 -0.200183 -0.070460
  0.000000 0.808122 0.000000 0.001844 -0.515148 -0.857099
  -0.044148 0.766295 0.024775 0.038526 0.017167 0.050180
  -0.003138 0.224358 0.163702 -0.582226 0.395844 0.586146
  -0.259541 0.557511 -0.217253 0.922758 -0.364107 0.087371
  -0.000000 0.017501 -0.000000 0.774604 -0.164444 -0.224246
  -0.000000 0.135388 0.000001 0.072937 -0.091002 0.227432
  -0.000000 0.113742 -0.000001 -0.180815 -0.044433 0.159599
  0.000000 0.113741 0.000002 -0.040008 -0.010539 0.228834
  0.262165 0.811894 0.662538 0.059893 0.859034 0.505695
  -0.244069 0.811858 0.663658 0.072739 0.857455 0.505399
  0.224683 0.261800 0.775026 0.068891 -0.701641 0.241739
  0.000000 0.017499 0.000000 0.703582 -0.193161 -0.208686
  -0.000000 0.145788 0.000002 0.136474 -0.034583 0.203307
  0.000000 0.112094 0.000002 -0.082707 -0.072668 0.231257
  0.000000 0.111594 -0.000001 0.016206 -0.044172 0.224831
  0.365934 0.793586 0.683418 0.046999 0.705543 -0.046999
  -0.000000 0.011231 0.000000 0.125930 0.784488 0.580790
  0.000000 0.112704 -0.000000 0.249006 -0.023433 0.387489
  0.360328 0.777495 0.684141 0.046999 0.705543 -0.046999
  -0.000000 0.010075 0.000001 -0.099298 0.457443 0.813066
  -0.000000 0.108888 -0.000000 -0.431283 0.352683 0.307497
  -0.136625 0.803882 0.692455 0.046999 0.705543 -0.046999
  0.000000 0.011231 -0.000000 -0.016802 0.728382 0.661745
  -0.000000 0.131865 0.000001 0.055697 -0.088949 0.377625
  -0.136810 0.780379 0.690930 0.046999 0.705543 -0.046999
  0.000000 0.010074 0.000000 0.052749 0.624980 0.753704
  0.000000 0.128464 0.000000 -0.220238 -0.083626 0.358392
  -0.002195 0.809024 0.000794 0.040325 0.000217 -0.001349
  -0.014833 1.825301 -0.071422 0.467192 -0.533469 -0.463268
  0.000000 1.493901 -0.000001 0.056505 0.632737 -0.675190
  0.000001 2.103015 -0.000001 -0.813656 0.031197 0.395013
  0.000000 1.823368 0.000000 0.244493 0.430618 -0.215541
  0.288927 0.945606 -0.016980 -0.051794 -0.682658 -0.029459
  0.000000 0.310931 0.000000 0.000222 -0.001466 -0.002344
  -0.000000 0.255058 0.000001 -0.029967 -0.071882 -0.099372
  0.182657 0.102358 0.122067 -0.147787 0.530625 0.238902
  0.000000 0.450618 -0.000002 -0.221168 -0.001972 -0.022319
  -0.000000 0.295730 -0.000000 0.099097 0.156004 -0.150744
  0.586577 1.443575 0.291630 0.494772 0.504178 0.517254
  0.081677 0.956432 -0.018380 -0.233373 -0.644822 -0.351022
  -0.000000 0.323705 -0.000002 0.060386 -0.029311 -0.532461
  -0.000000 0.229678 -0.000000 0.030183 0.093465 -0.398680
  -0.151892 0.951490 -0.015788 -0.308156 -0.644004 -0.377256
  -0.000000 0.298947 -0.000002 0.096375 -0.030552 -0.429303
  0.000000 0.222753 -0.000000 0.006266 0.070170 -0.362040
  -0.332552 0.872254 0.059175 -0.391543 -0.056789 -0.073539
  0.000000 0.247823 0.000000 -0.418050 0.003179 -0.041859
  -0.000001 0.155400 0.000000 -0.503497 -0.045809 -0.035995
  0.531378 1.351309 -0.004341 0.015881 0.004101 0.999865
  0.002183 1.423119 -0.451181 0.675237 0.001866 -0.002772
  0.014634 1.825495 -0.071451 0.428741 0.516759 0.554093
  -0.000000 1.493901 0.000001 0.337683 0.264449 0.528755
  -0.000000 2.103016 0.000001 0.021550 0.445118 0.510988
  0.093227 1.351308 0.523154 0.654644 0.002695 0.755927
  -0.000002 1.823368 -0.000000 -0.026439 0.687599 -0.256052
  0.286576 1.006395 -0.107107 0.024672 0.598348 -0.059111
  -0.000001 0.249956 -0.000000 -0.029465 -0.012157 -0.324283
  -0.000000 0.254362 0.000001 -0.076019 0.172999 -0.419842
  0.120542 0.102359 -0.183668 0.007195 -0.621676 0.355097
  0.000001 0.445152 0.000000 0.209724 -0.024501 0.024175
  -0.000001 0.302323 -0.000001 -0.249871 0.522713 0.319446
  0.073565 1.013167 -0.024132 0.021280 -0.812611 0.006536
  0.000000 0.266205 -0.000000 0.056283 0.004781 0.582564
  0.000000 0.229739 -0.000000 -0.022520 0.184729 0.188396
  -0.127263 1.003841 0.060605 0.076602 -0.797045 0.046932
  -0.000000 0.246801 0.000000 -0.008487 -0.002390 0.639288
  0.000000 0.222127 -0.000000 -0.019076 0.249639 0.025190
  -0.358085 0.893699 0.063870 0.165962 -0.779837 0.118948
  -0.000000 0.221431 -0.000001 -0.065145 0.003526 0.301598
  0.000000 0.154458 0.000001 0.132150 0.263758 0.315160
  -0.810392 0.550813 -0.372493 -0.959873 0.108271 -0.085320
  0.000000 3.626385 -0.000000 -0.407385 0.002270 0.013604
  0.782400 0.551417 -0.372917 -0.916630 -0.108855 0.051609
  -0.000000 3.626383 0.000001 -0.354766 -0.016953 -0.011122
  -1.406109 0.838118 1.299208 -0.369178 0.203943 -0.901430
  -0.090614 0.138320 1.006144 0.752092 0.018236 0.046746
  -0.090614 0.138320 1.006144 -0.852404 0.078746 -0.052999
  2.241435 0.812477 -1.543512 0.711378 -0.142690 -0.667010
  -0.005721 0.138320 -1.010200 -0.025764 -0.537679 0.842437
  -0.005721 0.138320 -1.010200 -0.753536 -0.000863 0.003278
}

frame 8 {
  -0.000000 0.000000 0.023935 -0.707107 -0.000000 -0.000000
  0.302639 6.335147 -0.106856 -0.082825 -0.539776 0.060529
  0.000000 1.240111 0.000000 0.045671 0.000654 -0.044433
  0.000000 1.426177 0.000000 -0.171130 -0.002698 0.034610
  0.000000 1.821083 -0.000000 -0.064859 -0.197883 -0.066511
  0.000000 0.808122 0.000000 0.001844 -0.515148 -0.857099
  -0.044147 0.766294 0.024775 0.040734 0.017650 0.047980
  -0.003138 0.224358 0.163703 -0.582226 0.395844 0.586146
  -0.259540 0.557511 -0.217253 0.922506 -0.365554 0.088363
  -0.000000 0.017501 -0.000000 0.773238 -0.163609 -0.221472
  -0.000000 0.135389 -0.000001 0.072751 -0.089254 0.227815
  -0.000000 0.113742 0.000000 -0.180597 -0.043302 0.159982
  -0.000000 0.113741 0.000001 -0.038712 -0.009254 0.229034
  0.262165 0.811894 0.662539 0.061199 0.857845 0.507434
  -0.244069 0.811857 0.663659 0.074016 0.856242 0.507125
  0.224683 0.261800 0.775026 0.070050 -0.704351 0.238677
  0.000000 0.017499 0.000000 0.701767 -0.192222 -0.206177
  0.000000 0.145788 -0.000000 0.136420 -0.033380 0.203662
  -0.000000 0.112094 0.000001 -0.082532 -0.070789 0.231654
  0.000000 0.111594 0.000001 0.017607 -0.042888 0.224559
  0.365934 0.793586 0.683419 0.046999 0.705543 -0.046999
  0.000000 0.011231 -0.000000 0.125931 0.784488 0.580790
  0.000000 0.112704 0.000001 0.249005 -0.023432 0.387491
  0.360328 0.777495 0.684141 0.046999 0.705543 -0.046999
  -0.000000 0.010076 0.000000 -0.099298 0.457445 0.813064
  0.000000 0.108888 -0.000000 -0.431280 0.352682 0.307497
  -0.136625 0.803882 0.692455 0.046999 0.705543 -0.046999
  -0.000000 0.011231 -0.000000 -0.016502 0.728462 0.661753
  0.000000 0.131865 0.000000 0.057061 -0.086457 0.377422
  -0.136810 0.780378 0.690930 0.046999 0.705543 -0.046999
  0.000000 0.010075 0.000000 0.052816 0.625000 0.753697
  0.000000 0.128464 0.000000 -0.219240 -0.081287 0.359003
  -0.002195 0.809023 0.000794 0.040325 0.000217 -0.001349
  -0.014833 1.825302 -0.071423 0.467192 -0.533469 -0.463268
  0.000001 1.493901 0.000000 0.055846 0.630508 -0.676524
  0.000000 2.103015 0.000000 -0.813755 0.031179 0.395060
  0.000001 1.823368 -0.000000 0.242718 0.431948 -0.214192
  0.288927 0.945606 -0.016979 -0.051796 -0.682658 -0.029460
  -0.000000 0.310931 -0.000000 0.000222 -0.001466 -0.002344
  -0.000000 0.255058 -0.000002 -0.029966 -0.071882 -0.099372
  0.182656 0.102358 0.122067 -0.147784 0.530623 0.238907
  -0.000000 0.450618 0.000001 -0.221178 -0.001972 -0.022320
  0.000001 0.295730 -0.000000 0.099101 0.156003 -0.150745
  0.586578 1.443575 0.291630 0.494772 0.504178 0.517254
  0.081677 0.956432 -0.018380 -0.233378 -0.644822 -0.351023
  0.000000 0.323706 0.000001 0.060384 -0.029311 -0.532458
  -0.000000 0.229678 -0.000001 0.030184 0.093461 -0.398681
  -0.151893 0.951490 -0.015787 -0.308160 -0.644004 -0.377255
  -0.000000 0.298947 0.000001 0.096372 -0.030552 -0.429301
  -0.000000 0.222753 0.000000 0.006270 0.070164 -0.362041
  -0.332551 0.872253 0.059175 -0.391548 -0.056789 -0.073538
  0.000001 0.247823 0.000000 -0.418045 0.003179 -0.041858
  0.000001 0.155400 0.000001 -0.503498 -0.045810 -0.035996
  0.531379 1.351309 -0.004340 0.015843 0.004076 0.999866
  0.002183 1.423120 -0.451181 0.675237 0.001866 -0.002772
  0.014634 1.825497 -0.071452 0.428741 0.516759 0.554093
  0.000000 1.493901 -0.000000 0.342744 0.273655 0.529739
  -0.000000 2.103015 -0.000000 0.021640 0.444457 0.513124
  0.093227 1.351308 0.523154 0.654643 0.002695 0.755927
  -0.000000 1.823368 -0.000000 -0.030242 0.678445 -0.263207
  0.286577 1.006396 -0.107107 0.024666 0.598348 -0.059102
  0.000001 0.249955 -0.000000 -0.029468 -0.012157 -0.324311
  -0.000000 0.254363 -0.000000 -0.076013 0.172999 -0.419826
  0.120543 0.102359 -0.183668 0.007183 -0.621670 0.355106
  0.000001 0.445150 -0.000000 0.209765 -0.024501 0.024180
  -0.000001 0.302323 -0.000000 -0.249894 0.522703 0.319457
  0.073566 1.013168 -0.024132 0.021277 -0.812612 0.006533
  0.000000 0.266205 -0.000001 0.056287 0.004781 0.582576
  -0.000000 0.229739 0.000001 -0.022527 0.184725 0.188386
  -0.127262 1.003841 0.060604 0.076600 -0.797046 0.046930
  -0.000000 0.246800 0.000000 -0.008483 -0.002390 0.639298
  0.000000 0.222128 -0.000000 -0.019082 0.249634 0.025181
  -0.358085 0.893699 0.063869 0.165953 -0.779841 0.118933
  -0.000000 0.221430 0.000000 -0.065150 0.003526 0.301643
  -0.000001 0.154457 -0.000000 0.132142 0.263759 0.315132
  -0.810392 0.550812 -0.372493 -0.960778 0.107882 -0.084727
  -0.000000 3.626385 0.000000 -0.401807 0.002276 0.013417
  0.782400 0.551417 -0.372917 -0.918735 -0.108016 0.051887
  0.000000 3.626384 -0.000000 -0.346180 -0.017012 -0.010853
  -1.406109 0.838118 1.299208 -0.369178 0.203943 -0.901430
  -0.090614 0.138320 1.006144 0.752092 0.018236 0.046746
  -0.090614 0.138320 1.006144 -0.852404 0.078746 -0.052999
  2.241435 0.812477 -1.543512 0.711378 -0.142690 -0.667010
  -0.005721 0.138320 -1.010200 -0.025764 -0.537679 0.842437
  -0.005721 0.138320 -1.010200 -0.753536 -0.000863 0.003278
}

frame 9 {
  -0.000000 0.000000 0.023935 -0.707107 -0.000000 -0.000000
  0.301886 6.370049 -0.106854 -0.080778 -0.540086 0.057361
  0.000000 1.240110 0.000000 0.048594 0.000348 -0.045744
  0.000000 1.426177 -0.000000 -0.176774 -0.001724 0.037039
  0.000000 1.821083 -0.000000 -0.062547 -0.195958 -0.063212
  0.000000 0.808122 0.000001 0.001844 -0.515148 -0.857099
  -0.044148 0.766294 0.024775 0.042577 0.018054 0.046143
  -0.003138 0.224357 0.163703 -0.582226 0.395844 0.586146
  -0.259541 0.557511 -0.217254 0.921295 -0.369230 0.088934
  0.000000 0.017501 -0.000000 0.771201 -0.163440 -0.219264
  0.000000 0.135389 0.000002 0.073799 -0.087178 0.227557
  0.000000 0.113741 -0.000000 -0.179596 -0.042701 0.161260
  -0.000000 0.113741 -0.000001 -0.036526 -0.008753 0.229364
  0.262165 0.811895 0.662538 0.061619 0.855041 0.512054
  -0.244069 0.811857 0.663657 0.074391 0.853445 0.511723
  0.224683 0.261800 0.775026 0.069131 -0.706771 0.234327
  0.000000 0.017499 0.000000 0.699304 -0.191667 -0.203755
  -0.000000 0.145787 -0.000000 0.137276 -0.031917 0.203255
  -0.000000 0.112094 0.000000 -0.080923 -0.069305 0.232202
  0.000000 0.111594 -0.000000 0.019662 -0.042499 0.224293
  0.365934 0.793585 0.683418 0.046999 0.705543 -0.046999
  0.000000 0.011232 0.000000 0.125929 0.784491 0.580787
  -0.000000 0.112704 -0.000000 0.249014 -0.023438 0.387487
  0.360328 0.777494 0.684141 0.046999 0.705543 -0.046999
  -0.000000 0.010075 0.000000 -0.099298 0.457446 0.813064
  0.000000 0.108887 0.000000 -0.431278 0.352681 0.307497
  -0.136625 0.803882 0.692455 0.046999 0.705543 -0.046999
  -0.000000 0.011230 0.000000 -0.014458 0.729003 0.661800
  0.000000 0.131865 0.000001 0.060053 -0.084831 0.376959
  -0.136810 0.780377 0.690930 0.046999 0.705543 -0.046999
  0.000000 0.010074 0.000000 0.055078 0.625584 0.753536
  0.000000 0.128464 -0.000002 -0.216517 -0.079868 0.360653
  -0.002195 0.809023 0.000794 0.040325 0.000217 -0.001349
  -0.014833 1.825301 -0.071422 0.467192 -0.533469 -0.463268
  0.000001 1.493901 0.000001 0.056918 0.627630 -0.678626
  -0.000000 2.103015 -0.000000 -0.813832 0.031166 0.395098
  -0.000000 1.823368 -0.000000 0.239694 0.434236 -0.213980
  0.288927 0.945606 -0.016979 -0.051799 -0.682658 -0.029464
  0.000000 0.310931 0.000000 0.000222 -0.001466 -0.002344
  -0.000000 0.255058 0.000000 -0.029967 -0.071882 -0.099367
  0.182657 0.102358 0.122067 -0.147790 0.530625 0.238904
  -0.000000 0.450619 0.000001 -0.221165 -0.001972 -0.022318
  0.000000 0.295730 -0.000000 0.099094 0.156004 -0.150746
  0.586579 1.443575 0.291630 0.494772 0.504178 0.517254
  0.081678 0.956433 -0.018380 -0.233382 -0.644819 -0.351029
  -0.000000 0.323706 -0.000001 0.060383 -0.029312 -0.532445
  0.000000 0.229678 -0.000000 0.030184 0.093463 -0.398689
  -0.151893 0.951490 -0.015787 -0.308165 -0.644000 -0.377263
  0.000000 0.298948 0.000001 0.096368 -0.030553 -0.429282
  -0.000000 0.222754 0.000001 0.006271 0.070165 -0.362053
  -0.332551 0.872253 0.059175 -0.391559 -0.056790 -0.073539
  -0.000001 0.247823 0.000000 -0.418023 0.003179 -0.041856
  -0.000000 0.155400 0.000000 -0.503510 -0.045811 -0.035998
  0.531378 1.351308 -0.004341 0.015859 0.004073 0.999866
  0.002183 1.423119 -0.451181 0.675237 0.001866 -0.002772
  0.014634 1.825495 -0.071451 0.428741 0.516759 0.554093
  0.000000 1.493901 0.000000 0.349540 0.283097 0.530542
  -0.000000 2.103016 0.000001 0.021712 0.443922 0.514843
  0.093227 1.351308 0.523154 0.654642 0.002699 0.755928
  -0.000001 1.823368 0.000001 -0.033796 0.668044 -0.270983
  0.286576 1.006395 -0.107106 0.024661 0.598348 -0.059093
  -0.000001 0.249956 0.000001 -0.029470 -0.012157 -0.324332
  0.000001 0.254363 0.000001 -0.076010 0.172998 -0.419816
  0.120542 0.102358 -0.183665 0.007174 -0.621665 0.355113
  -0.000000 0.445150 0.000000 0.209793 -0.024501 0.024184
  -0.000000 0.302324 0.000000 -0.249908 0.522697 0.319465
  0.073565 1.013166 -0.024131 0.021279 -0.812612 0.006535
  0.000001 0.266205 -0.000000 0.056286 0.004781 0.582581
  0.000000 0.229742 0.000000 -0.022528 0.184725 0.188378
  -0.127263 1.003840 0.060607 0.076599 -0.797046 0.046929
  0.000001 0.246800 0.000000 -0.008482 -0.002390 0.639305
  -0.000000 0.222127 0.000000 -0.019084 0.249633 0.025174
  -0.358085 0.893699 0.063871 0.165948 -0.779843 0.118925
  0.000001 0.221431 -0.000001 -0.065155 0.003526 0.301670
  -0.000000 0.154457 0.000000 0.132139 0.263760 0.315115
  -0.810392 0.550812 -0.372493 -0.962628 0.108345 -0.083995
  0.000000 3.626384 -0.000000 -0.391974 0.002287 0.013089
  0.782400 0.551417 -0.372917 -0.923041 -0.105863 0.052160
  -0.000000 3.626384 0.000000 -0.331759 -0.017106 -0.010401
  -1.406109 0.838118 1.299208 -0.369178 0.203943 -0.901430
  -0.090614 0.138320 1.006144 0.752092 0.018236 0.046746
  -0.090614 0.138320 1.006144 -0.852404 0.078746 -0.052999
  2.241435 0.812477 -1.543512 0.711378 -0.142690 -0.667010
  -0.005721 0.138320 -1.010200 -0.025764 -0.537679 0.842437
  -0.005721 0.138320 -1.010200 -0.753536 -0.000863 0.003278
}

frame 10 {
  -0.000000 0.000000 0.023935 -0.707107 -0.000000 -0.000000
  0.304300 6.403665 -0.106859 -0.078148 -0.540473 0.053293
  0.000000 1.240111 0.000000 0.050760 0.000121 -0.046715
  -0.000000 1.426178 0.000000 -0.180950 -0.001003 0.038836
  -0.000000 1.821085 0.000000 -0.060834 -0.194530 -0.060767
  -0.000000 0.808121 -0.000000 0.001844 -0.515148 -0.857099
  -0.044148 0.766293 0.024775 0.043943 0.018353 0.044781
  -0.003138 0.224356 0.163703 -0.582226 0.395844 0.586146
  -0.259540 0.557510 -0.217253 0.919611 -0.373850 0.089181
  0.000000 0.017501 -0.000000 0.769015 -0.163694 -0.217675
  0.000000 0.135389 0.000001 0.075494 -0.085181 0.226909
  0.000000 0.113741 -0.000000 -0.178214 -0.042510 0.162933
  0.000000 0.113741 0.000000 -0.034052 -0.008831 0.229714
  0.262164 0.811893 0.662539 0.061482 0.851638 0.517725
  -0.244069 0.811854 0.663660 0.074203 0.850063 0.517369
  0.224683 0.261799 0.775026 0.066981 -0.708686 0.229728
  0.000000 0.017499 0.000000 0.696766 -0.191392 -0.201680
  0.000000 0.145787 -0.000002 0.138598 -0.030498 0.202398
  -0.000000 0.112094 0.000000 -0.078602 -0.068272 0.232753
  -0.000000 0.111594 0.000001 0.021870 -0.042739 0.224055
  0.365934 0.793585 0.683419 0.046999 0.705543 -0.046999
  -0.000000 0.011232 0.000000 0.125932 0.784487 0.580791
  -0.000000 0.112704 0.000001 0.249006 -0.023432 0.387490
  0.360328 0.777494 0.684141 0.046999 0.705543 -0.046999
  0.000000 0.010075 0.000000 -0.099297 0.457441 0.813067
  0.000000 0.108886 0.000002 -0.431283 0.352683 0.307498
  -0.136626 0.803882 0.692455 0.046999 0.705543 -0.046999
  0.000000 0.011231 -0.000000 -0.011566 0.729756 0.661858
  -0.000000 0.131865 0.000000 0.063692 -0.083982 0.376360
  -0.136810 0.780377 0.690931 0.046999 0.705543 -0.046999
  0.000000 0.010075 -0.000000 0.058435 0.626445 0.753283
  0.000000 0.128464 0.000001 -0.213034 -0.079221 0.362720
  -0.002196 0.809023 0.000794 0.040325 0.000217 -0.001349
  -0.014833 1.825302 -0.071422 0.467192 -0.533469 -0.463268
  0.000000 1.493901 -0.000000 0.058387 0.625067 -0.680596
  -0.000000 2.103016 -0.000000 -0.813886 0.031156 0.395124
  0.000000 1.823367 -0.000000 0.236789 0.436411 -0.214208
  0.288927 0.945606 -0.016979 -0.051778 -0.682660 -0.029441
  0.000000 0.310931 -0.000000 0.000222 -0.001467 -0.002344
  -0.000000 0.255058 -0.000000 -0.029964 -0.071881 -0.099387
  0.182656 0.102358 0.122068 -0.147782 0.530625 0.238896
  0.000000 0.450617 -0.000000 -0.221157 -0.001971 -0.022320
  0.000000 0.295730 -0.000000 0.099088 0.156008 -0.150743
  0.586577 1.443575 0.291630 0.494772 0.504178 0.517254
  0.081675 0.956432 -0.018380 -0.233353 -0.644833 -0.350997
  0.000000 0.323706 0.000001 0.060389 -0.029310 -0.532509
  0.000000 0.229678 0.000000 0.030183 0.093462 -0.398652
  -0.151893 0.951490 -0.015787 -0.308134 -0.644021 -0.377225
  -0.000000 0.298947 -0.000001 0.096388 -0.030551 -0.429367
  -0.000001 0.222754 0.000001 0.006261 0.070171 -0.362003
  -0.332552 0.872253 0.059175 -0.391498 -0.056790 -0.073534
  0.000001 0.247823 0.000000 -0.418125 0.003179 -0.041863
  0.000001 0.155400 -0.000000 -0.503459 -0.045814 -0.035992
  0.531379 1.351307 -0.004340 0.015897 0.004090 0.999865
  0.002183 1.423121 -0.451181 0.675237 0.001866 -0.002772
  0.014634 1.825497 -0.071451 0.428741 0.516759 0.554093
  -0.000000 1.493901 0.000002 0.355596 0.290760 0.531127
  0.000001 2.103019 -0.000001 0.021765 0.443537 0.516076
  0.093228 1.351309 0.523154 0.654643 0.002695 0.755927
  0.000002 1.823369 0.000000 -0.036566 0.659134 -0.277449
  0.286576 1.006395 -0.107106 0.024655 0.598348 -0.059084
  0.000000 0.249955 0.000000 -0.029473 -0.012157 -0.324353
  0.000000 0.254363 -0.000000 -0.076006 0.172998 -0.419804
  0.120541 0.102358 -0.183667 0.007170 -0.621663 0.355118
  0.000001 0.445151 -0.000000 0.209813 -0.024500 0.024188
  0.000000 0.302324 -0.000000 -0.249920 0.522691 0.319466
  0.073564 1.013167 -0.024132 0.021273 -0.812612 0.006532
  0.000001 0.266206 -0.000000 0.056287 0.004781 0.582595
  -0.000000 0.229740 -0.000000 -0.022531 0.184725 0.188367
  -0.127263 1.003840 0.060607 0.076601 -0.797046 0.046930
  0.000000 0.246800 0.000000 -0.008482 -0.002390 0.639312
  -0.000000 0.222126 0.000000 -0.019088 0.249632 0.025163
  -0.358086 0.893698 0.063870 0.165947 -0.779843 0.118924
  0.000001 0.221430 0.000000 -0.065159 0.003526 0.301684
  -0.000000 0.154458 -0.000000 0.132139 0.263764 0.315101
  -0.810392 0.550813 -0.372493 -0.964523 0.109500 -0.083255
  0.000000 3.626384 0.000000 -0.382693 0.002297 0.012779
  0.782400 0.551417 -0.372918 -0.927659 -0.103305 0.052370
  0.000000 3.626383 -0.000000 -0.317337 -0.017196 -0.009949
  -1.406109 0.838118 1.299208 -0.369178 0.203943 -0.901430
  -0.090614 0.138320 1.006144 0.752092 0.018236 0.046746
  -0.090614 0.138320 1.006144 -0.852404 0.078746 -0.052999
  2.241435 0.812477 -1.543512 0.711378 -0.142690 -0.667010
  -0.005721 0.138320 -1.010200 -0.025764 -0.537679 0.842437
  -0.005721 0.138320 -1.010200 -0.753536 -0.000863 0.003278
}

