# 3ds Max Wavefront OBJ Exporter v0.97b - (c)2007 guruware
# File Created: 01.02.2014 20:25:01

mtllib Spiker_spikes_back.mtl

#
# object Object030
#

v  0.9764 6.7701 -2.8781
v  0.9843 6.6716 -2.9521
v  1.1903 9.0303 -5.9666
v  0.9032 6.6023 -3.0144
v  0.7805 6.6029 -3.0284
v  0.6881 6.6730 -2.9860
v  0.6801 6.7716 -2.9119
v  0.7612 6.8408 -2.8497
v  0.8839 6.8403 -2.8356
v  -0.6447 6.9083 -2.5359
v  -0.6350 6.8369 -2.6362
v  -2.3696 9.5770 -4.6797
v  -0.7073 6.7530 -2.6911
v  -0.8191 6.7059 -2.6683
v  -0.9051 6.7230 -2.5813
v  -0.9148 6.7945 -2.4810
v  -0.8426 6.8783 -2.4262
v  -0.7307 6.9255 -2.4489
v  -1.8913 6.2737 -1.6548
v  -1.8937 6.1840 -1.7397
v  -4.1992 8.3649 -3.8895
v  -1.9671 6.0873 -1.7626
v  -2.0686 6.0403 -1.7101
v  -2.1386 6.0705 -1.6129
v  -2.1362 6.1602 -1.5280
v  -2.0628 6.2569 -1.5051
v  -1.9614 6.3039 -1.5577
v  -0.6571 7.4178 -1.3299
v  -0.7302 7.3469 -1.3998
v  -2.2484 10.5204 -2.9218
v  -0.8440 7.3004 -1.3881
v  -0.9320 7.3057 -1.3015
v  -0.9425 7.3595 -1.1908
v  -0.8695 7.4304 -1.1209
v  -0.7556 7.4768 -1.1326
v  -0.6677 7.4716 -1.2192
v  -2.0403 7.0334 -0.8449
v  -2.1000 6.9537 -0.9179
v  -4.8199 9.5963 -1.4763
v  -2.1885 6.8691 -0.9010
v  -2.2538 6.8293 -0.8041
v  -2.2578 6.8575 -0.6839
v  -2.1982 6.9373 -0.6109
v  -2.1097 7.0218 -0.6278
v  -2.0443 7.0617 -0.7247
v  -2.6803 6.3213 -0.0533
v  -2.7077 6.2650 -0.1598
v  -6.0629 8.1179 -0.2044
v  -2.7669 6.1611 -0.1910
v  -2.8232 6.0706 -0.1286
v  -2.8437 6.0464 -0.0092
v  -2.8163 6.1027 0.0972
v  -2.7571 6.2065 0.1284
v  -2.7008 6.2971 0.0661
v  -2.7002 6.3213 1.0775
v  -2.7573 6.2650 0.9836
v  -5.9813 8.1179 1.9138
v  -2.8230 6.1611 0.9709
v  -2.8588 6.0706 1.0469
v  -2.8437 6.0464 1.1671
v  -2.7866 6.1027 1.2611
v  -2.7209 6.2065 1.2737
v  -2.6851 6.2971 1.1977
v  -2.4795 6.7663 0.9908
v  -2.5477 6.7070 0.9066
v  -5.0350 9.6231 0.9613
v  -2.6429 6.6284 0.9110
v  -2.7092 6.5764 1.0013
v  -2.7079 6.5816 1.1247
v  -2.6396 6.6408 1.2089
v  -2.5444 6.7195 1.2046
v  -2.4781 6.7714 1.1142
v  -1.7053 7.8900 1.2044
v  -1.7091 7.8959 1.0811
v  -3.9669 10.9809 1.3604
v  -1.7842 7.8513 0.9938
v  -1.8867 7.7823 0.9936
v  -1.9565 7.7293 1.0807
v  -1.9527 7.7234 1.2040
v  -1.8776 7.7680 1.2914
v  -1.7751 7.8370 1.2915
v  -0.5150 8.2172 0.1343
v  -0.5872 8.1732 0.0442
v  -2.3383 11.5786 -0.1296
v  -0.6978 8.1184 0.0399
v  -0.7820 8.0848 0.1239
v  -0.7904 8.0921 0.2469
v  -0.7182 8.1361 0.3369
v  -0.6076 8.1909 0.3412
v  -0.5234 8.2245 0.2573
v  -1.9098 6.9682 2.7885
v  -2.0011 6.9170 2.7229
v  -4.4917 9.2223 4.5048
v  -2.0789 6.8226 2.7404
v  -2.0977 6.7405 2.8307
v  -2.0464 6.7187 2.9410
v  -1.9551 6.7699 3.0065
v  -1.8773 6.8642 2.9890
v  -1.8585 6.9464 2.8987
v  -1.4885 7.4738 2.7970
v  -1.5858 7.4399 2.7289
v  -3.7242 9.9920 4.6282
v  -1.6768 7.3572 2.7416
v  -1.7080 7.2743 2.8276
v  -1.6613 7.2395 2.9365
v  -1.5640 7.2734 3.0046
v  -1.4730 7.3561 2.9919
v  -1.4418 7.4390 2.9059
v  -0.7260 8.2091 2.2715
v  -0.7381 8.2333 2.1510
v  -1.9781 11.7485 3.0448
v  -0.8299 8.2240 2.0688
v  -0.9476 8.1866 2.0732
v  -1.0222 8.1431 2.1615
v  -1.0100 8.1189 2.2820
v  -0.9182 8.1282 2.3641
v  -0.8006 8.1656 2.3598
v  0.6206 8.1340 2.3080
v  0.5999 8.1927 2.2013
v  1.3601 11.5167 3.9523
v  0.5016 8.2454 2.1483
v  0.3833 8.2613 2.1800
v  0.3143 8.2311 2.2779
v  0.3350 8.1724 2.3846
v  0.4333 8.1197 2.4376
v  0.5516 8.1038 2.4059
v  0.9739 7.3387 2.9121
v  0.9519 7.4403 2.8455
v  1.9139 9.5674 5.8857
v  0.8541 7.5137 2.8276
v  0.7378 7.5157 2.8691
v  0.6711 7.4453 2.9455
v  0.6930 7.3436 3.0122
v  0.7908 7.2703 3.0300
v  0.9072 7.2683 2.9886
v  1.8488 7.2142 2.8819
v  1.8286 7.3137 2.8115
v  3.5906 9.4626 5.4517
v  1.7396 7.3990 2.8043
v  1.6339 7.4202 2.8646
v  1.5734 7.3649 2.9570
v  1.5936 7.2654 3.0273
v  1.6826 7.1801 3.0345
v  1.7883 7.1588 2.9743
v  2.1832 7.2082 1.8691
v  2.1242 7.3000 1.8112
v  4.6467 9.7753 3.2952
v  2.0331 7.3779 1.8411
v  1.9634 7.3963 1.9414
v  1.9558 7.3444 2.0532
v  2.0148 7.2526 2.1111
v  2.1059 7.1747 2.0812
v  2.1756 7.1563 1.9809
v  0.9801 8.2552 0.5899
v  0.9035 8.2878 0.4987
v  1.8293 11.9555 1.1185
v  0.7847 8.3210 0.4921
v  0.6933 8.3353 0.5740
v  0.6829 8.3222 0.6963
v  0.7595 8.2896 0.7876
v  0.8783 8.2564 0.7941
v  0.9697 8.2421 0.7123
v  1.1931 7.8919 -0.8603
v  1.1289 7.9019 -0.9654
v  2.8832 11.2411 -1.6476
v  1.0216 7.9540 -0.9975
v  0.9341 8.0176 -0.9379
v  0.9176 8.0556 -0.8215
v  0.9819 8.0456 -0.7165
v  1.0892 7.9935 -0.6844
v  1.1767 7.9298 -0.7439
v  2.1168 7.3519 0.6247
v  2.0610 7.4219 0.5396
v  4.9646 9.9132 0.7747
v  1.9820 7.5167 0.5426
v  1.9260 7.5809 0.6320
v  1.9258 7.5769 0.7555
v  1.9816 7.5069 0.8406
v  2.0607 7.4120 0.8376
v  2.1166 7.3478 0.7481
v  2.4863 6.5754 0.1271
v  2.4554 6.6599 0.0425
v  5.9764 8.1473 0.3310
v  2.4090 6.7743 0.0462
v  2.3742 6.8515 0.1360
v  2.3715 6.8464 0.2594
v  2.4024 6.7620 0.3440
v  2.4488 6.6476 0.3403
v  2.4836 6.5703 0.2505
v  2.0208 6.9177 -1.5162
v  1.9545 6.9311 -1.6195
v  4.6181 9.3490 -2.9433
v  1.8671 7.0097 -1.6576
v  1.8099 7.1074 -1.6082
v  1.8164 7.1670 -1.5002
v  1.8827 7.1536 -1.3969
v  1.9701 7.0750 -1.3588
v  2.0273 6.9774 -1.4082
v  1.0408 7.3985 -1.9022
v  1.0359 7.3362 -2.0087
v  2.6551 10.3339 -3.7651
v  0.9548 7.3282 -2.1015
v  0.8450 7.3791 -2.1263
v  0.7709 7.4592 -2.0684
v  0.7758 7.5215 -1.9619
v  0.8569 7.5295 -1.8690
v  0.9667 7.4786 -1.8443
v  0.7877 6.4388 3.9365
v  0.7741 6.5516 3.8881
v  1.2315 8.0420 7.3899
v  0.6788 6.6281 3.8701
v  0.5575 6.6234 3.8932
v  0.4814 6.5403 3.9438
v  0.4950 6.4275 3.9922
v  0.5903 6.3511 4.0101
v  0.7115 6.3557 3.9870
v  1.3998 6.2966 3.7963
v  1.3810 6.4118 3.7559
v  2.3515 7.7199 7.2258
v  1.2851 6.4897 3.7556
v  1.1683 6.4846 3.7955
v  1.0990 6.3996 3.8522
v  1.1178 6.2844 3.8926
v  1.2137 6.2065 3.8930
v  1.3305 6.2116 3.8531
v  -1.0323 6.8021 3.6366
v  -1.1354 6.8458 3.5845
v  -2.0380 8.5162 6.9143
v  -1.2520 6.8063 3.5750
v  -1.3139 6.7066 3.6137
v  -1.2847 6.6052 3.6780
v  -1.1817 6.5615 3.7302
v  -1.0650 6.6011 3.7397
v  -1.0032 6.7007 3.7009
# 234 vertices

vn 0.8963 0.3260 0.3006
vn 0.9457 -0.2841 -0.1577
vn 0.0935 0.6028 -0.7924
vn 0.4435 -0.7129 -0.5432
vn -0.3162 -0.7092 -0.6300
vn -0.8884 -0.2752 -0.3674
vn -0.9379 0.3349 0.0910
vn -0.4356 0.7637 0.4765
vn 0.3241 0.7600 0.5633
vn 0.7885 0.6038 0.1173
vn 0.8486 0.1616 -0.5037
vn -0.4164 0.7210 -0.5539
vn 0.4014 -0.3575 -0.8432
vn -0.2912 -0.6494 -0.7025
vn -0.8235 -0.5431 -0.1639
vn -0.8837 -0.1009 0.4570
vn -0.4365 0.4182 0.7966
vn 0.2561 0.7101 0.6559
vn 0.7414 0.6530 -0.1546
vn 0.7266 0.0977 -0.6801
vn -0.5703 0.5726 -0.5889
vn 0.2721 -0.5007 -0.8217
vn -0.3559 -0.7917 -0.4965
vn -0.7894 -0.6048 0.1050
vn -0.7746 -0.0495 0.6305
vn -0.3201 0.5490 0.7721
vn 0.3079 0.8399 0.4469
vn 0.8675 0.2147 -0.4486
vn 0.4152 -0.2242 -0.8817
vn -0.3782 0.8177 -0.4339
vn -0.2896 -0.5116 -0.8089
vn -0.8342 -0.4792 -0.2730
vn -0.8994 -0.1459 0.4121
vn -0.4471 0.2931 0.8451
vn 0.2578 0.5805 0.7724
vn 0.8023 0.5480 0.2365
vn 0.6440 0.5737 -0.5062
vn 0.2744 0.0799 -0.9583
vn -0.6974 0.6922 -0.1859
vn -0.2731 -0.4436 -0.8536
vn -0.6778 -0.6902 -0.2535
vn -0.7027 -0.5154 0.4905
vn -0.3331 -0.0216 0.9426
vn 0.2144 0.5019 0.8380
vn 0.6191 0.7484 0.2379
vn 0.4694 0.8721 -0.1384
vn 0.2997 0.5235 -0.7975
vn -0.8619 0.5050 -0.0452
vn -0.0668 -0.1192 -0.9906
vn -0.4154 -0.6797 -0.6045
vn -0.5420 -0.8296 0.1346
vn -0.3723 -0.4810 0.7937
vn -0.0058 0.1618 0.9868
vn 0.3428 0.7222 0.6007
vn 0.4091 0.8721 -0.2686
vn 0.0556 0.5235 -0.8502
vn -0.8380 0.5050 0.2067
vn -0.3511 -0.1192 -0.9287
vn -0.5728 -0.6797 -0.4581
vn -0.4796 -0.8296 0.2860
vn -0.1261 -0.4810 0.8676
vn 0.2806 0.1618 0.9461
vn 0.5023 0.7222 0.4755
vn 0.6801 0.6040 -0.4155
vn 0.2575 0.2372 -0.9367
vn -0.6375 0.7701 -0.0252
vn -0.3316 -0.2496 -0.9098
vn -0.7422 -0.5712 -0.3506
vn -0.7337 -0.5392 0.4134
vn -0.3112 -0.1724 0.9346
vn 0.2779 0.3144 0.9077
vn 0.6885 0.6360 0.3485
vn 0.7538 0.5321 0.3854
vn 0.7305 0.5688 -0.3780
vn -0.5577 0.8281 0.0569
vn 0.2654 0.2927 -0.9186
vn -0.3689 -0.1344 -0.9197
vn -0.8008 -0.4624 -0.3806
vn -0.7774 -0.4991 0.3828
vn -0.3124 -0.2230 0.9234
vn 0.3219 0.2042 0.9245
vn 0.8341 0.4248 -0.3520
vn 0.3869 0.1525 -0.9094
vn -0.4402 0.8940 -0.0836
vn -0.2977 -0.1870 -0.9362
vn -0.8188 -0.3950 -0.4166
vn -0.8711 -0.3495 0.3450
vn -0.4240 -0.0773 0.9024
vn 0.2607 0.2623 0.9291
vn 0.7818 0.4702 0.4095
vn 0.3953 0.7985 -0.4541
vn -0.1698 0.4812 -0.8600
vn -0.6564 0.6211 0.4282
vn -0.6516 -0.1026 -0.7516
vn -0.7679 -0.6110 -0.1923
vn -0.4505 -0.7462 0.4901
vn 0.1146 -0.4289 0.8960
vn 0.5964 0.1549 0.7876
vn 0.7126 0.6633 0.2284
vn 0.5113 0.7539 -0.4125
vn -0.0913 0.5442 -0.8340
vn -0.5612 0.6881 0.4599
vn -0.6543 0.0326 -0.7556
vn -0.8478 -0.4811 -0.2232
vn -0.5586 -0.6960 0.4513
vn 0.0440 -0.4862 0.8727
vn 0.6070 0.0253 0.7943
vn 0.8005 0.5390 0.2619
vn 0.9047 0.2436 0.3496
vn 0.8295 0.3934 -0.3965
vn -0.2883 0.9328 0.2163
vn 0.2613 0.3357 -0.9050
vn -0.4671 0.1044 -0.8780
vn -0.9289 -0.1651 -0.3314
vn -0.8537 -0.3149 0.4147
vn -0.2855 -0.2572 0.9232
vn 0.4428 -0.0258 0.8962
vn 0.9581 -0.2637 0.1116
vn 0.8299 0.0994 -0.5490
vn 0.2331 0.8706 0.4333
vn 0.2212 0.4258 -0.8774
vn -0.5113 0.5242 -0.6810
vn -0.9385 0.3370 -0.0751
vn -0.8102 -0.0261 0.5855
vn -0.2016 -0.3525 0.9139
vn 0.5309 -0.4509 0.7175
vn 0.9494 -0.3059 -0.0708
vn 0.8134 0.3233 -0.4836
vn 0.2850 0.5680 0.7721
vn 0.2080 0.7771 -0.5940
vn -0.5123 0.7898 -0.3374
vn -0.9254 0.3538 0.1358
vn -0.7894 -0.2755 0.5486
vn -0.1840 -0.7293 0.6590
vn 0.5363 -0.7419 0.4024
vn 0.8731 -0.4425 -0.2046
vn 0.7483 0.1733 -0.6404
vn 0.4908 0.5674 0.6612
vn 0.1972 0.7016 -0.6847
vn -0.4573 0.8329 -0.3117
vn -0.8318 0.4903 0.2603
vn -0.7069 -0.1255 0.6961
vn -0.1559 -0.6538 0.7404
vn 0.4986 -0.7851 0.3674
vn 0.7322 -0.3941 -0.5555
vn 0.3668 0.1741 -0.9139
vn 0.6729 0.6525 0.3484
vn -0.1968 0.6563 -0.7283
vn -0.6286 0.7702 -0.1076
vn -0.6756 0.4490 0.5848
vn -0.3102 -0.1191 0.9432
vn 0.2535 -0.6014 0.7577
vn 0.6853 -0.7153 0.1369
vn 0.9310 -0.1673 -0.3244
vn 0.4566 0.0350 -0.8890
vn 0.2606 0.9574 0.1241
vn -0.2788 0.2404 -0.9298
vn -0.8445 0.3286 -0.4229
vn -0.9091 0.2479 0.3348
vn -0.4347 0.0457 0.8994
vn 0.3008 -0.1598 0.9402
vn 0.8665 -0.2480 0.4333
vn 0.8728 -0.4708 -0.1290
vn 0.4751 -0.4088 -0.7792
vn 0.4773 0.8531 -0.2106
vn -0.1891 -0.0863 -0.9782
vn -0.7308 0.3077 -0.6093
vn -0.8326 0.5426 0.1113
vn -0.4349 0.4806 0.7615
vn 0.2293 0.1582 0.9604
vn 0.7710 -0.2359 0.5916
vn 0.6234 -0.6695 -0.4040
vn 0.2781 -0.2362 -0.9310
vn 0.7685 0.6394 0.0221
vn -0.2112 0.3511 -0.9122
vn -0.5578 0.7486 -0.3585
vn -0.5587 0.7233 0.4058
vn -0.2134 0.2901 0.9329
vn 0.2759 -0.2973 0.9141
vn 0.6225 -0.6948 0.3603
vn 0.3946 -0.8233 -0.4081
vn 0.2032 -0.3002 -0.9320
vn 0.9263 0.3751 0.0360
vn -0.0844 0.4080 -0.9091
vn -0.2998 0.8864 -0.3528
vn -0.3166 0.8548 0.4111
vn -0.1252 0.3318 0.9350
vn 0.1624 -0.3764 0.9121
vn 0.3778 -0.8548 0.3558
vn 0.6626 -0.7461 -0.0653
vn 0.2517 -0.6632 -0.7048
vn 0.7049 0.6023 -0.3747
vn -0.2892 -0.1769 -0.9408
vn -0.6433 0.4279 -0.6349
vn -0.6032 0.7969 0.0337
vn -0.1924 0.7139 0.6733
vn 0.3486 0.2276 0.9092
vn 0.7027 -0.3771 0.6033
vn 0.8548 -0.1559 0.4950
vn 0.8243 -0.5417 -0.1645
vn 0.4568 0.7585 -0.4648
vn 0.3223 -0.5914 -0.7392
vn -0.3573 -0.2760 -0.8923
vn -0.8163 0.2198 -0.5342
vn -0.7859 0.6055 0.1254
vn -0.2838 0.6553 0.7000
vn 0.3958 0.3399 0.8531
vn 0.9547 -0.2972 0.0153
vn 0.8707 0.4012 -0.2845
vn 0.1559 0.4054 0.9008
vn 0.2805 0.8746 -0.3954
vn -0.4702 0.8457 -0.2525
vn -0.9416 0.3313 0.0606
vn -0.8575 -0.3671 0.3603
vn -0.2673 -0.8405 0.4712
vn 0.4833 -0.8116 0.3283
vn 0.9431 -0.3035 -0.1357
vn 0.8267 0.4097 -0.3857
vn 0.2878 0.3582 0.8882
vn 0.2331 0.8918 -0.3878
vn -0.4899 0.8603 -0.1408
vn -0.9189 0.3337 0.2105
vn -0.8024 -0.3795 0.4605
vn -0.2089 -0.8616 0.4626
vn 0.5142 -0.8302 0.2156
vn 0.7717 0.6292 -0.0923
vn 0.1336 0.8999 -0.4152
vn -0.2297 0.4733 0.8505
vn -0.5885 0.6551 -0.4739
vn -0.9715 0.0382 -0.2341
vn -0.7911 -0.5894 0.1639
vn -0.1529 -0.8600 0.4868
vn 0.5691 -0.6152 0.5456
vn 0.9521 0.0017 0.3057
# 234 vertex normals

vt 0.9185 0.0163 1.0000
vt 0.9498 0.0241 1.0000
vt 0.8867 0.2623 0.0000
vt 0.9795 0.0357 1.0000
vt 0.7304 0.0574 1.0000
vt 0.7591 0.0403 1.0000
vt 0.7896 0.0271 1.0000
vt 0.8214 0.0181 1.0000
vt 0.8538 0.0133 1.0000
vt 0.8864 0.0127 1.0000
# 10 texture coords

g Object030
usemtl Material__3
s 8
f 1/1/1 2/2/2 3/3/3 
f 2/2/2 4/4/4 3/3/3 
f 4/5/4 5/6/5 3/3/3 
f 5/6/5 6/7/6 3/3/3 
f 6/7/6 7/8/7 3/3/3 
f 7/8/7 8/9/8 3/3/3 
f 8/9/8 9/10/9 3/3/3 
f 9/10/9 1/1/1 3/3/3 
f 10/1/10 11/2/11 12/3/12 
f 11/2/11 13/4/13 12/3/12 
f 13/5/13 14/6/14 12/3/12 
f 14/6/14 15/7/15 12/3/12 
f 15/7/15 16/8/16 12/3/12 
f 16/8/16 17/9/17 12/3/12 
f 17/9/17 18/10/18 12/3/12 
f 18/10/18 10/1/10 12/3/12 
f 19/1/19 20/2/20 21/3/21 
f 20/2/20 22/4/22 21/3/21 
f 22/5/22 23/6/23 21/3/21 
f 23/6/23 24/7/24 21/3/21 
f 24/7/24 25/8/25 21/3/21 
f 25/8/25 26/9/26 21/3/21 
f 26/9/26 27/10/27 21/3/21 
f 27/10/27 19/1/19 21/3/21 
f 28/1/28 29/2/29 30/3/30 
f 29/2/29 31/4/31 30/3/30 
f 31/5/31 32/6/32 30/3/30 
f 32/6/32 33/7/33 30/3/30 
f 33/7/33 34/8/34 30/3/30 
f 34/8/34 35/9/35 30/3/30 
f 35/9/35 36/10/36 30/3/30 
f 36/10/36 28/1/28 30/3/30 
f 37/1/37 38/2/38 39/3/39 
f 38/2/38 40/4/40 39/3/39 
f 40/5/40 41/6/41 39/3/39 
f 41/6/41 42/7/42 39/3/39 
f 42/7/42 43/8/43 39/3/39 
f 43/8/43 44/9/44 39/3/39 
f 44/9/44 45/10/45 39/3/39 
f 45/10/45 37/1/37 39/3/39 
f 46/1/46 47/2/47 48/3/48 
f 47/2/47 49/4/49 48/3/48 
f 49/5/49 50/6/50 48/3/48 
f 50/6/50 51/7/51 48/3/48 
f 51/7/51 52/8/52 48/3/48 
f 52/8/52 53/9/53 48/3/48 
f 53/9/53 54/10/54 48/3/48 
f 54/10/54 46/1/46 48/3/48 
f 55/1/55 56/2/56 57/3/57 
f 56/2/56 58/4/58 57/3/57 
f 58/5/58 59/6/59 57/3/57 
f 59/6/59 60/7/60 57/3/57 
f 60/7/60 61/8/61 57/3/57 
f 61/8/61 62/9/62 57/3/57 
f 62/9/62 63/10/63 57/3/57 
f 63/10/63 55/1/55 57/3/57 
f 64/1/64 65/2/65 66/3/66 
f 65/2/65 67/4/67 66/3/66 
f 67/5/67 68/6/68 66/3/66 
f 68/6/68 69/7/69 66/3/66 
f 69/7/69 70/8/70 66/3/66 
f 70/8/70 71/9/71 66/3/66 
f 71/9/71 72/10/72 66/3/66 
f 72/10/72 64/1/64 66/3/66 
f 73/1/73 74/2/74 75/3/75 
f 74/2/74 76/4/76 75/3/75 
f 76/5/76 77/6/77 75/3/75 
f 77/6/77 78/7/78 75/3/75 
f 78/7/78 79/8/79 75/3/75 
f 79/8/79 80/9/80 75/3/75 
f 80/9/80 81/10/81 75/3/75 
f 81/10/81 73/1/73 75/3/75 
f 82/1/82 83/2/83 84/3/84 
f 83/2/83 85/4/85 84/3/84 
f 85/5/85 86/6/86 84/3/84 
f 86/6/86 87/7/87 84/3/84 
f 87/7/87 88/8/88 84/3/84 
f 88/8/88 89/9/89 84/3/84 
f 89/9/89 90/10/90 84/3/84 
f 90/10/90 82/1/82 84/3/84 
f 91/1/91 92/2/92 93/3/93 
f 92/2/92 94/4/94 93/3/93 
f 94/5/94 95/6/95 93/3/93 
f 95/6/95 96/7/96 93/3/93 
f 96/7/96 97/8/97 93/3/93 
f 97/8/97 98/9/98 93/3/93 
f 98/9/98 99/10/99 93/3/93 
f 99/10/99 91/1/91 93/3/93 
f 100/1/100 101/2/101 102/3/102 
f 101/2/101 103/4/103 102/3/102 
f 103/5/103 104/6/104 102/3/102 
f 104/6/104 105/7/105 102/3/102 
f 105/7/105 106/8/106 102/3/102 
f 106/8/106 107/9/107 102/3/102 
f 107/9/107 108/10/108 102/3/102 
f 108/10/108 100/1/100 102/3/102 
f 109/1/109 110/2/110 111/3/111 
f 110/2/110 112/4/112 111/3/111 
f 112/5/112 113/6/113 111/3/111 
f 113/6/113 114/7/114 111/3/111 
f 114/7/114 115/8/115 111/3/111 
f 115/8/115 116/9/116 111/3/111 
f 116/9/116 117/10/117 111/3/111 
f 117/10/117 109/1/109 111/3/111 
f 118/1/118 119/2/119 120/3/120 
f 119/2/119 121/4/121 120/3/120 
f 121/5/121 122/6/122 120/3/120 
f 122/6/122 123/7/123 120/3/120 
f 123/7/123 124/8/124 120/3/120 
f 124/8/124 125/9/125 120/3/120 
f 125/9/125 126/10/126 120/3/120 
f 126/10/126 118/1/118 120/3/120 
f 127/1/127 128/2/128 129/3/129 
f 128/2/128 130/4/130 129/3/129 
f 130/5/130 131/6/131 129/3/129 
f 131/6/131 132/7/132 129/3/129 
f 132/7/132 133/8/133 129/3/129 
f 133/8/133 134/9/134 129/3/129 
f 134/9/134 135/10/135 129/3/129 
f 135/10/135 127/1/127 129/3/129 
f 136/1/136 137/2/137 138/3/138 
f 137/2/137 139/4/139 138/3/138 
f 139/5/139 140/6/140 138/3/138 
f 140/6/140 141/7/141 138/3/138 
f 141/7/141 142/8/142 138/3/138 
f 142/8/142 143/9/143 138/3/138 
f 143/9/143 144/10/144 138/3/138 
f 144/10/144 136/1/136 138/3/138 
f 145/1/145 146/2/146 147/3/147 
f 146/2/146 148/4/148 147/3/147 
f 148/5/148 149/6/149 147/3/147 
f 149/6/149 150/7/150 147/3/147 
f 150/7/150 151/8/151 147/3/147 
f 151/8/151 152/9/152 147/3/147 
f 152/9/152 153/10/153 147/3/147 
f 153/10/153 145/1/145 147/3/147 
f 154/1/154 155/2/155 156/3/156 
f 155/2/155 157/4/157 156/3/156 
f 157/5/157 158/6/158 156/3/156 
f 158/6/158 159/7/159 156/3/156 
f 159/7/159 160/8/160 156/3/156 
f 160/8/160 161/9/161 156/3/156 
f 161/9/161 162/10/162 156/3/156 
f 162/10/162 154/1/154 156/3/156 
f 163/1/163 164/2/164 165/3/165 
f 164/2/164 166/4/166 165/3/165 
f 166/5/166 167/6/167 165/3/165 
f 167/6/167 168/7/168 165/3/165 
f 168/7/168 169/8/169 165/3/165 
f 169/8/169 170/9/170 165/3/165 
f 170/9/170 171/10/171 165/3/165 
f 171/10/171 163/1/163 165/3/165 
f 172/1/172 173/2/173 174/3/174 
f 173/2/173 175/4/175 174/3/174 
f 175/5/175 176/6/176 174/3/174 
f 176/6/176 177/7/177 174/3/174 
f 177/7/177 178/8/178 174/3/174 
f 178/8/178 179/9/179 174/3/174 
f 179/9/179 180/10/180 174/3/174 
f 180/10/180 172/1/172 174/3/174 
f 181/1/181 182/2/182 183/3/183 
f 182/2/182 184/4/184 183/3/183 
f 184/5/184 185/6/185 183/3/183 
f 185/6/185 186/7/186 183/3/183 
f 186/7/186 187/8/187 183/3/183 
f 187/8/187 188/9/188 183/3/183 
f 188/9/188 189/10/189 183/3/183 
f 189/10/189 181/1/181 183/3/183 
f 190/1/190 191/2/191 192/3/192 
f 191/2/191 193/4/193 192/3/192 
f 193/5/193 194/6/194 192/3/192 
f 194/6/194 195/7/195 192/3/192 
f 195/7/195 196/8/196 192/3/192 
f 196/8/196 197/9/197 192/3/192 
f 197/9/197 198/10/198 192/3/192 
f 198/10/198 190/1/190 192/3/192 
f 199/1/199 200/2/200 201/3/201 
f 200/2/200 202/4/202 201/3/201 
f 202/5/202 203/6/203 201/3/201 
f 203/6/203 204/7/204 201/3/201 
f 204/7/204 205/8/205 201/3/201 
f 205/8/205 206/9/206 201/3/201 
f 206/9/206 207/10/207 201/3/201 
f 207/10/207 199/1/199 201/3/201 
f 208/1/208 209/2/209 210/3/210 
f 209/2/209 211/4/211 210/3/210 
f 211/5/211 212/6/212 210/3/210 
f 212/6/212 213/7/213 210/3/210 
f 213/7/213 214/8/214 210/3/210 
f 214/8/214 215/9/215 210/3/210 
f 215/9/215 216/10/216 210/3/210 
f 216/10/216 208/1/208 210/3/210 
f 217/1/217 218/2/218 219/3/219 
f 218/2/218 220/4/220 219/3/219 
f 220/5/220 221/6/221 219/3/219 
f 221/6/221 222/7/222 219/3/219 
f 222/7/222 223/8/223 219/3/219 
f 223/8/223 224/9/224 219/3/219 
f 224/9/224 225/10/225 219/3/219 
f 225/10/225 217/1/217 219/3/219 
f 226/1/226 227/2/227 228/3/228 
f 227/2/227 229/4/229 228/3/228 
f 229/5/229 230/6/230 228/3/228 
f 230/6/230 231/7/231 228/3/228 
f 231/7/231 232/8/232 228/3/228 
f 232/8/232 233/9/233 228/3/228 
f 233/9/233 234/10/234 228/3/228 
f 234/10/234 226/1/226 228/3/228 
# 0 polygons - 208 triangles

