MD5Version 10
commandline ""

numFrames 31
numJoints 46
frameRate 60
numAnimatedComponents 276

hierarchy {
	"origin"	-1 63 0	//
	"chest"	0 63 6	// origin
	"tail"	1 63 12	// chest
	"leg0_upper"	1 63 18	// chest
	"leg0_lower"	3 63 24	// leg0_upper
	"leg5_upper"	1 63 30	// chest
	"leg5_lower"	5 63 36	// leg5_upper
	"leg4_upper"	1 63 42	// chest
	"leg4_lower"	7 63 48	// leg4_upper
	"leg1_upper"	1 63 54	// chest
	"leg1_lower"	9 63 60	// leg1_upper
	"leg3_upper"	1 63 66	// chest
	"leg3_lower"	11 63 72	// leg3_upper
	"leg2_upper"	1 63 78	// chest
	"leg2_lower"	13 63 84	// leg2_upper
	"antenna_upper_left0"	1 63 90	// chest
	"antenna_upper_left1"	15 63 96	// antenna_upper_left0
	"antenna_upper_right0"	1 63 102	// chest
	"antenna_upper_right1"	17 63 108	// antenna_upper_right0
	"antenna_right0"	1 63 114	// chest
	"antenna_right1"	19 63 120	// antenna_right0
	"antenna_left0"	1 63 126	// chest
	"antenna_left1"	21 63 132	// antenna_left0
	"antenna_lower_left0"	1 63 138	// chest
	"antenna_lower_left1"	23 63 144	// antenna_lower_left0
	"antenna_lower_right0"	1 63 150	// chest
	"antenna_lower_right1"	25 63 156	// antenna_lower_right0
	"IKantenna_right"	1 63 162	// chest
	"IKantenna_left"	1 63 168	// chest
	"IKantenna_upper_left"	1 63 174	// chest
	"IKantenna_upper_right"	1 63 180	// chest
	"IKantenna_lower_left"	1 63 186	// chest
	"IKantenna_lower_right"	1 63 192	// chest
	"IKleg0"	0 63 198	// origin
	"IKleg0_upper"	0 63 204	// origin
	"IKleg1"	0 63 210	// origin
	"IKleg1_upper"	0 63 216	// origin
	"IKleg5"	0 63 222	// origin
	"IKleg5_upper"	0 63 228	// origin
	"IKleg4"	0 63 234	// origin
	"IKleg4_upper"	0 63 240	// origin
	"IKleg3"	0 63 246	// origin
	"IKleg3_upper"	0 63 252	// origin
	"IKleg2"	0 63 258	// origin
	"IKIKleg2_upper"	0 63 264	// origin
	"IKtail"	0 63 270	// origin
}

bounds {
	( 0.000000 0.000000 0.000000 ) ( 0.000000 0.000000 0.000000 )
	( 0.000000 0.000000 0.000000 ) ( 0.000000 0.000000 0.000000 )
	( 0.000000 0.000000 0.000000 ) ( 0.000000 0.000000 0.000000 )
	( 0.000000 0.000000 0.000000 ) ( 0.000000 0.000000 0.000000 )
	( 0.000000 0.000000 0.000000 ) ( 0.000000 0.000000 0.000000 )
	( 0.000000 0.000000 0.000000 ) ( 0.000000 0.000000 0.000000 )
	( 0.000000 0.000000 0.000000 ) ( 0.000000 0.000000 0.000000 )
	( 0.000000 0.000000 0.000000 ) ( 0.000000 0.000000 0.000000 )
	( 0.000000 0.000000 0.000000 ) ( 0.000000 0.000000 0.000000 )
	( 0.000000 0.000000 0.000000 ) ( 0.000000 0.000000 0.000000 )
	( 0.000000 0.000000 0.000000 ) ( 0.000000 0.000000 0.000000 )
	( 0.000000 0.000000 0.000000 ) ( 0.000000 0.000000 0.000000 )
	( 0.000000 0.000000 0.000000 ) ( 0.000000 0.000000 0.000000 )
	( 0.000000 0.000000 0.000000 ) ( 0.000000 0.000000 0.000000 )
	( 0.000000 0.000000 0.000000 ) ( 0.000000 0.000000 0.000000 )
	( 0.000000 0.000000 0.000000 ) ( 0.000000 0.000000 0.000000 )
	( 0.000000 0.000000 0.000000 ) ( 0.000000 0.000000 0.000000 )
	( 0.000000 0.000000 0.000000 ) ( 0.000000 0.000000 0.000000 )
	( 0.000000 0.000000 0.000000 ) ( 0.000000 0.000000 0.000000 )
	( 0.000000 0.000000 0.000000 ) ( 0.000000 0.000000 0.000000 )
	( 0.000000 0.000000 0.000000 ) ( 0.000000 0.000000 0.000000 )
	( 0.000000 0.000000 0.000000 ) ( 0.000000 0.000000 0.000000 )
	( 0.000000 0.000000 0.000000 ) ( 0.000000 0.000000 0.000000 )
	( 0.000000 0.000000 0.000000 ) ( 0.000000 0.000000 0.000000 )
	( 0.000000 0.000000 0.000000 ) ( 0.000000 0.000000 0.000000 )
	( 0.000000 0.000000 0.000000 ) ( 0.000000 0.000000 0.000000 )
	( 0.000000 0.000000 0.000000 ) ( 0.000000 0.000000 0.000000 )
	( 0.000000 0.000000 0.000000 ) ( 0.000000 0.000000 0.000000 )
	( 0.000000 0.000000 0.000000 ) ( 0.000000 0.000000 0.000000 )
	( 0.000000 0.000000 0.000000 ) ( 0.000000 0.000000 0.000000 )
	( 0.000000 0.000000 0.000000 ) ( 0.000000 0.000000 0.000000 )
}

baseframe {
	( -0.018897 0.000000 0.100036 ) ( -0.707107 -0.000000 0.000000 )
	( 0.312367 -0.360185 -0.004892 ) ( 0.496413 -0.503564 0.496625 )
	( -0.000000 0.520055 0.000000 ) ( 0.178497 -0.000622 -0.003720 )
	( -0.136732 0.038257 0.004402 ) ( 0.147673 0.125439 0.674731 )
	( 0.000000 0.447469 -0.000000 ) ( -0.288153 -0.339784 0.838878 )
	( 0.151140 0.042027 0.014281 ) ( 0.136578 -0.118766 -0.681613 )
	( 0.000000 0.437615 -0.000000 ) ( -0.289056 0.349836 -0.831773 )
	( 0.162623 0.221463 -0.011451 ) ( 0.117944 -0.043029 -0.407657 )
	( 0.000000 0.501200 -0.000000 ) ( -0.519802 -0.014924 0.052609 )
	( -0.162016 0.218096 -0.011498 ) ( 0.116163 0.038814 0.404078 )
	( 0.000000 0.492872 0.000000 ) ( -0.515809 0.011248 -0.048502 )
	( 0.142976 0.370391 -0.009384 ) ( -0.001600 0.000475 -0.113450 )
	( -0.000000 0.422763 -0.000000 ) ( -0.443406 0.047551 -0.096794 )
	( -0.137594 0.373323 -0.014729 ) ( -0.001093 -0.003333 0.114207 )
	( 0.000000 0.421663 -0.000000 ) ( -0.449049 -0.045680 0.088258 )
	( 0.035670 -0.040818 0.060014 ) ( -0.018181 0.047886 -0.998486 )
	( 0.000000 0.026025 0.000000 ) ( -0.002853 0.033945 -0.001202 )
	( -0.027674 -0.041720 0.059816 ) ( -0.052107 -0.046785 0.997231 )
	( 0.000000 0.025637 0.000000 ) ( -0.001972 -0.121503 0.002943 )
	( -0.050906 -0.034136 0.024111 ) ( -0.058393 -0.145779 0.987384 )
	( 0.000000 0.049218 0.000000 ) ( -0.001273 -0.130147 0.004151 )
	( 0.059788 -0.034178 0.023788 ) ( -0.058967 0.144900 -0.987571 )
	( -0.000000 0.049218 -0.000000 ) ( -0.001261 0.129525 -0.004153 )
	( 0.032298 -0.054366 -0.002832 ) ( -0.005735 0.051282 0.998667 )
	( 0.000000 0.018246 -0.000000 ) ( -0.000223 -0.105798 -0.003347 )
	( -0.026453 -0.054341 -0.002832 ) ( -0.011413 -0.051461 -0.998493 )
	( 0.000000 0.018247 -0.000000 ) ( -0.000219 0.104659 0.003397 )
	( -0.053205 -0.156103 -0.013104 ) ( 0.083867 -0.236072 -0.951085 )
	( 0.060800 -0.156152 -0.013104 ) ( 0.083973 0.236037 0.951008 )
	( 0.038704 -0.122207 0.051886 ) ( -0.000097 -0.468376 0.883529 )
	( -0.031079 -0.122177 0.051886 ) ( -0.000097 -0.468376 0.883529 )
	( 0.031859 -0.116268 0.003550 ) ( 0.080502 0.440954 0.880320 )
	( -0.024230 -0.116244 0.003550 ) ( 0.080308 -0.440987 -0.880387 )
	( 0.474768 0.072944 -0.404259 ) ( 0.000374 0.707079 0.000000 )
	( 0.252528 -0.529487 -0.555359 ) ( -0.000000 -0.250468 0.968125 )
	( -0.581522 0.073430 -0.831409 ) ( 0.000374 0.707079 0.000000 )
	( -0.213911 -0.457952 -0.518543 ) ( 0.339129 -0.234470 0.906822 )
	( 0.474768 0.072944 0.404512 ) ( 0.000374 0.707079 0.000000 )
	( 0.252528 -0.529487 0.555269 ) ( 0.968125 -0.000000 0.000000 )
	( -0.581523 0.067522 0.830352 ) ( 0.000374 0.707107 0.000000 )
	( -0.223781 -0.456157 0.514222 ) ( 0.906822 -0.087686 0.339129 )
	( -0.740141 0.073430 0.364709 ) ( 0.000374 0.707079 0.000000 )
	( -0.450942 -0.330299 0.228546 ) ( 0.878231 -0.076169 0.447886 )
	( -0.740141 0.082596 -0.360528 ) ( 0.000374 0.707079 0.000000 )
	( -0.450942 -0.330299 -0.236787 ) ( -0.865705 0.166269 -0.471641 )
	( -0.768131 -0.554428 -0.001125 ) ( 0.576453 -0.409514 0.576453 )
}

frame 0 {
	-0.018897 0.000000 0.100036 0.707107 0.000000 -0.000000
	0.312367 -0.360185 -0.004892 -0.496413 0.503564 -0.496625
	-0.000000 0.520055 0.000000 -0.178497 0.000622 0.003720
	-0.136732 0.038257 0.004402 -0.147673 -0.125439 -0.674731
	0.000000 0.447469 -0.000000 0.288153 0.339784 -0.838878
	0.151140 0.042027 0.014281 -0.136578 0.118766 0.681613
	0.000000 0.437615 -0.000000 0.289056 -0.349836 0.831773
	0.162623 0.221463 -0.011451 -0.117944 0.043029 0.407657
	0.000000 0.501200 -0.000000 0.519802 0.014924 -0.052609
	-0.162016 0.218096 -0.011498 -0.116163 -0.038814 -0.404078
	0.000000 0.492872 0.000000 0.515809 -0.011248 0.048502
	0.142976 0.370391 -0.009384 0.001600 -0.000475 0.113450
	-0.000000 0.422763 -0.000000 0.443406 -0.047551 0.096794
	-0.137594 0.373323 -0.014729 0.001093 0.003333 -0.114207
	0.000000 0.421663 -0.000000 0.449049 0.045680 -0.088258
	0.035670 -0.040818 0.060014 0.018181 -0.047886 0.998486
	0.000000 0.026025 0.000000 0.002853 -0.033945 0.001202
	-0.027674 -0.041720 0.059816 0.052107 0.046785 -0.997231
	0.000000 0.025637 0.000000 0.001972 0.121503 -0.002943
	-0.050906 -0.034136 0.024111 0.058393 0.145779 -0.987384
	0.000000 0.049218 0.000000 0.001273 0.130147 -0.004151
	0.059788 -0.034178 0.023788 0.058967 -0.144900 0.987571
	-0.000000 0.049218 -0.000000 0.001261 -0.129525 0.004153
	0.032298 -0.054366 -0.002832 0.005735 -0.051282 -0.998667
	0.000000 0.018246 -0.000000 0.000223 0.105798 0.003347
	-0.026453 -0.054341 -0.002832 0.011413 0.051461 0.998493
	0.000000 0.018247 -0.000000 0.000219 -0.104659 -0.003397
	-0.053205 -0.156103 -0.013104 -0.083867 0.236072 0.951085
	0.060800 -0.156152 -0.013104 -0.083973 -0.236037 -0.951008
	0.038704 -0.122207 0.051886 -0.000097 -0.468376 0.883529
	-0.031079 -0.122177 0.051886 -0.000097 -0.468376 0.883529
	0.031859 -0.116268 0.003550 -0.080502 -0.440954 -0.880320
	-0.024230 -0.116244 0.003550 -0.080308 0.440987 0.880387
	0.474768 0.072944 -0.404259 -0.000374 -0.707079 -0.000000
	0.252528 -0.529487 -0.555359 0.000000 0.250468 -0.968125
	-0.581522 0.073430 -0.831409 -0.000374 -0.707079 -0.000000
	-0.213911 -0.457952 -0.518543 -0.339129 0.234470 -0.906822
	0.474768 0.072944 0.404512 -0.000374 -0.707079 -0.000000
	0.252528 -0.529487 0.555269 -0.968125 0.000000 -0.000000
	-0.581523 0.067522 0.830352 -0.000374 -0.707107 -0.000000
	-0.223781 -0.456157 0.514222 -0.906822 0.087686 -0.339129
	-0.740141 0.073430 0.364709 -0.000374 -0.707079 -0.000000
	-0.450942 -0.330299 0.228546 -0.878231 0.076169 -0.447886
	-0.740141 0.082596 -0.360528 -0.000374 -0.707079 -0.000000
	-0.450942 -0.330299 -0.236787 0.865705 -0.166269 0.471641
	-0.768131 -0.554428 -0.001125 -0.576453 0.409514 -0.576453
}

frame 1 {
	-0.018897 0.000000 0.100036 0.707107 0.000000 -0.000000
	0.312367 -0.360185 -0.004892 -0.496413 0.503564 -0.496625
	-0.000000 0.520055 0.000000 -0.178714 0.000338 0.005288
	-0.136732 0.038257 0.004402 -0.147673 -0.125439 -0.674731
	0.000000 0.447469 -0.000000 0.288153 0.339784 -0.838878
	0.151140 0.042027 0.014281 -0.136578 0.118766 0.681613
	0.000000 0.437615 -0.000000 0.289056 -0.349836 0.831773
	0.162623 0.221463 -0.011451 -0.219984 0.094553 0.415387
	0.000000 0.501200 -0.000000 0.669352 0.016393 -0.060499
	-0.162016 0.218096 -0.011498 -0.116163 -0.038814 -0.404078
	0.000000 0.492872 0.000000 0.515809 -0.011248 0.048502
	0.142976 0.370391 -0.009384 0.001295 -0.001313 0.114764
	-0.000000 0.422763 -0.000000 0.443626 -0.048059 0.095778
	-0.137594 0.373323 -0.014729 0.001093 0.003333 -0.114207
	0.000000 0.421663 -0.000000 0.449049 0.045680 -0.088258
	0.035670 -0.040818 0.060014 0.018181 -0.047886 0.998486
	0.000000 0.026025 0.000000 0.002853 -0.033945 0.001202
	-0.027674 -0.041720 0.059816 0.052107 0.046785 -0.997231
	0.000000 0.025637 0.000000 0.001972 0.121503 -0.002943
	-0.050906 -0.034136 0.024111 0.058393 0.145779 -0.987384
	0.000000 0.049218 0.000000 0.001273 0.130147 -0.004151
	0.059788 -0.034178 0.023788 0.058967 -0.144900 0.987571
	-0.000000 0.049218 -0.000000 0.001261 -0.129525 0.004153
	0.032298 -0.054366 -0.002832 0.005735 -0.051282 -0.998667
	0.000000 0.018246 -0.000000 0.000223 0.105798 0.003347
	-0.026453 -0.054341 -0.002832 0.011413 0.051461 0.998493
	0.000000 0.018247 -0.000000 0.000219 -0.104659 -0.003397
	-0.053205 -0.156103 -0.013104 -0.083867 0.236072 0.951085
	0.060800 -0.156152 -0.013104 -0.083973 -0.236037 -0.951008
	0.038704 -0.122207 0.051886 -0.000097 -0.468376 0.883529
	-0.031079 -0.122177 0.051886 -0.000097 -0.468376 0.883529
	0.031859 -0.116268 0.003550 -0.080502 -0.440954 -0.880320
	-0.024230 -0.116244 0.003550 -0.080308 0.440987 0.880387
	0.474768 0.072944 -0.404259 -0.000374 -0.710982 0.000002
	0.252528 -0.529487 -0.555359 0.000000 0.250468 -0.968125
	-0.581522 0.073430 -0.831409 -0.000374 -0.707079 -0.000000
	-0.213911 -0.457952 -0.518543 -0.339129 0.234470 -0.906822
	0.474768 0.072944 0.404512 -0.000374 -0.709997 0.000002
	0.252528 -0.529487 0.555269 -0.968125 0.000000 -0.000000
	-0.475415 0.019549 0.763775 -0.000374 -0.707107 -0.000000
	-0.223781 -0.456157 0.514222 -0.906822 0.087686 -0.339129
	-0.740141 0.073430 0.364709 -0.000374 -0.711649 0.000002
	-0.448690 -0.330264 0.230572 -0.878231 0.076169 -0.447886
	-0.740141 0.082596 -0.360528 -0.000374 -0.707079 -0.000000
	-0.450942 -0.330299 -0.236787 0.865705 -0.166269 0.471641
	-0.767310 -0.554428 0.000845 -0.577560 0.408726 -0.575344
}

frame 2 {
	-0.018897 0.000000 0.100036 0.707107 0.000000 -0.000000
	0.312367 -0.360185 -0.004892 -0.496413 0.503564 -0.496625
	-0.000000 0.520055 0.000000 -0.179400 -0.000561 0.010260
	-0.136732 0.038257 0.004402 -0.147673 -0.125439 -0.674731
	0.000000 0.447469 -0.000000 0.288153 0.339784 -0.838878
	0.151140 0.042027 0.014281 -0.136578 0.118766 0.681613
	0.000000 0.437615 -0.000000 0.289056 -0.349836 0.831773
	0.162623 0.221463 -0.011451 -0.227758 0.109479 0.423144
	-0.000000 0.501200 0.000000 0.743173 0.019932 -0.056165
	-0.162016 0.218096 -0.011498 -0.116163 -0.038814 -0.404078
	0.000000 0.492872 0.000000 0.515809 -0.011248 0.048502
	0.142976 0.370391 -0.009384 0.000358 -0.003933 0.118883
	0.000000 0.422763 -0.000000 0.444313 -0.049654 0.092591
	-0.137594 0.373323 -0.014729 0.001093 0.003333 -0.114207
	0.000000 0.421663 -0.000000 0.449049 0.045680 -0.088258
	0.035670 -0.040818 0.060014 0.018181 -0.047886 0.998486
	0.000000 0.026025 0.000000 0.002853 -0.033945 0.001202
	-0.027674 -0.041720 0.059816 0.052107 0.046785 -0.997231
	0.000000 0.025637 0.000000 0.001972 0.121503 -0.002943
	-0.050906 -0.034136 0.024111 0.058393 0.145779 -0.987384
	0.000000 0.049218 0.000000 0.001273 0.130147 -0.004151
	0.059788 -0.034178 0.023788 0.058967 -0.144900 0.987571
	-0.000000 0.049218 -0.000000 0.001261 -0.129525 0.004153
	0.032298 -0.054366 -0.002832 0.005735 -0.051282 -0.998667
	0.000000 0.018246 -0.000000 0.000223 0.105798 0.003347
	-0.026453 -0.054341 -0.002832 0.011413 0.051461 0.998493
	0.000000 0.018247 -0.000000 0.000219 -0.104659 -0.003397
	-0.053205 -0.156103 -0.013104 -0.083867 0.236072 0.951085
	0.060800 -0.156152 -0.013104 -0.083973 -0.236037 -0.951008
	0.038704 -0.122207 0.051886 -0.000097 -0.468376 0.883529
	-0.031079 -0.122177 0.051886 -0.000097 -0.468376 0.883529
	0.031859 -0.116268 0.003550 -0.080502 -0.440954 -0.880320
	-0.024230 -0.116244 0.003550 -0.080308 0.440987 0.880387
	0.474768 0.072944 -0.404259 -0.000374 -0.721730 0.000008
	0.252528 -0.529487 -0.555359 0.000000 0.250468 -0.968125
	-0.581522 0.073430 -0.831409 -0.000374 -0.707079 -0.000000
	-0.213911 -0.457952 -0.518543 -0.339129 0.234470 -0.906822
	0.474768 0.072944 0.404512 -0.000374 -0.718059 0.000006
	0.252528 -0.529487 0.555269 -0.968125 0.000000 -0.000000
	-0.369730 0.067522 0.697303 -0.000374 -0.707107 -0.000000
	-0.223781 -0.456157 0.514222 -0.906822 0.087686 -0.339129
	-0.740141 0.073430 0.364709 -0.000374 -0.724230 0.000009
	-0.441848 -0.330161 0.236682 -0.878231 0.076169 -0.447886
	-0.740141 0.082596 -0.360528 -0.000374 -0.707079 -0.000000
	-0.450942 -0.330299 -0.236787 0.865705 -0.166269 0.471641
	-0.764831 -0.554428 0.006798 -0.580899 0.406330 -0.571972
}

frame 3 {
	-0.018897 0.000000 0.100036 0.707107 0.000000 -0.000000
	0.312367 -0.360185 -0.004892 -0.496413 0.503564 -0.496625
	-0.000000 0.520055 0.000000 -0.180549 -0.002083 0.018670
	-0.136732 0.038257 0.004402 -0.147673 -0.125439 -0.674731
	0.000000 0.447469 -0.000000 0.288153 0.339784 -0.838878
	0.151140 0.042027 0.014281 -0.136578 0.118766 0.681613
	0.000000 0.437615 -0.000000 0.289056 -0.349836 0.831773
	0.162623 0.221463 -0.011451 -0.227758 0.109479 0.423144
	-0.000000 0.501200 0.000000 0.743173 0.019932 -0.056165
	-0.162016 0.218096 -0.011498 -0.116163 -0.038814 -0.404078
	0.000000 0.492872 0.000000 0.515809 -0.011248 0.048502
	0.142976 0.370391 -0.009384 -0.001167 -0.008341 0.125828
	-0.000000 0.422763 0.000000 0.445467 -0.052359 0.087209
	-0.137594 0.373323 -0.014729 0.001093 0.003333 -0.114207
	0.000000 0.421663 -0.000000 0.449049 0.045680 -0.088258
	0.035670 -0.040818 0.060014 0.018181 -0.047886 0.998486
	0.000000 0.026025 0.000000 0.002853 -0.033945 0.001202
	-0.027674 -0.041720 0.059816 0.052107 0.046785 -0.997231
	0.000000 0.025637 0.000000 0.001972 0.121503 -0.002943
	-0.050906 -0.034136 0.024111 0.058393 0.145779 -0.987384
	0.000000 0.049218 0.000000 0.001273 0.130147 -0.004151
	0.059788 -0.034178 0.023788 0.058967 -0.144900 0.987571
	-0.000000 0.049218 -0.000000 0.001261 -0.129525 0.004153
	0.032298 -0.054366 -0.002832 0.005735 -0.051282 -0.998667
	0.000000 0.018246 -0.000000 0.000223 0.105798 0.003347
	-0.026453 -0.054341 -0.002832 0.011413 0.051461 0.998493
	0.000000 0.018247 -0.000000 0.000219 -0.104659 -0.003397
	-0.053205 -0.156103 -0.013104 -0.083867 0.236072 0.951085
	0.060800 -0.156152 -0.013104 -0.083973 -0.236037 -0.951008
	0.038704 -0.122207 0.051886 -0.000097 -0.468376 0.883529
	-0.031079 -0.122177 0.051886 -0.000097 -0.468376 0.883529
	0.031859 -0.116268 0.003550 -0.080502 -0.440954 -0.880320
	-0.024230 -0.116244 0.003550 -0.080308 0.440987 0.880387
	0.474768 0.072944 -0.404259 -0.000374 -0.738010 0.000017
	0.252528 -0.529487 -0.555359 0.000000 0.250468 -0.968125
	-0.581522 0.073430 -0.831409 -0.000374 -0.707079 -0.000000
	-0.213911 -0.457952 -0.518543 -0.339129 0.234470 -0.906822
	0.474768 0.072944 0.404512 -0.000374 -0.730349 0.000013
	0.252528 -0.529487 0.555269 -0.968125 0.000000 -0.000000
	-0.369730 0.067522 0.697303 -0.000374 -0.707107 -0.000000
	-0.223781 -0.456157 0.514222 -0.906822 0.087686 -0.339129
	-0.740141 0.073430 0.364709 -0.000374 -0.743223 0.000020
	-0.430469 -0.329989 0.246740 -0.878231 0.076169 -0.447886
	-0.740141 0.082596 -0.360528 -0.000374 -0.707079 -0.000000
	-0.450942 -0.330299 -0.236787 0.865705 -0.166269 0.471641
	-0.760684 -0.554428 0.016756 -0.586457 0.402281 -0.566273
}

frame 4 {
	-0.018897 0.000000 0.100036 0.707107 0.000000 -0.000000
	0.312367 -0.360185 -0.004892 -0.496413 0.503564 -0.496625
	-0.000000 0.520055 0.000000 -0.182146 -0.004226 0.030516
	-0.136732 0.038257 0.004402 -0.147673 -0.125439 -0.674731
	0.000000 0.447469 -0.000000 0.288153 0.339784 -0.838878
	0.151140 0.042027 0.014281 -0.136578 0.118766 0.681613
	0.000000 0.437615 -0.000000 0.289056 -0.349836 0.831773
	0.162623 0.221463 -0.011451 -0.227758 0.109479 0.423144
	-0.000000 0.501200 0.000000 0.743173 0.019932 -0.056165
	-0.162016 0.218096 -0.011498 -0.116163 -0.038814 -0.404078
	0.000000 0.492872 0.000000 0.515809 -0.011248 0.048502
	0.142976 0.370391 -0.009384 -0.003191 -0.014700 0.135526
	0.000000 0.422763 -0.000000 0.446982 -0.056330 0.079449
	-0.137594 0.373323 -0.014729 0.001093 0.003333 -0.114207
	0.000000 0.421663 -0.000000 0.449049 0.045680 -0.088258
	0.035670 -0.040818 0.060014 0.018181 -0.047886 0.998486
	0.000000 0.026025 0.000000 0.002853 -0.033945 0.001202
	-0.027674 -0.041720 0.059816 0.052107 0.046785 -0.997231
	0.000000 0.025637 0.000000 0.001972 0.121503 -0.002943
	-0.050906 -0.034136 0.024111 0.058393 0.145779 -0.987384
	0.000000 0.049218 0.000000 0.001273 0.130147 -0.004151
	0.059788 -0.034178 0.023788 0.058967 -0.144900 0.987571
	-0.000000 0.049218 -0.000000 0.001261 -0.129525 0.004153
	0.032298 -0.054366 -0.002832 0.005735 -0.051282 -0.998667
	0.000000 0.018246 -0.000000 0.000223 0.105798 0.003347
	-0.026453 -0.054341 -0.002832 0.011413 0.051461 0.998493
	0.000000 0.018247 -0.000000 0.000219 -0.104659 -0.003397
	-0.053205 -0.156103 -0.013104 -0.083867 0.236072 0.951085
	0.060800 -0.156152 -0.013104 -0.083973 -0.236037 -0.951008
	0.038704 -0.122207 0.051886 -0.000097 -0.468376 0.883529
	-0.031079 -0.122177 0.051886 -0.000097 -0.468376 0.883529
	0.031859 -0.116268 0.003550 -0.080502 -0.440954 -0.880320
	-0.024230 -0.116244 0.003550 -0.080308 0.440987 0.880387
	0.474768 0.072944 -0.404259 -0.000373 -0.758609 0.000028
	0.252528 -0.529487 -0.555359 0.000000 0.250468 -0.968125
	-0.581522 0.073430 -0.831409 -0.000374 -0.707079 -0.000000
	-0.213911 -0.457952 -0.518543 -0.339129 0.234470 -0.906822
	0.474768 0.072944 0.404512 -0.000373 -0.746069 0.000021
	0.252528 -0.529487 0.555269 -0.968125 0.000000 -0.000000
	-0.369730 0.067522 0.697303 -0.000374 -0.707107 -0.000000
	-0.223781 -0.456157 0.514222 -0.906822 0.087686 -0.339129
	-0.740141 0.073430 0.364709 -0.000373 -0.767077 0.000033
	-0.414939 -0.329757 0.260285 -0.878231 0.076169 -0.447886
	-0.740141 0.082596 -0.360528 -0.000374 -0.707079 -0.000000
	-0.450942 -0.330299 -0.236787 0.865705 -0.166269 0.471641
	-0.754890 -0.554428 0.030665 -0.594159 0.396536 -0.558186
}

frame 5 {
	-0.018897 0.000000 0.100036 0.707107 0.000000 -0.000000
	0.312367 -0.360185 -0.004892 -0.496413 0.503564 -0.496625
	-0.000000 0.520055 0.000000 -0.184175 -0.007002 0.045857
	-0.136732 0.038257 0.004402 -0.147673 -0.125439 -0.674731
	0.000000 0.447469 -0.000000 0.288153 0.339784 -0.838878
	0.151140 0.042027 0.014281 -0.136578 0.118766 0.681613
	0.000000 0.437615 -0.000000 0.289056 -0.349836 0.831773
	0.162623 0.221463 -0.011451 -0.227758 0.109479 0.423144
	-0.000000 0.501200 0.000000 0.743173 0.019932 -0.056165
	-0.162016 0.218096 -0.011498 -0.116163 -0.038814 -0.404078
	0.000000 0.492872 0.000000 0.515809 -0.011248 0.048502
	0.142976 0.370391 -0.009384 -0.005328 -0.022644 0.147689
	0.000000 0.422763 0.000000 0.448571 -0.061470 0.069861
	-0.137594 0.373323 -0.014729 0.001093 0.003333 -0.114207
	0.000000 0.421663 -0.000000 0.449049 0.045680 -0.088258
	0.035670 -0.040818 0.060014 0.018181 -0.047886 0.998486
	0.000000 0.026025 0.000000 0.002853 -0.033945 0.001202
	-0.027674 -0.041720 0.059816 0.052107 0.046785 -0.997231
	0.000000 0.025637 0.000000 0.001972 0.121503 -0.002943
	-0.050906 -0.034136 0.024111 0.058393 0.145779 -0.987384
	0.000000 0.049218 0.000000 0.001273 0.130147 -0.004151
	0.059788 -0.034178 0.023788 0.058967 -0.144900 0.987571
	-0.000000 0.049218 -0.000000 0.001261 -0.129525 0.004153
	0.032298 -0.054366 -0.002832 0.005735 -0.051282 -0.998667
	0.000000 0.018246 -0.000000 0.000223 0.105798 0.003347
	-0.026453 -0.054341 -0.002832 0.011413 0.051461 0.998493
	0.000000 0.018247 -0.000000 0.000219 -0.104659 -0.003397
	-0.053205 -0.156103 -0.013104 -0.083867 0.236072 0.951085
	0.060800 -0.156152 -0.013104 -0.083973 -0.236037 -0.951008
	0.038704 -0.122207 0.051886 -0.000097 -0.468376 0.883529
	-0.031079 -0.122177 0.051886 -0.000097 -0.468376 0.883529
	0.031859 -0.116268 0.003550 -0.080502 -0.440954 -0.880320
	-0.024230 -0.116244 0.003550 -0.080308 0.440987 0.880387
	0.474768 0.072944 -0.404259 -0.000372 -0.782344 0.000042
	0.252528 -0.529487 -0.555359 0.000000 0.250468 -0.968125
	-0.581522 0.073430 -0.831409 -0.000374 -0.707079 -0.000000
	-0.213911 -0.457952 -0.518543 -0.339129 0.234470 -0.906822
	0.474768 0.072944 0.404512 -0.000373 -0.764483 0.000032
	0.252528 -0.529487 0.555269 -0.968125 0.000000 -0.000000
	-0.369730 0.067522 0.697303 -0.000374 -0.707107 -0.000000
	-0.223781 -0.456157 0.514222 -0.906822 0.087686 -0.339129
	-0.740141 0.073430 0.364709 -0.000371 -0.794216 0.000049
	-0.396070 -0.329477 0.276461 -0.878231 0.076169 -0.447886
	-0.740141 0.082596 -0.360528 -0.000374 -0.707079 -0.000000
	-0.450942 -0.330299 -0.236787 0.865705 -0.166269 0.471641
	-0.747510 -0.554428 0.048381 -0.603857 0.389072 -0.547680
}

frame 6 {
	-0.018897 0.000000 0.100036 0.707107 0.000000 -0.000000
	0.308034 -0.360185 -0.015085 -0.501630 0.498221 -0.491355
	-0.000000 0.520055 -0.000000 -0.187599 -0.008618 0.054829
	-0.136732 0.038256 0.004402 -0.146179 -0.123860 -0.689986
	-0.000000 0.447469 -0.000000 0.286343 0.335561 -0.840436
	0.151140 0.042027 0.014281 -0.137762 0.120583 0.673506
	-0.000000 0.437615 0.000000 0.288974 -0.354501 0.829026
	0.162623 0.221462 -0.011451 -0.227044 0.107943 0.417078
	-0.000000 0.501200 -0.000000 0.740620 0.019508 -0.057041
	-0.162016 0.218096 -0.011498 -0.122829 -0.040476 -0.415732
	-0.000000 0.492872 -0.000000 0.527875 -0.011299 0.049249
	0.142976 0.370391 -0.009384 -0.007578 -0.032295 0.153596
	-0.000000 0.422763 -0.000000 0.450920 -0.067961 0.058998
	-0.137594 0.373323 -0.014729 -0.004823 0.002393 -0.123157
	0.000000 0.421663 0.000000 0.462118 0.045315 -0.090914
	0.035670 -0.040818 0.060015 0.018184 -0.047886 0.998486
	-0.000000 0.026025 -0.000000 0.002853 -0.033945 0.001202
	-0.027674 -0.041720 0.059816 0.052106 0.046785 -0.997231
	0.000000 0.025637 0.000000 0.001972 0.121503 -0.002943
	-0.050906 -0.034136 0.024111 0.058392 0.145779 -0.987384
	-0.000000 0.049218 -0.000000 0.001273 0.130147 -0.004151
	0.059788 -0.034178 0.023788 0.058970 -0.144899 0.987571
	-0.000000 0.049218 -0.000000 0.001262 -0.129525 0.004153
	0.032298 -0.054366 -0.002832 0.005712 -0.051287 -0.998667
	0.000000 0.018247 0.000000 0.000223 0.105798 0.003347
	-0.026453 -0.054341 -0.002832 0.011412 0.051461 0.998493
	-0.000000 0.018247 0.000000 0.000219 -0.104659 -0.003397
	-0.053205 -0.156103 -0.013104 -0.083867 0.236072 0.951085
	0.060800 -0.156152 -0.013104 -0.083973 -0.236037 -0.951008
	0.038704 -0.122207 0.051886 -0.000097 -0.468376 0.883529
	-0.031079 -0.122177 0.051886 -0.000097 -0.468376 0.883529
	0.031859 -0.116268 0.003549 -0.080502 -0.440954 -0.880320
	-0.024230 -0.116245 0.003550 -0.080308 0.440987 0.880387
	0.474768 0.072944 -0.404259 -0.000370 -0.808023 0.000058
	0.252528 -0.529487 -0.555359 0.000000 0.250468 -0.968125
	-0.581522 0.073430 -0.831409 -0.000374 -0.707079 -0.000000
	-0.213911 -0.457952 -0.518543 -0.339129 0.234470 -0.906822
	0.474768 0.072944 0.404512 -0.000372 -0.784886 0.000044
	0.252528 -0.529487 0.555269 -0.968125 0.000000 -0.000000
	-0.369730 0.067522 0.697303 -0.000374 -0.707107 -0.000000
	-0.223781 -0.456157 0.514222 -0.906822 0.087686 -0.339129
	-0.740141 0.073430 0.364709 -0.000368 -0.822995 0.000067
	-0.375101 -0.329169 0.294025 -0.878231 0.076169 -0.447886
	-0.740141 0.082596 -0.360528 -0.000374 -0.707079 -0.000000
	-0.450942 -0.330299 -0.236787 0.865705 -0.166269 0.471641
	-0.738653 -0.554428 0.069645 -0.615317 0.379902 -0.534772
}

frame 7 {
	-0.018897 0.000000 0.100036 0.707107 0.000000 -0.000000
	0.295035 -0.360185 -0.045658 -0.517055 0.481735 -0.475096
	0.000000 0.520055 0.000000 -0.192930 -0.007233 0.047304
	-0.136732 0.038257 0.004402 -0.142937 -0.118820 -0.735321
	-0.000000 0.447469 -0.000000 0.280114 0.323105 -0.844423
	0.151140 0.042027 0.014281 -0.141058 0.125001 0.648570
	0.000000 0.437615 0.000000 0.288459 -0.369186 0.820069
	0.162623 0.221463 -0.011451 -0.224502 0.103188 0.398136
	-0.000000 0.501200 0.000000 0.732246 0.018229 -0.059613
	-0.162016 0.218096 -0.011498 -0.141246 -0.045434 -0.450884
	-0.000000 0.492872 0.000000 0.560875 -0.011550 0.051059
	0.142976 0.370391 -0.009384 -0.008527 -0.044848 0.145576
	0.000000 0.422763 -0.000000 0.452663 -0.075459 0.045413
	-0.137594 0.373323 -0.014729 -0.020133 -0.000779 -0.150621
	0.000000 0.421663 -0.000000 0.496858 0.044287 -0.097955
	0.035670 -0.040818 0.060014 0.018184 -0.047886 0.998486
	0.000000 0.026025 0.000000 0.002853 -0.033945 0.001202
	-0.027674 -0.041720 0.059816 0.052105 0.046784 -0.997231
	-0.000000 0.025637 0.000000 0.001972 0.121503 -0.002943
	-0.050906 -0.034136 0.024111 0.058391 0.145779 -0.987384
	-0.000000 0.049218 -0.000000 0.001273 0.130147 -0.004151
	0.059788 -0.034178 0.023788 0.058968 -0.144899 0.987571
	-0.000000 0.049218 -0.000000 0.001262 -0.129525 0.004153
	0.032298 -0.054366 -0.002832 0.005724 -0.051284 -0.998667
	-0.000000 0.018246 -0.000000 0.000223 0.105798 0.003347
	-0.026453 -0.054341 -0.002832 0.011411 0.051461 0.998493
	0.000000 0.018247 -0.000000 0.000219 -0.104659 -0.003397
	-0.053205 -0.156103 -0.013104 -0.083867 0.236072 0.951085
	0.060800 -0.156152 -0.013104 -0.083973 -0.236037 -0.951008
	0.038704 -0.122207 0.051886 -0.000097 -0.468376 0.883529
	-0.031079 -0.122177 0.051886 -0.000097 -0.468376 0.883529
	0.031859 -0.116268 0.003550 -0.080502 -0.440954 -0.880320
	-0.024230 -0.116244 0.003550 -0.080308 0.440987 0.880387
	0.474768 0.072944 -0.404259 -0.000367 -0.834423 0.000075
	0.252528 -0.529487 -0.555359 0.000000 0.250468 -0.968125
	-0.581522 0.073430 -0.831409 -0.000374 -0.707079 -0.000000
	-0.213911 -0.457952 -0.518543 -0.339129 0.234470 -0.906822
	0.474768 0.072944 0.404512 -0.000370 -0.806585 0.000057
	0.252528 -0.529487 0.555269 -0.968125 0.000000 -0.000000
	-0.369730 0.067522 0.697303 -0.000374 -0.707107 -0.000000
	-0.223781 -0.456157 0.514222 -0.906822 0.087686 -0.339129
	-0.740141 0.073430 0.364709 -0.000364 -0.851701 0.000087
	-0.353560 -0.328857 0.311495 -0.878231 0.076169 -0.447886
	-0.740141 0.082596 -0.360528 -0.000374 -0.707079 -0.000000
	-0.450942 -0.330299 -0.236787 0.865705 -0.166269 0.471641
	-0.728477 -0.554428 0.094073 -0.628215 0.369095 -0.519560
}

frame 8 {
	-0.018897 0.000000 0.100036 0.707107 0.000000 -0.000000
	0.274163 -0.360185 -0.094736 -0.540997 0.453898 -0.447643
	-0.000000 0.520055 -0.000000 -0.198885 -0.003082 0.024544
	-0.136733 0.038256 0.004402 -0.144279 -0.111248 -0.804733
	-0.000000 0.447469 0.000000 0.267978 0.303235 -0.848683
	0.151140 0.042027 0.014281 -0.144667 0.128905 0.606578
	0.000000 0.437615 0.000000 0.286715 -0.394447 0.803613
	0.162623 0.221462 -0.011451 -0.218912 0.095532 0.364743
	0.000000 0.501200 0.000000 0.716384 0.016358 -0.063059
	-0.162016 0.218096 -0.011498 -0.166687 -0.053057 -0.507039
	-0.000000 0.492872 0.000000 0.605964 -0.012286 0.052868
	0.142976 0.370391 -0.009384 -0.004187 -0.059654 0.122233
	0.000000 0.422763 0.000000 0.447372 -0.084033 0.030577
	-0.137594 0.373323 -0.014729 -0.038615 -0.006666 -0.196127
	-0.000000 0.421663 0.000000 0.541574 0.042820 -0.106870
	0.035670 -0.040818 0.060014 0.018183 -0.047886 0.998486
	-0.000000 0.026025 -0.000000 0.002853 -0.033945 0.001202
	-0.027674 -0.041720 0.059816 0.052106 0.046785 -0.997231
	-0.000000 0.025637 -0.000000 0.001972 0.121503 -0.002943
	-0.050906 -0.034136 0.024111 0.058393 0.145780 -0.987384
	0.000000 0.049218 0.000000 0.001273 0.130147 -0.004151
	0.059788 -0.034178 0.023788 0.058966 -0.144901 0.987571
	-0.000000 0.049218 0.000000 0.001261 -0.129525 0.004153
	0.032298 -0.054366 -0.002832 0.005762 -0.051288 -0.998667
	-0.000000 0.018246 -0.000000 0.000223 0.105798 0.003347
	-0.026453 -0.054341 -0.002832 0.011411 0.051461 0.998493
	-0.000000 0.018246 0.000000 0.000219 -0.104659 -0.003397
	-0.053205 -0.156103 -0.013104 -0.083867 0.236072 0.951085
	0.060800 -0.156152 -0.013104 -0.083973 -0.236037 -0.951008
	0.038704 -0.122207 0.051886 -0.000097 -0.468376 0.883529
	-0.031079 -0.122177 0.051886 -0.000097 -0.468376 0.883529
	0.031859 -0.116268 0.003550 -0.080502 -0.440954 -0.880320
	-0.024230 -0.116245 0.003550 -0.080308 0.440987 0.880387
	0.474768 0.072944 -0.404259 -0.000362 -0.860286 0.000093
	0.252528 -0.529487 -0.555359 0.000000 0.250468 -0.968125
	-0.581522 0.073430 -0.831409 -0.000374 -0.707079 -0.000000
	-0.213911 -0.457952 -0.518543 -0.339129 0.234470 -0.906822
	0.474768 0.072944 0.404512 -0.000367 -0.828879 0.000071
	0.252528 -0.529487 0.555269 -0.968125 0.000000 -0.000000
	-0.369730 0.067522 0.697303 -0.000374 -0.707107 -0.000000
	-0.223781 -0.456157 0.514222 -0.906822 0.087686 -0.339129
	-0.740141 0.073430 0.364709 -0.000359 -0.878554 0.000106
	-0.333019 -0.328566 0.327397 -0.878231 0.076169 -0.447886
	-0.740141 0.082596 -0.360528 -0.000374 -0.707079 -0.000000
	-0.450942 -0.330299 -0.236787 0.865705 -0.166269 0.471641
	-0.717198 -0.554428 0.121145 -0.642142 0.356795 -0.502245
}

frame 9 {
	-0.018897 0.000000 0.100036 0.707107 0.000000 -0.000000
	0.247612 -0.360185 -0.157163 -0.569658 0.416286 -0.410551
	0.000000 0.520055 -0.000000 -0.203613 0.002988 -0.008818
	-0.136732 0.038257 0.004402 -0.106672 -0.073010 -0.847430
	0.000000 0.447469 -0.000000 0.252012 0.278410 -0.849644
	0.151140 0.042027 0.014281 -0.145411 0.129433 0.550647
	-0.000000 0.437615 -0.000000 0.282391 -0.429591 0.778439
	0.162623 0.221463 -0.011451 -0.208647 0.085811 0.317928
	-0.000000 0.501200 -0.000000 0.691158 0.014232 -0.066256
	-0.162016 0.218096 -0.011498 -0.193935 -0.062105 -0.576489
	-0.000000 0.492872 -0.000000 0.652534 -0.013905 0.052856
	0.142976 0.370391 -0.009384 -0.057440 -0.051136 0.106236
	-0.000000 0.422763 -0.000000 0.520910 -0.080439 0.040566
	-0.137594 0.373323 -0.014729 -0.053876 -0.015061 -0.254636
	-0.000000 0.421663 -0.000000 0.583576 0.041241 -0.115323
	0.035670 -0.040818 0.060014 0.018184 -0.047886 0.998486
	0.000000 0.026025 0.000000 0.002853 -0.033945 0.001202
	-0.027674 -0.041720 0.059816 0.052106 0.046785 -0.997231
	0.000000 0.025637 0.000000 0.001972 0.121503 -0.002943
	-0.050906 -0.034136 0.024111 0.058391 0.145780 -0.987384
	-0.000000 0.049218 -0.000000 0.001273 0.130147 -0.004151
	0.059788 -0.034178 0.023788 0.058968 -0.144899 0.987571
	0.000000 0.049218 -0.000000 0.001261 -0.129525 0.004153
	0.032298 -0.054366 -0.002832 0.005745 -0.051287 -0.998667
	-0.000000 0.018247 0.000000 0.000223 0.105798 0.003347
	-0.026453 -0.054341 -0.002832 0.011411 0.051461 0.998493
	-0.000000 0.018247 0.000000 0.000219 -0.104659 -0.003397
	-0.053205 -0.156103 -0.013104 -0.083867 0.236072 0.951085
	0.060800 -0.156152 -0.013104 -0.083973 -0.236037 -0.951008
	0.038704 -0.122207 0.051886 -0.000097 -0.468376 0.883529
	-0.031079 -0.122177 0.051886 -0.000097 -0.468376 0.883529
	0.031859 -0.116268 0.003549 -0.080502 -0.440954 -0.880320
	-0.024230 -0.116244 0.003550 -0.080308 0.440987 0.880387
	0.474768 0.072944 -0.404259 -0.000357 -0.884302 0.000110
	0.178913 -0.529486 -0.578411 -0.052003 0.250107 -0.966727
	-0.581522 0.073430 -0.831409 -0.000374 -0.707079 -0.000000
	-0.213911 -0.457952 -0.518543 -0.339129 0.234470 -0.906822
	0.474768 0.072944 0.404512 -0.000364 -0.851063 0.000086
	0.252528 -0.529487 0.555269 -0.968125 0.000000 -0.000000
	-0.369730 0.067522 0.697303 -0.000374 -0.707107 -0.000000
	-0.223781 -0.456157 0.514222 -0.906822 0.087686 -0.339129
	-0.681697 0.044697 0.402044 -0.000353 -0.901601 0.000124
	-0.314826 -0.328315 0.340508 -0.878231 0.076169 -0.447886
	-0.740141 0.082596 -0.360528 -0.000374 -0.707079 -0.000000
	-0.450942 -0.330299 -0.236787 0.865705 -0.166269 0.471641
	-0.705086 -0.554428 0.150217 -0.656627 0.343232 -0.483153
}

frame 10 {
	-0.018897 0.000000 0.100036 0.707107 0.000000 -0.000000
	0.218966 -0.360185 -0.224522 -0.597861 0.373417 -0.368272
	-0.000000 0.520055 0.000000 -0.205285 0.009627 -0.045384
	-0.136733 0.038256 0.004402 -0.031505 -0.035420 -0.794251
	0.000000 0.447469 -0.000000 0.263979 0.260103 -0.864120
	0.151140 0.042027 0.014281 -0.140272 0.126003 0.489022
	0.000000 0.437615 -0.000000 0.274477 -0.471451 0.744639
	0.162623 0.221462 -0.011451 -0.192917 0.075890 0.263140
	-0.000000 0.501200 0.000000 0.656436 0.012271 -0.067972
	-0.162016 0.218096 -0.011498 -0.219495 -0.070968 -0.646225
	-0.000000 0.492872 -0.000000 0.692983 -0.016951 0.049203
	0.142976 0.370391 -0.009384 -0.118174 -0.013924 0.117902
	0.000000 0.422763 0.000000 0.603751 -0.059022 0.087830
	-0.137594 0.373323 -0.014729 -0.062700 -0.024526 -0.315678
	0.000000 0.421663 0.000000 0.615170 0.039722 -0.122227
	0.035670 -0.040818 0.060014 0.018184 -0.047886 0.998486
	0.000000 0.026025 0.000000 0.002853 -0.033945 0.001202
	-0.027674 -0.041720 0.059816 0.052106 0.046784 -0.997231
	0.000000 0.025637 -0.000000 0.001972 0.121503 -0.002943
	-0.050906 -0.034136 0.024111 0.058395 0.145780 -0.987384
	0.000000 0.049218 0.000000 0.001273 0.130147 -0.004151
	0.059788 -0.034178 0.023788 0.058967 -0.144899 0.987571
	-0.000000 0.049218 -0.000000 0.001261 -0.129525 0.004153
	0.032298 -0.054366 -0.002832 0.005757 -0.051285 -0.998667
	-0.000000 0.018246 0.000000 0.000223 0.105798 0.003347
	-0.026453 -0.054341 -0.002832 0.011410 0.051461 0.998493
	0.000000 0.018246 0.000000 0.000219 -0.104659 -0.003397
	-0.053205 -0.156103 -0.013104 -0.083867 0.236072 0.951085
	0.060800 -0.156152 -0.013104 -0.083973 -0.236037 -0.951008
	0.038704 -0.122207 0.051886 -0.000097 -0.468376 0.883529
	-0.031079 -0.122177 0.051886 -0.000097 -0.468376 0.883529
	0.031859 -0.116268 0.003550 -0.080502 -0.440954 -0.880320
	-0.024230 -0.116245 0.003550 -0.080308 0.440987 0.880387
	0.405826 0.047087 -0.456134 -0.000352 -0.904946 0.000127
	-0.013129 -0.529487 -0.638697 -0.189858 0.245605 -0.949326
	-0.581522 0.073430 -0.831409 -0.000374 -0.707079 -0.000000
	-0.213911 -0.457952 -0.518543 -0.339129 0.234470 -0.906822
	0.474768 0.072944 0.404512 -0.000360 -0.872413 0.000101
	0.252528 -0.529487 0.555269 -0.968125 0.000000 -0.000000
	-0.369730 0.067522 0.697303 -0.000374 -0.707107 -0.000000
	-0.223781 -0.456157 0.514222 -0.906822 0.087686 -0.339129
	-0.532323 0.015886 0.497693 -0.000348 -0.917848 0.000138
	-0.299942 -0.328120 0.349995 -0.878231 0.076169 -0.447886
	-0.740141 0.082596 -0.360528 -0.000374 -0.707079 -0.000000
	-0.450942 -0.330299 -0.236787 0.865705 -0.166269 0.471641
	-0.692454 -0.554428 0.180537 -0.671169 0.328732 -0.462740
}

frame 11 {
	-0.018897 0.000000 0.100036 0.707107 0.000000 -0.000000
	0.192413 -0.360185 -0.286976 -0.621110 0.332118 -0.327542
	-0.000000 0.520055 -0.000000 -0.203089 0.015112 -0.075671
	-0.136732 0.038256 0.004402 -0.084664 -0.104193 -0.679671
	-0.000000 0.447469 0.000000 0.288095 0.254779 -0.880913
	0.151140 0.042027 0.014281 -0.129851 0.120109 0.433430
	-0.000000 0.437615 -0.000000 0.263852 -0.513589 0.705602
	0.162623 0.221462 -0.011451 -0.172878 0.067785 0.209669
	-0.000000 0.501200 0.000000 0.615444 0.010761 -0.067671
	-0.162016 0.218096 -0.011498 -0.241916 -0.078165 -0.703608
	0.000000 0.492872 -0.000000 0.723798 -0.021803 0.041871
	0.142976 0.370391 -0.009384 -0.030097 0.023685 0.166259
	-0.000000 0.422763 -0.000000 0.532045 -0.034889 0.137337
	-0.137594 0.373323 -0.014729 -0.065533 -0.033372 -0.366991
	0.000000 0.421663 0.000000 0.634977 0.038113 -0.128137
	0.035670 -0.040818 0.060014 0.018183 -0.047885 0.998486
	0.000000 0.026025 0.000000 0.002853 -0.033945 0.001202
	-0.027675 -0.041720 0.059816 0.052107 0.046785 -0.997231
	-0.000000 0.025637 0.000000 0.001972 0.121503 -0.002943
	-0.050906 -0.034136 0.024111 0.058394 0.145778 -0.987384
	0.000000 0.049218 -0.000000 0.001273 0.130147 -0.004151
	0.059788 -0.034178 0.023788 0.058970 -0.144899 0.987571
	0.000000 0.049218 -0.000000 0.001262 -0.129525 0.004153
	0.032298 -0.054366 -0.002833 0.005722 -0.051291 -0.998667
	0.000000 0.018246 -0.000000 0.000223 0.105798 0.003347
	-0.026453 -0.054341 -0.002832 0.011407 0.051462 0.998493
	-0.000000 0.018247 -0.000000 0.000219 -0.104659 -0.003397
	-0.053205 -0.156103 -0.013104 -0.083867 0.236072 0.951085
	0.060800 -0.156152 -0.013104 -0.083973 -0.236037 -0.951008
	0.038704 -0.122207 0.051886 -0.000097 -0.468377 0.883529
	-0.031079 -0.122177 0.051886 -0.000097 -0.468376 0.883529
	0.031859 -0.116268 0.003549 -0.080502 -0.440954 -0.880320
	-0.024230 -0.116245 0.003550 -0.080308 0.440987 0.880387
	0.229881 0.021329 -0.588846 -0.000347 -0.919478 0.000139
	-0.205172 -0.529488 -0.698983 -0.323802 0.236043 -0.912369
	-0.581522 0.073430 -0.831409 -0.000374 -0.707079 -0.000000
	-0.213911 -0.457952 -0.518543 -0.339129 0.234470 -0.906822
	0.474768 0.072944 0.404512 -0.000355 -0.892146 0.000117
	0.252528 -0.529487 0.555269 -0.968125 0.000000 -0.000000
	-0.369730 0.067522 0.697303 -0.000374 -0.707107 -0.000000
	-0.223781 -0.456157 0.514222 -0.906822 0.087686 -0.339129
	-0.324505 0.073430 0.630677 -0.000345 -0.924657 0.000144
	-0.288918 -0.327989 0.355424 -0.878231 0.076169 -0.447886
	-0.740141 0.082596 -0.360528 -0.000374 -0.707079 -0.000000
	-0.450942 -0.330299 -0.236787 0.865705 -0.166269 0.471641
	-0.679646 -0.554428 0.211282 -0.685280 0.313696 -0.441574
}

frame 12 {
	-0.018897 0.000000 0.100036 0.707107 0.000000 -0.000000
	0.171538 -0.360185 -0.336093 -0.637274 0.298983 -0.294863
	-0.000000 0.520055 -0.000000 -0.198524 0.018236 -0.092987
	-0.136733 0.038256 0.004402 -0.152031 -0.131689 -0.642091
	0.000000 0.447469 -0.000000 0.287584 0.359747 -0.827154
	0.151140 0.042027 0.014281 -0.116592 0.114645 0.391185
	0.000000 0.437615 -0.000000 0.252603 -0.548960 0.668472
	0.162623 0.221462 -0.011451 -0.152674 0.062547 0.166686
	-0.000000 0.501200 -0.000000 0.575800 0.009792 -0.066027
	-0.162016 0.218096 -0.011498 -0.259954 -0.083243 -0.742307
	-0.000000 0.492872 0.000000 0.744691 -0.027534 0.032779
	0.142975 0.370391 -0.009384 -0.014150 0.015622 0.128453
	-0.000000 0.422763 0.000000 0.488192 -0.038127 0.122805
	-0.137594 0.373323 -0.014729 -0.064847 -0.040114 -0.402201
	-0.000000 0.421663 -0.000000 0.645454 0.036556 -0.133113
	0.035670 -0.040818 0.060014 0.018181 -0.047886 0.998486
	0.000000 0.026025 -0.000000 0.002853 -0.033945 0.001202
	-0.027675 -0.041720 0.059816 0.052105 0.046785 -0.997231
	0.000000 0.025637 -0.000000 0.001972 0.121503 -0.002943
	-0.050906 -0.034136 0.024111 0.058391 0.145779 -0.987384
	-0.000000 0.049218 -0.000000 0.001273 0.130147 -0.004151
	0.059788 -0.034178 0.023788 0.058968 -0.144899 0.987571
	-0.000000 0.049218 0.000000 0.001262 -0.129525 0.004153
	0.032298 -0.054366 -0.002833 0.005768 -0.051294 -0.998666
	-0.000000 0.018246 0.000000 0.000223 0.105798 0.003347
	-0.026453 -0.054341 -0.002832 0.011410 0.051460 0.998493
	0.000000 0.018247 0.000000 0.000219 -0.104659 -0.003397
	-0.053205 -0.156103 -0.013104 -0.083867 0.236072 0.951085
	0.060800 -0.156152 -0.013104 -0.083973 -0.236037 -0.951008
	0.038704 -0.122207 0.051886 -0.000097 -0.468376 0.883529
	-0.031079 -0.122177 0.051886 -0.000097 -0.468376 0.883529
	0.031859 -0.116268 0.003550 -0.080502 -0.440954 -0.880320
	-0.024230 -0.116245 0.003550 -0.080308 0.440987 0.880387
	-0.015006 0.072944 -0.773434 -0.000345 -0.924657 0.000144
	-0.278787 -0.529487 -0.722035 -0.372342 0.231203 -0.893659
	-0.581522 0.073430 -0.831409 -0.000374 -0.707079 -0.000000
	-0.213911 -0.457952 -0.518543 -0.339129 0.234470 -0.906822
	0.474768 0.072944 0.404512 -0.000351 -0.909250 0.000130
	0.252528 -0.529487 0.555269 -0.968125 0.000000 -0.000000
	-0.369730 0.067522 0.697303 -0.000374 -0.707107 -0.000000
	-0.223781 -0.456157 0.514222 -0.906822 0.087686 -0.339129
	-0.324505 0.073430 0.630677 -0.000345 -0.924657 0.000144
	-0.281957 -0.327923 0.356686 -0.878231 0.076169 -0.447886
	-0.740141 0.082596 -0.360528 -0.000374 -0.707079 -0.000000
	-0.450942 -0.330299 -0.236787 0.865705 -0.166269 0.471641
	-0.667014 -0.554428 0.241601 -0.698530 0.298584 -0.420300
}

frame 13 {
	-0.018897 0.000000 0.100036 0.707107 0.000000 -0.000000
	0.158536 -0.360185 -0.366699 -0.646369 0.278187 -0.274354
	0.000000 0.520055 0.000000 -0.193563 0.018457 -0.094309
	-0.136732 0.038256 0.004402 -0.148824 -0.127267 -0.666710
	-0.000000 0.447469 -0.000000 0.288074 0.344600 -0.836125
	0.151140 0.042027 0.014281 -0.194965 0.159552 0.445885
	0.000000 0.437615 0.000000 0.299980 -0.406017 0.803486
	0.162623 0.221462 -0.011451 -0.137626 0.059924 0.139832
	0.000000 0.501200 -0.000000 0.546983 0.009281 -0.064313
	-0.162016 0.218096 -0.011498 -0.271479 -0.087095 -0.761038
	0.000000 0.492872 -0.000000 0.756574 -0.033220 0.023531
	0.142975 0.370391 -0.009384 0.000137 0.011558 0.104683
	-0.000000 0.422763 0.000000 0.453591 -0.040269 0.113189
	-0.137594 0.373323 -0.014729 -0.063304 -0.044187 -0.421338
	0.000000 0.421663 0.000000 0.650090 0.035377 -0.136625
	0.035670 -0.040818 0.060014 0.018183 -0.047885 0.998486
	-0.000000 0.026025 -0.000000 0.002853 -0.033945 0.001202
	-0.027674 -0.041720 0.059816 0.052106 0.046784 -0.997231
	0.000000 0.025637 0.000000 0.001972 0.121503 -0.002943
	-0.050906 -0.034136 0.024111 0.058393 0.145778 -0.987384
	0.000000 0.049218 0.000000 0.001273 0.130147 -0.004151
	0.059788 -0.034178 0.023788 0.058968 -0.144900 0.987571
	0.000000 0.049218 -0.000000 0.001262 -0.129525 0.004153
	0.032298 -0.054366 -0.002832 0.005742 -0.051266 -0.998668
	0.000000 0.018246 -0.000000 0.000223 0.105798 0.003347
	-0.026453 -0.054341 -0.002832 0.011406 0.051462 0.998493
	-0.000000 0.018246 -0.000000 0.000219 -0.104659 -0.003397
	-0.053205 -0.156103 -0.013103 -0.083867 0.236072 0.951085
	0.060800 -0.156152 -0.013104 -0.083973 -0.236037 -0.951008
	0.038704 -0.122207 0.051886 -0.000097 -0.468376 0.883529
	-0.031079 -0.122177 0.051886 -0.000097 -0.468376 0.883529
	0.031859 -0.116268 0.003550 -0.080502 -0.440954 -0.880320
	-0.024230 -0.116245 0.003550 -0.080308 0.440987 0.880387
	-0.015006 0.072944 -0.773434 -0.000345 -0.924657 0.000144
	-0.278787 -0.529487 -0.722035 -0.372342 0.231203 -0.893659
	-0.581522 0.073430 -0.831409 -0.000374 -0.707079 -0.000000
	-0.214385 -0.458388 -0.515420 -0.339129 0.234470 -0.906822
	0.517009 0.032880 0.100292 -0.000347 -0.921371 0.000141
	0.381164 -0.529487 0.307649 -0.949326 -0.049119 0.189858
	-0.369730 0.067522 0.697303 -0.000374 -0.707107 -0.000000
	-0.223781 -0.456157 0.514222 -0.906822 0.087686 -0.339129
	-0.324505 0.073430 0.630677 -0.000345 -0.924657 0.000144
	-0.276964 -0.327909 0.355762 -0.879401 0.075777 -0.445584
	-0.740141 0.082596 -0.360528 -0.000374 -0.707079 -0.000000
	-0.450942 -0.330299 -0.236787 0.865705 -0.166269 0.471641
	-0.654902 -0.554428 0.270674 -0.710582 0.283869 -0.399587
}

frame 14 {
	-0.018897 0.000000 0.100036 0.707107 0.000000 -0.000000
	0.154203 -0.360185 -0.376904 -0.649233 0.271242 -0.267505
	0.000000 0.520055 0.000000 -0.189698 0.015676 -0.079051
	-0.136732 0.038257 0.004402 -0.147673 -0.125438 -0.674731
	0.000000 0.447469 0.000000 0.288153 0.339784 -0.838878
	0.151140 0.042027 0.014281 -0.136578 0.118766 0.681613
	-0.000000 0.437615 0.000000 0.289056 -0.349836 0.831773
	0.162623 0.221463 -0.011451 -0.132160 0.059108 0.130978
	-0.000000 0.501200 0.000000 0.536559 0.009153 -0.063719
	-0.162016 0.218096 -0.011498 -0.273479 -0.092048 -0.759330
	-0.000000 0.492872 -0.000000 0.760483 -0.038941 0.014636
	0.142976 0.370391 -0.009384 0.005488 0.009660 0.097929
	0.000000 0.422763 0.000000 0.440712 -0.041413 0.108903
	-0.137594 0.373323 -0.014729 -0.062620 -0.045511 -0.427227
	-0.000000 0.421663 -0.000000 0.651346 0.034949 -0.137870
	0.035670 -0.040818 0.060014 0.018183 -0.047886 0.998486
	-0.000000 0.026025 0.000000 0.002853 -0.033945 0.001202
	-0.027674 -0.041720 0.059816 0.052106 0.046786 -0.997231
	-0.000000 0.025637 0.000000 0.001972 0.121503 -0.002943
	-0.050906 -0.034136 0.024111 0.058392 0.145779 -0.987384
	0.000000 0.049218 -0.000000 0.001273 0.130147 -0.004151
	0.059788 -0.034178 0.023788 0.058967 -0.144899 0.987571
	0.000000 0.049218 -0.000000 0.001262 -0.129525 0.004153
	0.032298 -0.054366 -0.002832 0.005724 -0.051280 -0.998667
	0.000000 0.018247 -0.000000 0.000223 0.105798 0.003347
	-0.026453 -0.054341 -0.002832 0.011410 0.051462 0.998493
	-0.000000 0.018247 0.000000 0.000219 -0.104659 -0.003397
	-0.053205 -0.156103 -0.013104 -0.083867 0.236072 0.951085
	0.060800 -0.156152 -0.013104 -0.083973 -0.236037 -0.951008
	0.038704 -0.122207 0.051886 -0.000097 -0.468376 0.883529
	-0.031079 -0.122177 0.051886 -0.000097 -0.468376 0.883529
	0.031859 -0.116268 0.003550 -0.080502 -0.440954 -0.880320
	-0.024230 -0.116245 0.003550 -0.080308 0.440987 0.880387
	-0.015006 0.072944 -0.773434 -0.000345 -0.924657 0.000144
	-0.278787 -0.529487 -0.722035 -0.372342 0.231203 -0.893659
	-0.581522 0.073430 -0.831409 -0.000374 -0.707079 -0.000000
	-0.218387 -0.459659 -0.505347 -0.339129 0.234470 -0.906822
	0.559251 0.072944 -0.203927 -0.000345 -0.924657 0.000144
	0.509801 -0.529487 0.060029 -0.893660 -0.096330 0.372342
	-0.369730 0.067522 0.697303 -0.000374 -0.707107 -0.000000
	-0.223781 -0.456157 0.514222 -0.906822 0.087686 -0.339129
	-0.324505 0.073430 0.630677 -0.000345 -0.924657 0.000144
	-0.271854 -0.327932 0.354587 -0.882911 0.074588 -0.438589
	-0.740141 0.082596 -0.360528 -0.000374 -0.707079 -0.000000
	-0.450942 -0.330299 -0.236787 0.865705 -0.166269 0.471641
	-0.643624 -0.554428 0.297746 -0.721209 0.270005 -0.380071
}

frame 15 {
	-0.018897 0.000000 0.100036 0.707107 0.000000 -0.000000
	0.154203 -0.360185 -0.376904 -0.649233 0.271242 -0.267505
	0.000000 0.520055 0.000000 -0.186850 0.011679 -0.057068
	-0.136732 0.038257 0.004402 -0.147673 -0.125438 -0.674731
	0.000000 0.447469 0.000000 0.288153 0.339784 -0.838878
	0.151140 0.042027 0.014281 -0.136578 0.118766 0.681613
	-0.000000 0.437615 0.000000 0.289056 -0.349836 0.831773
	0.162623 0.221463 -0.011451 -0.132223 0.055398 0.136728
	-0.000000 0.501200 -0.000000 0.536111 0.006892 -0.067471
	-0.162016 0.218096 -0.011498 -0.265551 -0.102594 -0.740891
	-0.000000 0.492872 0.000000 0.760635 -0.046197 0.002936
	0.142976 0.370391 -0.009384 0.005062 0.008621 0.099510
	0.000000 0.422763 0.000000 0.441005 -0.042044 0.107684
	-0.137594 0.373323 -0.014729 -0.061803 -0.046175 -0.425002
	-0.000000 0.421663 -0.000000 0.650999 0.034317 -0.139503
	0.035670 -0.040818 0.060014 0.018183 -0.047886 0.998486
	-0.000000 0.026025 0.000000 0.002853 -0.033945 0.001202
	-0.027674 -0.041720 0.059816 0.052106 0.046786 -0.997231
	-0.000000 0.025637 0.000000 0.001972 0.121503 -0.002943
	-0.050906 -0.034136 0.024111 0.058392 0.145779 -0.987384
	0.000000 0.049218 -0.000000 0.001273 0.130147 -0.004151
	0.059788 -0.034178 0.023788 0.058967 -0.144899 0.987571
	0.000000 0.049218 -0.000000 0.001262 -0.129525 0.004153
	0.032298 -0.054366 -0.002832 0.005724 -0.051280 -0.998667
	0.000000 0.018247 -0.000000 0.000223 0.105798 0.003347
	-0.026453 -0.054341 -0.002832 0.011410 0.051462 0.998493
	-0.000000 0.018247 0.000000 0.000219 -0.104659 -0.003397
	-0.053205 -0.156103 -0.013104 -0.083867 0.236072 0.951085
	0.060800 -0.156152 -0.013104 -0.083973 -0.236037 -0.951008
	0.038704 -0.122207 0.051886 -0.000097 -0.468376 0.883529
	-0.031079 -0.122177 0.051886 -0.000097 -0.468376 0.883529
	0.031859 -0.116268 0.003550 -0.080502 -0.440954 -0.880320
	-0.024230 -0.116245 0.003550 -0.080308 0.440987 0.880387
	-0.015006 0.072944 -0.773434 -0.000345 -0.924657 0.000144
	-0.278787 -0.529487 -0.722035 -0.372342 0.231203 -0.893659
	-0.581522 0.073430 -0.831409 -0.000374 -0.707079 -0.000000
	-0.230993 -0.461486 -0.488292 -0.339129 0.234470 -0.906822
	0.559251 0.072944 -0.203927 -0.000345 -0.924657 0.000144
	0.509801 -0.529487 0.060029 -0.893660 -0.096330 0.372342
	-0.369730 0.067522 0.697303 -0.000374 -0.707107 -0.000000
	-0.200978 -0.456160 0.505266 -0.914660 0.082066 -0.317382
	-0.324505 0.073430 0.630677 -0.000345 -0.924657 0.000144
	-0.266658 -0.327994 0.353167 -0.888669 0.072583 -0.426800
	-0.740141 0.082596 -0.360528 -0.000374 -0.707079 -0.000000
	-0.451779 -0.330299 -0.234729 0.867266 -0.166338 0.468765
	-0.633448 -0.554428 0.322174 -0.730291 0.257391 -0.362314
}

frame 16 {
	-0.018897 0.000000 0.100036 0.707107 0.000000 -0.000000
	0.154203 -0.360185 -0.376904 -0.649233 0.271242 -0.267505
	0.000000 0.520055 0.000000 -0.184336 0.008252 -0.038226
	-0.136732 0.038257 0.004402 -0.147673 -0.125438 -0.674731
	0.000000 0.447469 0.000000 0.288153 0.339784 -0.838878
	0.151140 0.042027 0.014281 -0.136578 0.118766 0.681613
	-0.000000 0.437615 0.000000 0.289056 -0.349836 0.831773
	0.162623 0.221463 -0.011451 -0.152524 0.059087 0.175639
	0.000000 0.501200 -0.000000 0.561362 0.007500 -0.068663
	-0.162016 0.218096 -0.011498 -0.247694 -0.120899 -0.708855
	-0.000000 0.492872 0.000000 0.760516 -0.056605 -0.013855
	0.142976 0.370391 -0.009384 0.004635 0.007570 0.101114
	-0.000000 0.422763 -0.000000 0.441300 -0.042682 0.106443
	-0.137594 0.373323 -0.014729 -0.059305 -0.048149 -0.418345
	-0.000000 0.421663 -0.000000 0.649939 0.032428 -0.144361
	0.035670 -0.040818 0.060014 0.018183 -0.047886 0.998486
	-0.000000 0.026025 0.000000 0.002853 -0.033945 0.001202
	-0.027674 -0.041720 0.059816 0.052106 0.046786 -0.997231
	-0.000000 0.025637 0.000000 0.001972 0.121503 -0.002943
	-0.050906 -0.034136 0.024111 0.058392 0.145779 -0.987384
	0.000000 0.049218 -0.000000 0.001273 0.130147 -0.004151
	0.059788 -0.034178 0.023788 0.058967 -0.144899 0.987571
	0.000000 0.049218 -0.000000 0.001262 -0.129525 0.004153
	0.032298 -0.054366 -0.002832 0.005724 -0.051280 -0.998667
	0.000000 0.018247 -0.000000 0.000223 0.105798 0.003347
	-0.026453 -0.054341 -0.002832 0.011410 0.051462 0.998493
	-0.000000 0.018247 0.000000 0.000219 -0.104659 -0.003397
	-0.053205 -0.156103 -0.013104 -0.083867 0.236072 0.951085
	0.060800 -0.156152 -0.013104 -0.083973 -0.236037 -0.951008
	0.038704 -0.122207 0.051886 -0.000097 -0.468376 0.883529
	-0.031079 -0.122177 0.051886 -0.000097 -0.468376 0.883529
	0.031859 -0.116268 0.003550 -0.080502 -0.440954 -0.880320
	-0.024230 -0.116245 0.003550 -0.080308 0.440987 0.880387
	-0.015006 0.072944 -0.773434 -0.000345 -0.924657 0.000144
	-0.278787 -0.529487 -0.722035 -0.372342 0.231203 -0.893659
	-0.581522 0.073430 -0.831409 -0.000374 -0.707079 -0.000000
	-0.256910 -0.463313 -0.466245 -0.339129 0.234470 -0.906822
	0.559251 0.072944 -0.203927 -0.000345 -0.924657 0.000144
	0.509801 -0.529487 0.060029 -0.893660 -0.096330 0.372342
	-0.301102 0.052898 0.718150 -0.000374 -0.744636 0.000020
	-0.134628 -0.456161 0.479213 -0.934750 0.065201 -0.252145
	-0.324505 0.073430 0.630677 -0.000345 -0.924657 0.000144
	-0.261418 -0.328093 0.351515 -0.896459 0.069757 -0.410188
	-0.740141 0.082596 -0.360528 -0.000374 -0.707079 -0.000000
	-0.454309 -0.330299 -0.228508 0.871939 -0.166542 0.460015
	-0.624590 -0.554428 0.343438 -0.737798 0.246349 -0.346772
}

frame 17 {
	-0.018897 0.000000 0.100036 0.707107 0.000000 -0.000000
	0.154203 -0.360185 -0.376904 -0.649233 0.271242 -0.267505
	0.000000 0.520055 0.000000 -0.182247 0.005472 -0.022942
	-0.136732 0.038257 0.004402 -0.147673 -0.125438 -0.674731
	0.000000 0.447469 0.000000 0.288153 0.339784 -0.838878
	0.151140 0.042027 0.014281 -0.136578 0.118766 0.681613
	-0.000000 0.437615 0.000000 0.289056 -0.349836 0.831773
	0.162623 0.221463 -0.011451 -0.166905 0.075168 0.258929
	-0.000000 0.501200 -0.000000 0.584444 0.016401 -0.055051
	-0.162016 0.218096 -0.011498 -0.220458 -0.142808 -0.666551
	0.000000 0.492872 0.000000 0.759921 -0.068209 -0.032570
	0.142976 0.370391 -0.009384 0.004229 0.006558 0.102661
	0.000000 0.422763 0.000000 0.441582 -0.043295 0.105244
	-0.137594 0.373323 -0.014729 -0.055013 -0.051371 -0.407360
	0.000000 0.421663 0.000000 0.648133 0.029318 -0.152278
	0.035670 -0.040818 0.060014 0.018183 -0.047886 0.998486
	-0.000000 0.026025 0.000000 0.002853 -0.033945 0.001202
	-0.027674 -0.041720 0.059816 0.052106 0.046786 -0.997231
	-0.000000 0.025637 0.000000 0.001972 0.121503 -0.002943
	-0.050906 -0.034136 0.024111 0.058392 0.145779 -0.987384
	0.000000 0.049218 -0.000000 0.001273 0.130147 -0.004151
	0.059788 -0.034178 0.023788 0.058967 -0.144899 0.987571
	0.000000 0.049218 -0.000000 0.001262 -0.129525 0.004153
	0.032298 -0.054366 -0.002832 0.005724 -0.051280 -0.998667
	0.000000 0.018247 -0.000000 0.000223 0.105798 0.003347
	-0.026453 -0.054341 -0.002832 0.011410 0.051462 0.998493
	-0.000000 0.018247 0.000000 0.000219 -0.104659 -0.003397
	-0.053205 -0.156103 -0.013104 -0.083867 0.236072 0.951085
	0.060800 -0.156152 -0.013104 -0.083973 -0.236037 -0.951008
	0.038704 -0.122207 0.051886 -0.000097 -0.468376 0.883529
	-0.031079 -0.122177 0.051886 -0.000097 -0.468376 0.883529
	0.031859 -0.116268 0.003550 -0.080502 -0.440954 -0.880320
	-0.024230 -0.116245 0.003550 -0.080308 0.440987 0.880387
	-0.015006 0.072944 -0.773434 -0.000345 -0.924657 0.000144
	-0.278787 -0.529487 -0.722035 -0.372342 0.231203 -0.893659
	-0.581522 0.073430 -0.831409 -0.000374 -0.707079 -0.000000
	-0.297540 -0.464584 -0.442450 -0.339129 0.234470 -0.906822
	0.559251 0.072944 -0.203927 -0.000345 -0.924657 0.000144
	0.509801 -0.529487 0.060029 -0.893660 -0.096330 0.372342
	-0.125959 0.038201 0.771622 -0.000367 -0.832046 0.000073
	-0.039262 -0.456157 0.441772 -0.955720 0.040002 -0.154708
	-0.324505 0.073430 0.630677 -0.000345 -0.924657 0.000144
	-0.256188 -0.328228 0.349652 -0.905914 0.066130 -0.388860
	-0.740141 0.082596 -0.360528 -0.000374 -0.707079 -0.000000
	-0.458524 -0.330299 -0.218140 0.879567 -0.166844 0.445257
	-0.617210 -0.554428 0.361153 -0.743766 0.237119 -0.333779
}

frame 18 {
	-0.018897 0.000000 0.100036 0.707107 0.000000 -0.000000
	0.154203 -0.360185 -0.376904 -0.649233 0.271242 -0.267505
	0.000000 0.520055 0.000000 -0.180605 0.003327 -0.011149
	-0.136732 0.038257 0.004402 -0.147673 -0.125438 -0.674731
	0.000000 0.447469 0.000000 0.288153 0.339784 -0.838878
	0.151140 0.042027 0.014281 -0.136578 0.118766 0.681613
	-0.000000 0.437615 0.000000 0.289056 -0.349836 0.831773
	0.162623 0.221463 -0.011451 -0.107029 0.073505 0.366696
	-0.000000 0.501200 0.000000 0.521964 0.031448 -0.025205
	-0.162016 0.218096 -0.011498 -0.190336 -0.162205 -0.623635
	-0.000000 0.492872 -0.000000 0.759064 -0.078685 -0.049285
	0.142976 0.370391 -0.009384 0.003856 0.005521 0.104079
	-0.000000 0.422763 0.000000 0.441839 -0.043921 0.104013
	-0.137594 0.373323 -0.014729 -0.049056 -0.055553 -0.392938
	-0.000000 0.421663 0.000000 0.645656 0.025243 -0.162469
	0.035670 -0.040818 0.060014 0.018183 -0.047886 0.998486
	-0.000000 0.026025 0.000000 0.002853 -0.033945 0.001202
	-0.027674 -0.041720 0.059816 0.052106 0.046786 -0.997231
	-0.000000 0.025637 0.000000 0.001972 0.121503 -0.002943
	-0.050906 -0.034136 0.024111 0.058392 0.145779 -0.987384
	0.000000 0.049218 -0.000000 0.001273 0.130147 -0.004151
	0.059788 -0.034178 0.023788 0.058967 -0.144899 0.987571
	0.000000 0.049218 -0.000000 0.001262 -0.129525 0.004153
	0.032298 -0.054366 -0.002832 0.005724 -0.051280 -0.998667
	0.000000 0.018247 -0.000000 0.000223 0.105798 0.003347
	-0.026453 -0.054341 -0.002832 0.011410 0.051462 0.998493
	-0.000000 0.018247 0.000000 0.000219 -0.104659 -0.003397
	-0.053205 -0.156103 -0.013104 -0.083867 0.236072 0.951085
	0.060800 -0.156152 -0.013104 -0.083973 -0.236037 -0.951008
	0.038704 -0.122207 0.051886 -0.000097 -0.468376 0.883529
	-0.031079 -0.122177 0.051886 -0.000097 -0.468376 0.883529
	0.031859 -0.116268 0.003550 -0.080502 -0.440954 -0.880320
	-0.024230 -0.116245 0.003550 -0.080308 0.440987 0.880387
	-0.015006 0.072944 -0.773434 -0.000345 -0.924657 0.000144
	-0.278787 -0.529487 -0.722035 -0.372342 0.231203 -0.893659
	-0.581522 0.073430 -0.831409 -0.000374 -0.707079 -0.000000
	-0.350870 -0.465020 -0.419555 -0.339129 0.234470 -0.906822
	0.559251 0.072944 -0.203927 -0.000345 -0.924657 0.000144
	0.509801 -0.529487 0.060029 -0.893660 -0.096330 0.372342
	0.117813 0.067522 0.845940 -0.000345 -0.924673 0.000144
	0.056105 -0.456153 0.404331 -0.966561 0.014378 -0.055631
	-0.324505 0.073430 0.630677 -0.000345 -0.924657 0.000144
	-0.251031 -0.328394 0.347615 -0.916529 0.061754 -0.363133
	-0.740141 0.082596 -0.360528 -0.000374 -0.707079 -0.000000
	-0.464356 -0.330299 -0.203797 0.889774 -0.167183 0.424493
	-0.611416 -0.554428 0.375063 -0.748269 0.229858 -0.323559
}

frame 19 {
	-0.018897 0.000000 0.100036 0.707107 0.000000 -0.000000
	0.154203 -0.360185 -0.376904 -0.649233 0.271242 -0.267505
	0.000000 0.520055 0.000000 -0.179424 0.001805 -0.002783
	-0.136732 0.038257 0.004402 -0.147673 -0.125438 -0.674731
	0.000000 0.447469 0.000000 0.288153 0.339784 -0.838878
	0.151140 0.042027 0.014281 -0.136578 0.118766 0.681613
	-0.000000 0.437615 0.000000 0.289056 -0.349836 0.831773
	0.162623 0.221463 -0.011451 -0.115305 0.051444 0.396700
	-0.000000 0.501200 -0.000000 0.520505 0.019287 -0.045184
	-0.162016 0.218096 -0.011498 -0.235743 -0.148541 -0.482954
	0.000000 0.492872 0.000000 0.734046 -0.037338 0.006745
	0.142976 0.370391 -0.009384 0.003497 0.004585 0.105538
	0.000000 0.422763 0.000000 0.442083 -0.044487 0.102893
	-0.137594 0.373323 -0.014729 -0.041504 -0.060486 -0.375826
	-0.000000 0.421663 -0.000000 0.642611 0.020307 -0.174141
	0.035670 -0.040818 0.060014 0.018183 -0.047886 0.998486
	-0.000000 0.026025 0.000000 0.002853 -0.033945 0.001202
	-0.027674 -0.041720 0.059816 0.052106 0.046786 -0.997231
	-0.000000 0.025637 0.000000 0.001972 0.121503 -0.002943
	-0.050906 -0.034136 0.024111 0.058392 0.145779 -0.987384
	0.000000 0.049218 -0.000000 0.001273 0.130147 -0.004151
	0.059788 -0.034178 0.023788 0.058967 -0.144899 0.987571
	0.000000 0.049218 -0.000000 0.001262 -0.129525 0.004153
	0.032298 -0.054366 -0.002832 0.005724 -0.051280 -0.998667
	0.000000 0.018247 -0.000000 0.000223 0.105798 0.003347
	-0.026453 -0.054341 -0.002832 0.011410 0.051462 0.998493
	-0.000000 0.018247 0.000000 0.000219 -0.104659 -0.003397
	-0.053205 -0.156103 -0.013104 -0.083867 0.236072 0.951085
	0.060800 -0.156152 -0.013104 -0.083973 -0.236037 -0.951008
	0.038704 -0.122207 0.051886 -0.000097 -0.468376 0.883529
	-0.031079 -0.122177 0.051886 -0.000097 -0.468376 0.883529
	0.031859 -0.116268 0.003550 -0.080502 -0.440954 -0.880320
	-0.024230 -0.116245 0.003550 -0.080308 0.440987 0.880387
	-0.015006 0.072944 -0.773434 -0.000345 -0.924657 0.000144
	-0.278787 -0.529487 -0.722035 -0.372342 0.231203 -0.893659
	-0.821811 0.022889 -0.577811 -0.000367 -0.832024 0.000073
	-0.483118 -0.461486 -0.385823 -0.510379 0.212721 -0.822708
	0.559251 0.072944 -0.203927 -0.000345 -0.924657 0.000144
	0.509801 -0.529487 0.060029 -0.893660 -0.096330 0.372342
	0.117813 0.067522 0.845940 -0.000345 -0.924673 0.000144
	0.122455 -0.456154 0.378278 -0.968078 -0.003264 0.012612
	-0.324505 0.073430 0.630677 -0.000345 -0.924657 0.000144
	-0.246022 -0.328587 0.345448 -0.927688 0.056730 -0.333597
	-0.740141 0.082596 -0.360528 -0.000374 -0.707079 -0.000000
	-0.471654 -0.330299 -0.185848 0.901944 -0.167484 0.397981
	-0.607269 -0.554428 0.385021 -0.751392 0.224656 -0.316237
}

frame 20 {
	-0.018897 0.000000 0.100036 0.707107 0.000000 -0.000000
	0.154203 -0.360185 -0.376904 -0.649233 0.271242 -0.267505
	0.000000 0.520055 0.000000 -0.178719 0.000905 0.002162
	-0.136732 0.038257 0.004402 -0.147673 -0.125438 -0.674731
	0.000000 0.447469 0.000000 0.288153 0.339784 -0.838878
	0.151140 0.042027 0.014281 -0.136578 0.118766 0.681613
	-0.000000 0.437615 0.000000 0.289056 -0.349836 0.831773
	0.162623 0.221463 -0.011451 -0.117943 0.043029 0.407656
	0.000000 0.501200 0.000000 0.519802 0.014925 -0.052609
	-0.162016 0.218096 -0.011498 -0.116163 -0.038814 -0.404078
	-0.000000 0.492872 -0.000000 0.515808 -0.011248 0.048502
	0.142976 0.370391 -0.009384 0.003161 0.003704 0.106914
	-0.000000 0.422763 -0.000000 0.442313 -0.045021 0.101834
	-0.137594 0.373323 -0.014729 -0.032972 -0.065705 -0.357779
	-0.000000 0.421663 0.000000 0.639386 0.014659 -0.185651
	0.035670 -0.040818 0.060014 0.018183 -0.047886 0.998486
	-0.000000 0.026025 0.000000 0.002853 -0.033945 0.001202
	-0.027674 -0.041720 0.059816 0.052106 0.046786 -0.997231
	-0.000000 0.025637 0.000000 0.001972 0.121503 -0.002943
	-0.050906 -0.034136 0.024111 0.058392 0.145779 -0.987384
	0.000000 0.049218 -0.000000 0.001273 0.130147 -0.004151
	0.059788 -0.034178 0.023788 0.058967 -0.144899 0.987571
	0.000000 0.049218 -0.000000 0.001262 -0.129525 0.004153
	0.032298 -0.054366 -0.002832 0.005724 -0.051280 -0.998667
	0.000000 0.018247 -0.000000 0.000223 0.105798 0.003347
	-0.026453 -0.054341 -0.002832 0.011410 0.051462 0.998493
	-0.000000 0.018247 0.000000 0.000219 -0.104659 -0.003397
	-0.053205 -0.156103 -0.013104 -0.083867 0.236072 0.951085
	0.060800 -0.156152 -0.013104 -0.083973 -0.236037 -0.951008
	0.038704 -0.122207 0.051886 -0.000097 -0.468376 0.883529
	-0.031079 -0.122177 0.051886 -0.000097 -0.468376 0.883529
	0.031859 -0.116268 0.003550 -0.080502 -0.440954 -0.880320
	-0.024230 -0.116245 0.003550 -0.080308 0.440987 0.880387
	-0.015006 0.072944 -0.773434 -0.000345 -0.924657 0.000144
	-0.278787 -0.529487 -0.722035 -0.372342 0.231203 -0.893659
	-1.062100 0.073430 -0.324212 -0.000345 -0.924657 0.000144
	-0.581095 -0.457952 -0.364921 -0.661809 0.182711 -0.706643
	0.559251 0.072944 -0.203927 -0.000345 -0.924657 0.000144
	0.509801 -0.529487 0.060029 -0.893660 -0.096330 0.372342
	0.117813 0.067522 0.845940 -0.000345 -0.924673 0.000144
	0.145257 -0.456157 0.369322 -0.967502 -0.009236 0.035721
	-0.324505 0.073430 0.630677 -0.000345 -0.924657 0.000144
	-0.241241 -0.328800 0.343209 -0.938723 0.051212 -0.301150
	-0.740141 0.082596 -0.360528 -0.000374 -0.707079 -0.000000
	-0.480174 -0.330299 -0.164894 0.915244 -0.167638 0.366365
	-0.604790 -0.554428 0.390974 -0.753220 0.221545 -0.311858
}

frame 21 {
	-0.018897 0.000000 0.100036 0.707107 0.000000 -0.000000
	0.154203 -0.360185 -0.376904 -0.649233 0.271242 -0.267505
	0.000000 0.520055 0.000000 -0.178497 0.000622 0.003720
	-0.136732 0.038257 0.004402 -0.147673 -0.125438 -0.674731
	0.000000 0.447469 0.000000 0.288153 0.339784 -0.838878
	0.151140 0.042027 0.014281 -0.136578 0.118766 0.681613
	-0.000000 0.437615 0.000000 0.289056 -0.349836 0.831773
	0.162623 0.221463 -0.011451 -0.117943 0.043029 0.407656
	0.000000 0.501200 0.000000 0.519802 0.014925 -0.052609
	-0.162016 0.218096 -0.011498 -0.116163 -0.038814 -0.404078
	-0.000000 0.492872 -0.000000 0.515808 -0.011248 0.048502
	0.142976 0.370391 -0.009384 0.002853 0.002889 0.108187
	0.000000 0.422763 0.000000 0.442526 -0.045515 0.100854
	-0.137594 0.373323 -0.014729 -0.023787 -0.071042 -0.339613
	0.000000 0.421663 0.000000 0.636093 0.008851 -0.196657
	0.035670 -0.040818 0.060014 0.018183 -0.047886 0.998486
	-0.000000 0.026025 0.000000 0.002853 -0.033945 0.001202
	-0.027674 -0.041720 0.059816 0.052106 0.046786 -0.997231
	-0.000000 0.025637 0.000000 0.001972 0.121503 -0.002943
	-0.050906 -0.034136 0.024111 0.058392 0.145779 -0.987384
	0.000000 0.049218 -0.000000 0.001273 0.130147 -0.004151
	0.059788 -0.034178 0.023788 0.058967 -0.144899 0.987571
	0.000000 0.049218 -0.000000 0.001262 -0.129525 0.004153
	0.032298 -0.054366 -0.002832 0.005724 -0.051280 -0.998667
	0.000000 0.018247 -0.000000 0.000223 0.105798 0.003347
	-0.026453 -0.054341 -0.002832 0.011410 0.051462 0.998493
	-0.000000 0.018247 0.000000 0.000219 -0.104659 -0.003397
	-0.053205 -0.156103 -0.013104 -0.083867 0.236072 0.951085
	0.060800 -0.156152 -0.013104 -0.083973 -0.236037 -0.951008
	0.038704 -0.122207 0.051886 -0.000097 -0.468376 0.883529
	-0.031079 -0.122177 0.051886 -0.000097 -0.468376 0.883529
	0.031859 -0.116268 0.003550 -0.080502 -0.440954 -0.880320
	-0.024230 -0.116245 0.003550 -0.080308 0.440987 0.880387
	-0.015006 0.072944 -0.773434 -0.000345 -0.924657 0.000144
	-0.278787 -0.529487 -0.722035 -0.372342 0.231203 -0.893659
	-1.062100 0.073430 -0.324212 -0.000345 -0.924657 0.000144
	-0.581095 -0.457952 -0.364921 -0.661809 0.182711 -0.706643
	0.559251 0.072944 -0.203927 -0.000345 -0.924657 0.000144
	0.509801 -0.529487 0.060029 -0.893660 -0.096330 0.372342
	0.117813 0.067522 0.845940 -0.000345 -0.924673 0.000144
	0.145257 -0.456157 0.369322 -0.967502 -0.009236 0.035721
	-0.324505 0.073430 0.630677 -0.000345 -0.924657 0.000144
	-0.236768 -0.329024 0.340963 -0.949008 0.045399 -0.266973
	-0.740141 0.082596 -0.360528 -0.000374 -0.707079 -0.000000
	-0.489576 -0.330299 -0.141770 -0.928707 0.167593 -0.330748
	-0.603969 -0.554428 0.392943 -0.753819 0.220516 -0.310409
}

frame 22 {
	-0.018897 0.000000 0.100036 0.707107 0.000000 -0.000000
	0.154203 -0.360185 -0.376904 -0.649233 0.271242 -0.267505
	0.000000 0.520055 0.000000 -0.178497 0.000622 0.003720
	-0.136732 0.038257 0.004402 -0.147673 -0.125438 -0.674731
	0.000000 0.447469 0.000000 0.288153 0.339784 -0.838878
	0.151140 0.042027 0.014281 -0.136578 0.118766 0.681613
	-0.000000 0.437615 0.000000 0.289056 -0.349836 0.831773
	0.162623 0.221463 -0.011451 -0.117943 0.043029 0.407656
	0.000000 0.501200 0.000000 0.519802 0.014925 -0.052609
	-0.162016 0.218096 -0.011498 -0.116163 -0.038814 -0.404078
	-0.000000 0.492872 -0.000000 0.515808 -0.011248 0.048502
	0.142976 0.370391 -0.009384 0.002576 0.002152 0.109338
	-0.000000 0.422763 -0.000000 0.442719 -0.045961 0.099967
	-0.137594 0.373323 -0.014729 -0.014577 -0.076165 -0.322512
	-0.000000 0.421663 -0.000000 0.632916 0.003334 -0.206448
	0.035670 -0.040818 0.060014 0.018183 -0.047886 0.998486
	-0.000000 0.026025 0.000000 0.002853 -0.033945 0.001202
	-0.027674 -0.041720 0.059816 0.052106 0.046786 -0.997231
	-0.000000 0.025637 0.000000 0.001972 0.121503 -0.002943
	-0.050906 -0.034136 0.024111 0.058392 0.145779 -0.987384
	0.000000 0.049218 -0.000000 0.001273 0.130147 -0.004151
	0.059788 -0.034178 0.023788 0.058967 -0.144899 0.987571
	0.000000 0.049218 -0.000000 0.001262 -0.129525 0.004153
	0.032298 -0.054366 -0.002832 0.005724 -0.051280 -0.998667
	0.000000 0.018247 -0.000000 0.000223 0.105798 0.003347
	-0.026453 -0.054341 -0.002832 0.011410 0.051462 0.998493
	-0.000000 0.018247 0.000000 0.000219 -0.104659 -0.003397
	-0.053205 -0.156103 -0.013104 -0.083867 0.236072 0.951085
	0.060800 -0.156152 -0.013104 -0.083973 -0.236037 -0.951008
	0.038704 -0.122207 0.051886 -0.000097 -0.468376 0.883529
	-0.031079 -0.122177 0.051886 -0.000097 -0.468376 0.883529
	0.031859 -0.116268 0.003550 -0.080502 -0.440954 -0.880320
	-0.024230 -0.116245 0.003550 -0.080308 0.440987 0.880387
	-0.015006 0.072944 -0.773434 -0.000345 -0.924657 0.000144
	-0.278787 -0.529487 -0.722035 -0.372342 0.231203 -0.893659
	-1.062100 0.073430 -0.324212 -0.000345 -0.924657 0.000144
	-0.581095 -0.457952 -0.364921 -0.661809 0.182711 -0.706643
	0.559251 0.072944 -0.203927 -0.000345 -0.924657 0.000144
	0.509801 -0.529487 0.060029 -0.893660 -0.096330 0.372342
	0.117813 0.067522 0.845940 -0.000345 -0.924673 0.000144
	0.145257 -0.456157 0.369322 -0.967502 -0.009236 0.035721
	-0.324505 0.073430 0.630677 -0.000345 -0.924657 0.000144
	-0.232678 -0.329251 0.338780 -0.958050 0.039526 -0.232446
	-0.740141 0.082596 -0.360528 -0.000374 -0.707079 -0.000000
	-0.499442 -0.330299 -0.117505 -0.941384 0.167263 -0.292725
	-0.603969 -0.554428 0.392943 -0.753819 0.220516 -0.310409
}

frame 23 {
	-0.018897 0.000000 0.100036 0.707107 0.000000 -0.000000
	0.154203 -0.360185 -0.376904 -0.649233 0.271242 -0.267505
	0.000000 0.520055 0.000000 -0.178497 0.000622 0.003720
	-0.136732 0.038257 0.004402 -0.147673 -0.125438 -0.674731
	0.000000 0.447469 0.000000 0.288153 0.339784 -0.838878
	0.151140 0.042027 0.014281 -0.136578 0.118766 0.681613
	-0.000000 0.437615 0.000000 0.289056 -0.349836 0.831773
	0.162623 0.221463 -0.011451 -0.117943 0.043029 0.407656
	0.000000 0.501200 0.000000 0.519802 0.014925 -0.052609
	-0.162016 0.218096 -0.011498 -0.116163 -0.038814 -0.404078
	-0.000000 0.492872 -0.000000 0.515808 -0.011248 0.048502
	0.142976 0.370391 -0.009384 0.002324 0.001481 0.110387
	-0.000000 0.422763 0.000000 0.442895 -0.046366 0.099159
	-0.137594 0.373323 -0.014729 -0.006054 -0.080859 -0.307383
	0.000000 0.421663 0.000000 0.630223 -0.001692 -0.214637
	0.035670 -0.040818 0.060014 0.018183 -0.047886 0.998486
	-0.000000 0.026025 0.000000 0.002853 -0.033945 0.001202
	-0.027674 -0.041720 0.059816 0.052106 0.046786 -0.997231
	-0.000000 0.025637 0.000000 0.001972 0.121503 -0.002943
	-0.050906 -0.034136 0.024111 0.058392 0.145779 -0.987384
	0.000000 0.049218 -0.000000 0.001273 0.130147 -0.004151
	0.059788 -0.034178 0.023788 0.058967 -0.144899 0.987571
	0.000000 0.049218 -0.000000 0.001262 -0.129525 0.004153
	0.032298 -0.054366 -0.002832 0.005724 -0.051280 -0.998667
	0.000000 0.018247 -0.000000 0.000223 0.105798 0.003347
	-0.026453 -0.054341 -0.002832 0.011410 0.051462 0.998493
	-0.000000 0.018247 0.000000 0.000219 -0.104659 -0.003397
	-0.053205 -0.156103 -0.013104 -0.083867 0.236072 0.951085
	0.060800 -0.156152 -0.013104 -0.083973 -0.236037 -0.951008
	0.038704 -0.122207 0.051886 -0.000097 -0.468376 0.883529
	-0.031079 -0.122177 0.051886 -0.000097 -0.468376 0.883529
	0.031859 -0.116268 0.003550 -0.080502 -0.440954 -0.880320
	-0.024230 -0.116245 0.003550 -0.080308 0.440987 0.880387
	-0.015006 0.072944 -0.773434 -0.000345 -0.924657 0.000144
	-0.278787 -0.529487 -0.722035 -0.372342 0.231203 -0.893659
	-1.062100 0.073430 -0.324212 -0.000345 -0.924657 0.000144
	-0.581095 -0.457952 -0.364921 -0.661809 0.182711 -0.706643
	0.559251 0.072944 -0.203927 -0.000345 -0.924657 0.000144
	0.509801 -0.529487 0.060029 -0.893660 -0.096330 0.372342
	0.117813 0.067522 0.845940 -0.000345 -0.924673 0.000144
	0.145257 -0.456157 0.369322 -0.967502 -0.009236 0.035721
	-0.324505 0.073430 0.630677 -0.000345 -0.924657 0.000144
	-0.229031 -0.329471 0.336725 -0.965551 0.033839 -0.199001
	-0.740141 0.082596 -0.360528 -0.000374 -0.707079 -0.000000
	-0.509308 -0.330299 -0.093239 -0.952504 0.166659 -0.254219
	-0.603969 -0.554428 0.392943 -0.753819 0.220516 -0.310409
}

frame 24 {
	-0.018897 0.000000 0.100036 0.707107 0.000000 -0.000000
	0.154203 -0.360185 -0.376904 -0.649233 0.271242 -0.267505
	0.000000 0.520055 0.000000 -0.178497 0.000622 0.003720
	-0.136732 0.038257 0.004402 -0.147673 -0.125438 -0.674731
	0.000000 0.447469 0.000000 0.288153 0.339784 -0.838878
	0.151140 0.042027 0.014281 -0.136578 0.118766 0.681613
	-0.000000 0.437615 0.000000 0.289056 -0.349836 0.831773
	0.162623 0.221463 -0.011451 -0.117943 0.043029 0.407656
	0.000000 0.501200 0.000000 0.519802 0.014925 -0.052609
	-0.162016 0.218096 -0.011498 -0.116163 -0.038814 -0.404078
	-0.000000 0.492872 -0.000000 0.515808 -0.011248 0.048502
	0.142976 0.370391 -0.009384 0.002125 0.000946 0.111225
	0.000000 0.422763 -0.000000 0.443035 -0.046691 0.098512
	-0.137594 0.373323 -0.014729 0.001415 -0.084883 -0.294612
	-0.000000 0.421663 -0.000000 0.628091 -0.006408 -0.220902
	0.035670 -0.040818 0.060014 0.018183 -0.047886 0.998486
	-0.000000 0.026025 0.000000 0.002853 -0.033945 0.001202
	-0.027674 -0.041720 0.059816 0.052106 0.046786 -0.997231
	-0.000000 0.025637 0.000000 0.001972 0.121503 -0.002943
	-0.050906 -0.034136 0.024111 0.058392 0.145779 -0.987384
	0.000000 0.049218 -0.000000 0.001273 0.130147 -0.004151
	0.059788 -0.034178 0.023788 0.058967 -0.144899 0.987571
	0.000000 0.049218 -0.000000 0.001262 -0.129525 0.004153
	0.032298 -0.054366 -0.002832 0.005724 -0.051280 -0.998667
	0.000000 0.018247 -0.000000 0.000223 0.105798 0.003347
	-0.026453 -0.054341 -0.002832 0.011410 0.051462 0.998493
	-0.000000 0.018247 0.000000 0.000219 -0.104659 -0.003397
	-0.053205 -0.156103 -0.013104 -0.083867 0.236072 0.951085
	0.060800 -0.156152 -0.013104 -0.083973 -0.236037 -0.951008
	0.038704 -0.122207 0.051886 -0.000097 -0.468376 0.883529
	-0.031079 -0.122177 0.051886 -0.000097 -0.468376 0.883529
	0.031859 -0.116268 0.003550 -0.080502 -0.440954 -0.880320
	-0.024230 -0.116245 0.003550 -0.080308 0.440987 0.880387
	-0.015006 0.072944 -0.773434 -0.000345 -0.924657 0.000144
	-0.278787 -0.529487 -0.722035 -0.372342 0.231203 -0.893659
	-1.062100 0.073430 -0.324212 -0.000345 -0.924657 0.000144
	-0.581095 -0.457952 -0.364921 -0.661809 0.182711 -0.706643
	0.559251 0.072944 -0.203927 -0.000345 -0.924657 0.000144
	0.509801 -0.529487 0.060029 -0.893660 -0.096330 0.372342
	0.117813 0.067522 0.845940 -0.000345 -0.924673 0.000144
	0.145257 -0.456157 0.369322 -0.967502 -0.009236 0.035721
	-0.324505 0.073430 0.630677 -0.000345 -0.924657 0.000144
	-0.225873 -0.329676 0.334859 -0.971429 0.028563 -0.167976
	-0.740141 0.082596 -0.360528 -0.000374 -0.707079 -0.000000
	-0.518711 -0.330299 -0.070115 -0.961610 0.165826 -0.217248
	-0.603969 -0.554428 0.392943 -0.753819 0.220516 -0.310409
}

frame 25 {
	-0.018897 0.000000 0.100036 0.707107 0.000000 -0.000000
	0.154203 -0.360185 -0.376904 -0.649233 0.271242 -0.267505
	0.000000 0.520055 0.000000 -0.178497 0.000622 0.003720
	-0.136732 0.038257 0.004402 -0.147673 -0.125438 -0.674731
	0.000000 0.447469 0.000000 0.288153 0.339784 -0.838878
	0.151140 0.042027 0.014281 -0.136578 0.118766 0.681613
	-0.000000 0.437615 0.000000 0.289056 -0.349836 0.831773
	0.162623 0.221463 -0.011451 -0.117943 0.043029 0.407656
	0.000000 0.501200 0.000000 0.519802 0.014925 -0.052609
	-0.162016 0.218096 -0.011498 -0.116163 -0.038814 -0.404078
	-0.000000 0.492872 -0.000000 0.515808 -0.011248 0.048502
	0.142976 0.370391 -0.009384 0.001961 0.000504 0.111917
	0.000000 0.422763 -0.000000 0.443150 -0.046958 0.097978
	-0.137594 0.373323 -0.014729 -0.119554 -0.059303 -0.184976
	0.000000 0.421663 0.000000 0.652104 0.020216 -0.178817
	0.035670 -0.040818 0.060014 0.018183 -0.047886 0.998486
	-0.000000 0.026025 0.000000 0.002853 -0.033945 0.001202
	-0.027674 -0.041720 0.059816 0.052106 0.046786 -0.997231
	-0.000000 0.025637 0.000000 0.001972 0.121503 -0.002943
	-0.050906 -0.034136 0.024111 0.058392 0.145779 -0.987384
	0.000000 0.049218 -0.000000 0.001273 0.130147 -0.004151
	0.059788 -0.034178 0.023788 0.058967 -0.144899 0.987571
	0.000000 0.049218 -0.000000 0.001262 -0.129525 0.004153
	0.032298 -0.054366 -0.002832 0.005724 -0.051280 -0.998667
	0.000000 0.018247 -0.000000 0.000223 0.105798 0.003347
	-0.026453 -0.054341 -0.002832 0.011410 0.051462 0.998493
	-0.000000 0.018247 0.000000 0.000219 -0.104659 -0.003397
	-0.053205 -0.156103 -0.013104 -0.083867 0.236072 0.951085
	0.060800 -0.156152 -0.013104 -0.083973 -0.236037 -0.951008
	0.038704 -0.122207 0.051886 -0.000097 -0.468376 0.883529
	-0.031079 -0.122177 0.051886 -0.000097 -0.468376 0.883529
	0.031859 -0.116268 0.003550 -0.080502 -0.440954 -0.880320
	-0.024230 -0.116245 0.003550 -0.080308 0.440987 0.880387
	-0.015006 0.072944 -0.773434 -0.000345 -0.924657 0.000144
	-0.278787 -0.529487 -0.722035 -0.372342 0.231203 -0.893659
	-1.062100 0.073430 -0.324212 -0.000345 -0.924657 0.000144
	-0.581095 -0.457952 -0.364921 -0.661809 0.182711 -0.706643
	0.559251 0.072944 -0.203927 -0.000345 -0.924657 0.000144
	0.509801 -0.529487 0.060029 -0.893660 -0.096330 0.372342
	0.117813 0.067522 0.845940 -0.000345 -0.924673 0.000144
	0.145257 -0.456157 0.369322 -0.967502 -0.009236 0.035721
	-0.324505 0.073430 0.630677 -0.000345 -0.924657 0.000144
	-0.223230 -0.329859 0.333229 -0.975785 0.023888 -0.140484
	-0.789796 0.015209 -0.120269 -0.000367 -0.832024 0.000073
	-0.527231 -0.330299 -0.049160 -0.968587 0.164866 -0.183655
	-0.603969 -0.554428 0.392943 -0.753819 0.220516 -0.310409
}

frame 26 {
	-0.018897 0.000000 0.100036 0.707107 0.000000 -0.000000
	0.154203 -0.360185 -0.376904 -0.649233 0.271242 -0.267505
	0.000000 0.520055 0.000000 -0.178497 0.000622 0.003720
	-0.136732 0.038257 0.004402 -0.147673 -0.125438 -0.674731
	0.000000 0.447469 0.000000 0.288153 0.339784 -0.838878
	0.151140 0.042027 0.014281 -0.136578 0.118766 0.681613
	-0.000000 0.437615 0.000000 0.289056 -0.349836 0.831773
	0.162623 0.221463 -0.011451 -0.117943 0.043029 0.407656
	0.000000 0.501200 0.000000 0.519802 0.014925 -0.052609
	-0.162016 0.218096 -0.011498 -0.116163 -0.038814 -0.404078
	-0.000000 0.492872 -0.000000 0.515808 -0.011248 0.048502
	0.142976 0.370391 -0.009384 0.001820 0.000123 0.112514
	0.000000 0.422763 0.000000 0.443250 -0.047189 0.097517
	-0.137594 0.373323 -0.014729 -0.001383 0.011180 -0.126385
	0.000000 0.421663 -0.000000 0.450831 0.050421 -0.078782
	0.035670 -0.040818 0.060014 0.018183 -0.047886 0.998486
	-0.000000 0.026025 0.000000 0.002853 -0.033945 0.001202
	-0.027674 -0.041720 0.059816 0.052106 0.046786 -0.997231
	-0.000000 0.025637 0.000000 0.001972 0.121503 -0.002943
	-0.050906 -0.034136 0.024111 0.058392 0.145779 -0.987384
	0.000000 0.049218 -0.000000 0.001273 0.130147 -0.004151
	0.059788 -0.034178 0.023788 0.058967 -0.144899 0.987571
	0.000000 0.049218 -0.000000 0.001262 -0.129525 0.004153
	0.032298 -0.054366 -0.002832 0.005724 -0.051280 -0.998667
	0.000000 0.018247 -0.000000 0.000223 0.105798 0.003347
	-0.026453 -0.054341 -0.002832 0.011410 0.051462 0.998493
	-0.000000 0.018247 0.000000 0.000219 -0.104659 -0.003397
	-0.053205 -0.156103 -0.013104 -0.083867 0.236072 0.951085
	0.060800 -0.156152 -0.013104 -0.083973 -0.236037 -0.951008
	0.038704 -0.122207 0.051886 -0.000097 -0.468376 0.883529
	-0.031079 -0.122177 0.051886 -0.000097 -0.468376 0.883529
	0.031859 -0.116268 0.003550 -0.080502 -0.440954 -0.880320
	-0.024230 -0.116245 0.003550 -0.080308 0.440987 0.880387
	-0.015006 0.072944 -0.773434 -0.000345 -0.924657 0.000144
	-0.278787 -0.529487 -0.722035 -0.372342 0.231203 -0.893659
	-1.062100 0.073430 -0.324212 -0.000345 -0.924657 0.000144
	-0.581095 -0.457952 -0.364921 -0.661809 0.182711 -0.706643
	0.559251 0.072944 -0.203927 -0.000345 -0.924657 0.000144
	0.509801 -0.529487 0.060029 -0.893660 -0.096330 0.372342
	0.117813 0.067522 0.845940 -0.000345 -0.924673 0.000144
	0.145257 -0.456157 0.369322 -0.967502 -0.009236 0.035721
	-0.324505 0.073430 0.630677 -0.000345 -0.924657 0.000144
	-0.221109 -0.330015 0.331871 -0.978836 0.019954 -0.117350
	-0.839450 0.082596 0.119991 -0.000345 -0.924657 0.000144
	-0.534530 -0.330299 -0.031210 -0.973598 0.163892 -0.154911
	-0.603969 -0.554428 0.392943 -0.753819 0.220516 -0.310409
}

frame 27 {
	-0.018897 0.000000 0.100036 0.707107 0.000000 -0.000000
	0.154203 -0.360185 -0.376904 -0.649233 0.271242 -0.267505
	0.000000 0.520055 0.000000 -0.178497 0.000622 0.003720
	-0.136732 0.038257 0.004402 -0.147673 -0.125438 -0.674731
	0.000000 0.447469 0.000000 0.288153 0.339784 -0.838878
	0.151140 0.042027 0.014281 -0.136578 0.118766 0.681613
	-0.000000 0.437615 0.000000 0.289056 -0.349836 0.831773
	0.162623 0.221463 -0.011451 -0.117943 0.043029 0.407656
	0.000000 0.501200 0.000000 0.519802 0.014925 -0.052609
	-0.162016 0.218096 -0.011498 -0.116163 -0.038814 -0.404078
	-0.000000 0.492872 -0.000000 0.515808 -0.011248 0.048502
	0.142976 0.370391 -0.009384 0.001719 -0.000150 0.112940
	-0.000000 0.422763 0.000000 0.443321 -0.047354 0.097188
	-0.137594 0.373323 -0.014729 -0.000292 0.007582 -0.120939
	-0.000000 0.421663 -0.000000 0.449966 0.048239 -0.083113
	0.035670 -0.040818 0.060014 0.018183 -0.047886 0.998486
	-0.000000 0.026025 0.000000 0.002853 -0.033945 0.001202
	-0.027674 -0.041720 0.059816 0.052106 0.046786 -0.997231
	-0.000000 0.025637 0.000000 0.001972 0.121503 -0.002943
	-0.050906 -0.034136 0.024111 0.058392 0.145779 -0.987384
	0.000000 0.049218 -0.000000 0.001273 0.130147 -0.004151
	0.059788 -0.034178 0.023788 0.058967 -0.144899 0.987571
	0.000000 0.049218 -0.000000 0.001262 -0.129525 0.004153
	0.032298 -0.054366 -0.002832 0.005724 -0.051280 -0.998667
	0.000000 0.018247 -0.000000 0.000223 0.105798 0.003347
	-0.026453 -0.054341 -0.002832 0.011410 0.051462 0.998493
	-0.000000 0.018247 0.000000 0.000219 -0.104659 -0.003397
	-0.053205 -0.156103 -0.013104 -0.083867 0.236072 0.951085
	0.060800 -0.156152 -0.013104 -0.083973 -0.236037 -0.951008
	0.038704 -0.122207 0.051886 -0.000097 -0.468376 0.883529
	-0.031079 -0.122177 0.051886 -0.000097 -0.468376 0.883529
	0.031859 -0.116268 0.003550 -0.080502 -0.440954 -0.880320
	-0.024230 -0.116245 0.003550 -0.080308 0.440987 0.880387
	-0.015006 0.072944 -0.773434 -0.000345 -0.924657 0.000144
	-0.278787 -0.529487 -0.722035 -0.372342 0.231203 -0.893659
	-1.062100 0.073430 -0.324212 -0.000345 -0.924657 0.000144
	-0.581095 -0.457952 -0.364921 -0.661809 0.182711 -0.706643
	0.559251 0.072944 -0.203927 -0.000345 -0.924657 0.000144
	0.509801 -0.529487 0.060029 -0.893660 -0.096330 0.372342
	0.117813 0.067522 0.845940 -0.000345 -0.924673 0.000144
	0.145257 -0.456157 0.369322 -0.967502 -0.009236 0.035721
	-0.324505 0.073430 0.630677 -0.000345 -0.924657 0.000144
	-0.219503 -0.330138 0.330808 -0.980851 0.016853 -0.099109
	-0.839450 0.082596 0.119991 -0.000345 -0.924657 0.000144
	-0.540363 -0.330299 -0.016866 -0.976966 0.163017 -0.132015
	-0.603969 -0.554428 0.392943 -0.753819 0.220516 -0.310409
}

frame 28 {
	-0.018897 0.000000 0.100036 0.707107 0.000000 -0.000000
	0.154203 -0.360185 -0.376904 -0.649233 0.271242 -0.267505
	0.000000 0.520055 0.000000 -0.178497 0.000622 0.003720
	-0.136732 0.038257 0.004402 -0.147673 -0.125438 -0.674731
	0.000000 0.447469 0.000000 0.288153 0.339784 -0.838878
	0.151140 0.042027 0.014281 -0.136578 0.118766 0.681613
	-0.000000 0.437615 0.000000 0.289056 -0.349836 0.831773
	0.162623 0.221463 -0.011451 -0.117943 0.043029 0.407656
	0.000000 0.501200 0.000000 0.519802 0.014925 -0.052609
	-0.162016 0.218096 -0.011498 -0.116163 -0.038814 -0.404078
	-0.000000 0.492872 -0.000000 0.515808 -0.011248 0.048502
	0.142976 0.370391 -0.009384 0.001651 -0.000336 0.113231
	-0.000000 0.422763 -0.000000 0.443370 -0.047466 0.096963
	-0.137594 0.373323 -0.014729 0.000487 0.005170 -0.117056
	0.000000 0.421663 0.000000 0.449481 0.046782 -0.086043
	0.035670 -0.040818 0.060014 0.018183 -0.047886 0.998486
	-0.000000 0.026025 0.000000 0.002853 -0.033945 0.001202
	-0.027674 -0.041720 0.059816 0.052106 0.046786 -0.997231
	-0.000000 0.025637 0.000000 0.001972 0.121503 -0.002943
	-0.050906 -0.034136 0.024111 0.058392 0.145779 -0.987384
	0.000000 0.049218 -0.000000 0.001273 0.130147 -0.004151
	0.059788 -0.034178 0.023788 0.058967 -0.144899 0.987571
	0.000000 0.049218 -0.000000 0.001262 -0.129525 0.004153
	0.032298 -0.054366 -0.002832 0.005724 -0.051280 -0.998667
	0.000000 0.018247 -0.000000 0.000223 0.105798 0.003347
	-0.026453 -0.054341 -0.002832 0.011410 0.051462 0.998493
	-0.000000 0.018247 0.000000 0.000219 -0.104659 -0.003397
	-0.053205 -0.156103 -0.013104 -0.083867 0.236072 0.951085
	0.060800 -0.156152 -0.013104 -0.083973 -0.236037 -0.951008
	0.038704 -0.122207 0.051886 -0.000097 -0.468376 0.883529
	-0.031079 -0.122177 0.051886 -0.000097 -0.468376 0.883529
	0.031859 -0.116268 0.003550 -0.080502 -0.440954 -0.880320
	-0.024230 -0.116245 0.003550 -0.080308 0.440987 0.880387
	-0.015006 0.072944 -0.773434 -0.000345 -0.924657 0.000144
	-0.278787 -0.529487 -0.722035 -0.372342 0.231203 -0.893659
	-1.062100 0.073430 -0.324212 -0.000345 -0.924657 0.000144
	-0.581095 -0.457952 -0.364921 -0.661809 0.182711 -0.706643
	0.559251 0.072944 -0.203927 -0.000345 -0.924657 0.000144
	0.509801 -0.529487 0.060029 -0.893660 -0.096330 0.372342
	0.117813 0.067522 0.845940 -0.000345 -0.924673 0.000144
	0.145257 -0.456157 0.369322 -0.967502 -0.009236 0.035721
	-0.324505 0.073430 0.630677 -0.000345 -0.924657 0.000144
	-0.218392 -0.330227 0.330051 -0.982083 0.014632 -0.086043
	-0.839450 0.082596 0.119991 -0.000345 -0.924657 0.000144
	-0.544579 -0.330299 -0.006497 -0.979053 0.162334 -0.115528
	-0.603969 -0.554428 0.392943 -0.753819 0.220516 -0.310409
}

frame 29 {
	-0.018897 0.000000 0.100036 0.707107 0.000000 -0.000000
	0.154203 -0.360185 -0.376904 -0.649233 0.271242 -0.267505
	0.000000 0.520055 0.000000 -0.178497 0.000622 0.003720
	-0.136732 0.038257 0.004402 -0.147673 -0.125438 -0.674731
	0.000000 0.447469 0.000000 0.288153 0.339784 -0.838878
	0.151140 0.042027 0.014281 -0.136578 0.118766 0.681613
	-0.000000 0.437615 0.000000 0.289056 -0.349836 0.831773
	0.162623 0.221463 -0.011451 -0.117943 0.043029 0.407656
	0.000000 0.501200 0.000000 0.519802 0.014925 -0.052609
	-0.162016 0.218096 -0.011498 -0.116163 -0.038814 -0.404078
	-0.000000 0.492872 -0.000000 0.515808 -0.011248 0.048502
	0.142976 0.370391 -0.009384 0.001612 -0.000442 0.113397
	-0.000000 0.422763 -0.000000 0.443397 -0.047530 0.096835
	-0.137594 0.373323 -0.014729 0.000942 0.003785 -0.114907
	-0.000000 0.421663 0.000000 0.449156 0.045950 -0.087714
	0.035670 -0.040818 0.060014 0.018183 -0.047886 0.998486
	-0.000000 0.026025 0.000000 0.002853 -0.033945 0.001202
	-0.027674 -0.041720 0.059816 0.052106 0.046786 -0.997231
	-0.000000 0.025637 0.000000 0.001972 0.121503 -0.002943
	-0.050906 -0.034136 0.024111 0.058392 0.145779 -0.987384
	0.000000 0.049218 -0.000000 0.001273 0.130147 -0.004151
	0.059788 -0.034178 0.023788 0.058967 -0.144899 0.987571
	0.000000 0.049218 -0.000000 0.001262 -0.129525 0.004153
	0.032298 -0.054366 -0.002832 0.005724 -0.051280 -0.998667
	0.000000 0.018247 -0.000000 0.000223 0.105798 0.003347
	-0.026453 -0.054341 -0.002832 0.011410 0.051462 0.998493
	-0.000000 0.018247 0.000000 0.000219 -0.104659 -0.003397
	-0.053205 -0.156103 -0.013104 -0.083867 0.236072 0.951085
	0.060800 -0.156152 -0.013104 -0.083973 -0.236037 -0.951008
	0.038704 -0.122207 0.051886 -0.000097 -0.468376 0.883529
	-0.031079 -0.122177 0.051886 -0.000097 -0.468376 0.883529
	0.031859 -0.116268 0.003550 -0.080502 -0.440954 -0.880320
	-0.024230 -0.116245 0.003550 -0.080308 0.440987 0.880387
	-0.015006 0.072944 -0.773434 -0.000345 -0.924657 0.000144
	-0.278787 -0.529487 -0.722035 -0.372342 0.231203 -0.893659
	-1.062100 0.073430 -0.324212 -0.000345 -0.924657 0.000144
	-0.581095 -0.457952 -0.364921 -0.661809 0.182711 -0.706643
	0.559251 0.072944 -0.203927 -0.000345 -0.924657 0.000144
	0.509801 -0.529487 0.060029 -0.893660 -0.096330 0.372342
	0.117813 0.067522 0.845940 -0.000345 -0.924673 0.000144
	0.145257 -0.456157 0.369322 -0.967502 -0.009236 0.035721
	-0.324505 0.073430 0.630677 -0.000345 -0.924657 0.000144
	-0.217749 -0.330281 0.329601 -0.982736 0.013306 -0.078243
	-0.839450 0.082596 0.119991 -0.000345 -0.924657 0.000144
	-0.547109 -0.330299 -0.000275 -0.980166 0.161904 -0.105668
	-0.603969 -0.554428 0.392943 -0.753819 0.220516 -0.310409
}

frame 30 {
	-0.018897 0.000000 0.100036 0.707107 0.000000 -0.000000
	0.154203 -0.360185 -0.376904 -0.649233 0.271242 -0.267505
	0.000000 0.520055 0.000000 -0.178497 0.000622 0.003720
	-0.136732 0.038257 0.004402 -0.147673 -0.125438 -0.674731
	0.000000 0.447469 0.000000 0.288153 0.339784 -0.838878
	0.151140 0.042027 0.014281 -0.136578 0.118766 0.681613
	-0.000000 0.437615 0.000000 0.289056 -0.349836 0.831773
	0.162623 0.221463 -0.011451 -0.117943 0.043029 0.407656
	0.000000 0.501200 0.000000 0.519802 0.014925 -0.052609
	-0.162016 0.218096 -0.011498 -0.116163 -0.038814 -0.404078
	-0.000000 0.492872 -0.000000 0.515808 -0.011248 0.048502
	0.142976 0.370391 -0.009384 0.001600 -0.000475 0.113450
	-0.000000 0.422763 0.000000 0.443406 -0.047551 0.096794
	-0.137594 0.373323 -0.014729 0.001093 0.003333 -0.114208
	-0.000000 0.421663 -0.000000 0.449049 0.045680 -0.088258
	0.035670 -0.040818 0.060014 0.018183 -0.047886 0.998486
	-0.000000 0.026025 0.000000 0.002853 -0.033945 0.001202
	-0.027674 -0.041720 0.059816 0.052106 0.046786 -0.997231
	-0.000000 0.025637 0.000000 0.001972 0.121503 -0.002943
	-0.050906 -0.034136 0.024111 0.058392 0.145779 -0.987384
	0.000000 0.049218 -0.000000 0.001273 0.130147 -0.004151
	0.059788 -0.034178 0.023788 0.058967 -0.144899 0.987571
	0.000000 0.049218 -0.000000 0.001262 -0.129525 0.004153
	0.032298 -0.054366 -0.002832 0.005724 -0.051280 -0.998667
	0.000000 0.018247 -0.000000 0.000223 0.105798 0.003347
	-0.026453 -0.054341 -0.002832 0.011410 0.051462 0.998493
	-0.000000 0.018247 0.000000 0.000219 -0.104659 -0.003397
	-0.053205 -0.156103 -0.013104 -0.083867 0.236072 0.951085
	0.060800 -0.156152 -0.013104 -0.083973 -0.236037 -0.951008
	0.038704 -0.122207 0.051886 -0.000097 -0.468376 0.883529
	-0.031079 -0.122177 0.051886 -0.000097 -0.468376 0.883529
	0.031859 -0.116268 0.003550 -0.080502 -0.440954 -0.880320
	-0.024230 -0.116245 0.003550 -0.080308 0.440987 0.880387
	-0.015006 0.072944 -0.773434 -0.000345 -0.924657 0.000144
	-0.278787 -0.529487 -0.722035 -0.372342 0.231203 -0.893659
	-1.062100 0.073430 -0.324212 -0.000345 -0.924657 0.000144
	-0.581095 -0.457952 -0.364921 -0.661809 0.182711 -0.706643
	0.559251 0.072944 -0.203927 -0.000345 -0.924657 0.000144
	0.509801 -0.529487 0.060029 -0.893660 -0.096330 0.372342
	0.117813 0.067522 0.845940 -0.000345 -0.924673 0.000144
	0.145257 -0.456157 0.369322 -0.967502 -0.009236 0.035721
	-0.324505 0.073430 0.630677 -0.000345 -0.924657 0.000144
	-0.217542 -0.330299 0.329453 -0.982937 0.012868 -0.075667
	-0.839450 0.082596 0.119991 -0.000345 -0.924657 0.000144
	-0.547946 -0.330299 0.001783 -0.980512 0.161758 -0.102412
	-0.603969 -0.554428 0.392943 -0.753819 0.220516 -0.310409
}

