# 3ds Max Wavefront OBJ Exporter v0.97b - (c)2007 guruware
# File Created: 22.02.2014 19:17:07

#
# object Object002
#

v  -0.250806 88.535324 -1.670646
v  -0.240414 88.490067 -1.629497
v  0.000000 88.455193 -1.615081
v  -0.176937 88.488190 -1.684890
v  -0.205349 88.395950 -1.733572
v  -0.261633 88.383377 -1.699011
v  -0.269779 88.412094 -1.741332
v  -0.205420 88.243019 -1.838145
v  -0.285913 88.562637 -1.473423
v  -0.322336 88.982201 -1.552056
v  0.000000 89.132179 -1.608514
v  0.000000 89.296783 -1.297960
v  -0.271080 89.111870 -1.233608
v  -0.182200 88.708931 -1.028571
v  0.000000 88.621193 -1.025265
v  0.000000 89.008965 -0.894024
v  -0.638306 88.424561 -0.882324
v  -0.325204 88.514755 -0.794572
v  -0.720215 88.410522 -0.790222
v  -0.349203 88.493881 -0.658742
v  -0.653931 88.305054 -0.833008
v  -0.757774 88.207458 -1.196284
v  -0.813232 88.265137 -1.206421
v  -0.752808 88.279541 -1.223633
v  -0.782104 87.867653 -1.433868
v  -0.834473 87.912842 -1.457275
v  -0.772217 87.917557 -1.478516
v  -0.857407 87.647980 -1.924774
v  -0.554232 88.432495 -0.405551
v  -0.425330 88.462517 -0.444580
v  -0.494318 88.451805 -0.288075
v  -0.385939 88.466911 -0.320840
v  -0.499416 88.327698 -0.365198
v  -0.757188 88.484314 -0.255122
v  -0.793643 88.613579 -0.202384
v  -0.819041 88.595657 -0.263116
v  -0.894806 88.147339 -0.200439
v  -0.936768 88.199463 -0.159668
v  -0.955566 88.191467 -0.213257
v  -1.305542 87.669785 -0.109749
v  -0.366100 88.472069 -0.221926
v  -0.516369 88.401405 -0.019135
v  -0.385173 88.421127 0.059795
v  -0.269657 88.470200 -0.078749
v  -0.422737 88.294754 -0.009597
v  -0.594518 88.439148 0.251261
v  -0.597360 88.588989 0.308674
v  -0.645384 88.575500 0.273927
v  -0.673096 88.131927 0.358948
v  -0.670898 88.162842 0.422852
v  -0.724854 88.174332 0.398438
v  -0.963911 87.647408 0.674225
v  -0.389461 89.054741 -0.443719
v  -0.367322 88.627831 0.089583
v  -0.525044 88.403503 0.678467
v  -0.391605 89.077026 -0.444198
v  -0.195814 89.135056 -0.231069
v  -0.386334 89.045006 1.350437
v  -0.547826 88.998375 1.747410
v  -1.060547 88.843262 1.986938
v  -0.190016 89.115921 -0.231207
v  -0.380786 89.025795 1.350182
v  -1.880463 88.602539 1.392822
v  -1.894958 88.596191 1.744263
v  -0.542262 88.979164 1.747463
v  -1.592682 88.688232 1.979004
v  0.000000 89.048584 0.194336
v  -0.417480 88.860779 0.828613
v  -0.273057 88.545898 1.257225
v  -0.158130 88.139900 1.361683
v  0.176937 88.488190 -1.684890
v  0.250806 88.535324 -1.670646
v  0.322336 88.982201 -1.552056
v  0.000000 88.677612 -1.717445
v  0.240414 88.490067 -1.629497
v  0.285913 88.562637 -1.473423
v  0.261633 88.383377 -1.699011
v  0.269779 88.412094 -1.741332
v  0.205349 88.395950 -1.733572
v  0.205420 88.243019 -1.838145
v  0.271080 89.111870 -1.233608
v  0.182200 88.708931 -1.028571
v  0.720215 88.410522 -0.790222
v  0.349203 88.493881 -0.658742
v  0.325204 88.514755 -0.794572
v  0.638306 88.424561 -0.882324
v  0.000000 88.377518 -0.704884
v  0.653931 88.305054 -0.833008
v  0.757774 88.207458 -1.196284
v  0.813232 88.265137 -1.206421
v  0.752808 88.279541 -1.223633
v  0.782104 87.867653 -1.433868
v  0.834473 87.912842 -1.457275
v  0.772217 87.917557 -1.478516
v  0.857407 87.647980 -1.924774
v  0.494318 88.451805 -0.288075
v  0.385939 88.466911 -0.320840
v  0.425330 88.462517 -0.444580
v  0.554232 88.432495 -0.405551
v  0.000000 88.321587 -0.502472
v  0.499416 88.327698 -0.365198
v  0.757188 88.484314 -0.255122
v  0.793643 88.613579 -0.202384
v  0.819041 88.595657 -0.263116
v  0.894806 88.147339 -0.200439
v  0.936768 88.199463 -0.159668
v  0.955566 88.191467 -0.213257
v  1.305542 87.669785 -0.109749
v  0.366100 88.472069 -0.221926
v  0.422737 88.294754 -0.009597
v  0.516369 88.401405 -0.019135
v  0.385173 88.421127 0.059795
v  0.269657 88.470200 -0.078749
v  0.594518 88.439148 0.251261
v  0.597360 88.588989 0.308674
v  0.645384 88.575500 0.273927
v  0.670898 88.162842 0.422852
v  0.724854 88.174332 0.398438
v  0.673096 88.131927 0.358948
v  0.963911 87.647408 0.674225
v  0.367322 88.627831 0.089583
v  0.000000 88.430542 0.008300
v  0.525044 88.403503 0.678467
v  0.195814 89.135056 -0.231069
v  0.391605 89.077026 -0.444198
v  1.880463 88.602539 1.392822
v  0.386334 89.045006 1.350437
v  0.547826 88.998375 1.747410
v  1.894958 88.596191 1.744263
v  1.060547 88.843262 1.986938
v  1.592682 88.688232 1.979004
v  0.389461 89.054741 -0.443719
v  0.190016 89.115921 -0.231207
v  0.380786 89.025795 1.350182
v  0.542262 88.979164 1.747463
v  0.417480 88.860779 0.828613
v  0.158130 88.139900 1.361683
v  0.273057 88.545898 1.257225
v  -1.894958 88.596191 1.744263
v  -1.060547 88.843262 1.986938
v  -1.060547 88.843262 1.986938
v  -1.894958 88.596191 1.744263
v  1.894958 88.596191 1.744263
v  1.060547 88.843262 1.986938
v  1.060547 88.843262 1.986938
v  1.894958 88.596191 1.744263
# 146 vertices

vt 0.450768 0.341753 88.488190
vt 0.443580 0.330278 88.535324
vt 0.440586 0.292193 88.982201
vt 0.489285 0.335466 88.677612
vt 0.438922 0.334332 88.490067
vt 0.422875 0.332903 88.562637
vt 0.454331 0.375882 88.455193
vt 0.488581 0.818124 88.383377
vt 0.498634 0.811197 88.395950
vt 0.479960 0.820562 88.412094
vt 0.474328 0.782230 88.243019
vt 0.475196 0.255566 89.132179
vt 0.422529 0.219121 89.296783
vt 0.404806 0.271605 89.111870
vt 0.335697 0.254279 89.008965
vt 0.355607 0.325814 88.708931
vt 0.353608 0.359433 88.621193
vt 0.335095 0.450705 88.410522
vt 0.413071 0.450703 88.493881
vt 0.300582 0.315761 88.514755
vt 0.344363 0.472890 88.424561
vt 0.288486 0.375162 88.377518
vt 0.030246 0.545524 88.305054
vt 0.072034 0.493675 88.265137
vt 0.084140 0.491563 88.207458
vt 0.062290 0.493424 88.279541
vt 0.080314 0.420676 87.912842
vt 0.093095 0.419941 87.867653
vt 0.067994 0.417790 87.917557
vt 0.085281 0.325916 87.647980
vt 0.828129 0.854662 88.451805
vt 0.823177 0.833295 88.466911
vt 0.930580 0.854662 88.462517
vt 0.853707 0.853902 88.432495
vt 0.927072 0.767891 88.321587
vt 0.876093 0.845613 88.327698
vt 0.395036 0.774208 88.613579
vt 0.408020 0.774965 88.484314
vt 0.389102 0.774033 88.595657
vt 0.398111 0.725401 88.199463
vt 0.408958 0.722149 88.147339
vt 0.387541 0.723484 88.191467
vt 0.393838 0.638910 87.669785
vt 0.316100 0.506379 88.472069
vt 0.267266 0.622471 88.294754
vt 0.293373 0.628099 88.401405
vt 0.058784 0.932624 88.421127
vt 0.832880 0.923329 88.470200
vt 0.735309 0.909911 88.588989
vt 0.753458 0.886293 88.439148
vt 0.054447 0.855507 88.575500
vt 0.056933 0.763773 88.162842
vt 0.070287 0.759195 88.131927
vt 0.044274 0.766764 88.174332
vt 0.023510 0.665552 87.647408
vt 0.568694 0.864367 89.054741
vt 0.686504 0.907246 88.627831
vt 0.146247 0.144855 88.430542
vt 0.291754 0.241821 88.403503
vt 0.960608 0.635099 89.135056
vt 0.975932 0.544039 89.077026
vt 0.501343 0.588528 88.602539
vt 0.706504 0.807225 89.045006
vt 0.627938 0.833763 88.998375
vt 0.448791 0.631165 88.596191
vt 0.525057 0.787324 88.843262
vt 0.455391 0.706598 88.688232
vt 0.946409 0.425528 89.115921
vt 0.749459 0.320106 89.025795
vt 0.643079 0.296718 88.979164
vt 0.686310 0.147825 89.048584
vt 0.564342 0.190696 88.860779
vt 0.569574 0.094774 88.860779
vt 0.502343 0.175365 88.545898
vt 0.450768 0.341753 88.488190
vt 0.440586 0.292193 66.736649
vt 0.443580 0.330278 88.535324
vt 0.438922 0.334332 88.490067
vt 0.422875 0.332903 88.562637
vt 0.941194 0.831896 88.395950
vt 0.953402 0.831751 88.383377
vt 0.961850 0.828768 88.412094
vt 0.944325 0.794206 88.243019
vt 0.404806 0.271605 89.111870
vt 0.355607 0.325814 88.708931
vt 0.163019 0.351411 88.410522
vt 0.145826 0.351468 88.424561
vt 0.140334 0.294338 88.514755
vt 0.168484 0.291644 88.493881
vt 0.124974 0.356648 88.305054
vt 0.168830 0.417051 88.207458
vt 0.157070 0.412959 88.265137
vt 0.146063 0.411356 88.279541
vt 0.165790 0.491437 87.867653
vt 0.152930 0.488505 87.912842
vt 0.139920 0.489329 87.917557
vt 0.141593 0.585520 87.647980
vt 0.398840 0.386250 88.451805
vt 0.398840 0.411620 88.432495
vt 0.332073 0.887169 88.462517
vt 0.314412 0.892610 88.466911
vt 0.355029 0.870788 88.327698
vt 0.300480 0.824436 88.484314
vt 0.315009 0.824152 88.613579
vt 0.321632 0.824204 88.595657
vt 0.301873 0.765475 88.147339
vt 0.313800 0.769613 88.199463
vt 0.325664 0.767980 88.191467
vt 0.322798 0.673601 87.669785
vt 0.332086 0.417955 88.472069
vt 0.193627 0.756674 88.294754
vt 0.166935 0.757693 88.401405
vt 0.106966 0.928798 88.421127
vt 0.880432 0.941947 88.470200
vt 0.796706 0.967816 88.439148
vt 0.781943 0.941947 88.588989
vt 0.102611 0.851365 88.575500
vt 0.118409 0.754950 88.131927
vt 0.105058 0.759540 88.162842
vt 0.092400 0.762543 88.174332
vt 0.071549 0.661443 87.647408
vt 0.568694 0.864367 89.054741
vt 0.162115 0.058471 88.627831
vt 0.291754 0.038300 88.403503
vt 0.802463 0.107808 89.135056
vt 0.706504 0.807225 89.045006
vt 0.501343 0.588528 88.602539
vt 0.975932 0.544039 89.077026
vt 0.627938 0.833763 88.998375
vt 0.448791 0.631165 88.596191
vt 0.525057 0.787324 88.843262
vt 0.455391 0.706598 88.688232
vt 0.749459 0.320106 89.025795
vt 0.946409 0.425528 89.115921
vt 0.643079 0.296718 88.979164
vt 0.435211 0.171711 88.139900
vt 0.430092 0.110985 88.139900
vt 0.505266 0.110169 88.545898
vt 0.466876 0.840968 88.488190
vt 0.510946 0.830389 88.488190
vt 0.483581 0.846865 88.535324
vt 0.489285 0.335466 44.338806
vt 0.495608 0.841221 88.490067
vt 0.454331 0.375882 88.455193
vt 0.467475 0.819402 88.395950
vt 0.475196 0.255566 44.566090
vt 0.422529 0.219121 89.296783
vt 0.335697 0.254279 89.008965
vt 0.460705 0.882665 89.008965
vt 0.943798 0.150381 89.008965
vt 0.460705 0.882665 89.008965
vt 0.471206 0.950816 88.708931
vt 0.353608 0.359433 88.621193
vt 0.067495 0.563220 88.410522
vt 0.107052 0.620216 88.493881
vt 0.553090 0.973685 88.493881
vt 0.889299 0.839148 88.493881
vt 0.527583 0.975727 88.514755
vt 0.409596 0.477515 88.514755
vt 0.049962 0.604223 88.514755
vt 0.050114 0.550891 88.424561
vt 0.288486 0.375162 88.377518
vt 0.168755 0.637057 88.377518
vt 0.886707 0.767891 88.377518
vt 0.015669 0.650451 88.377518
vt 0.404550 0.610841 88.377518
vt 0.100971 0.249514 88.377518
vt 0.212929 0.249514 88.377518
vt 0.088288 0.554098 88.305054
vt 0.051677 0.487695 88.207458
vt 0.055708 0.415662 87.867653
vt 0.398595 0.813698 88.451805
vt 0.393342 0.835390 88.466911
vt 0.617797 0.962975 88.466911
vt 0.324140 0.489682 88.466911
vt 0.595012 0.969967 88.462517
vt 0.847582 0.828125 88.462517
vt 0.375116 0.809914 88.432495
vt 0.444645 0.609383 88.321587
vt 0.413830 0.921016 88.321587
vt 0.405106 0.506379 88.321587
vt 0.876093 0.746666 88.321587
vt 0.201437 0.725211 88.321587
vt 0.930089 0.923329 88.321587
vt 0.040390 0.152777 88.321587
vt 0.359899 0.953970 88.321587
vt 0.288023 0.987488 88.321587
vt 0.243079 0.417955 88.321587
vt 0.240668 0.869287 88.321587
vt 0.976735 0.955190 88.321587
vt 0.357817 0.814660 88.327698
vt 0.426316 0.820589 88.327698
vt 0.377473 0.772976 88.484314
vt 0.376028 0.721257 88.147339
vt 0.635443 0.957325 88.472069
vt 0.277147 0.674559 88.472069
vt 0.023510 0.980884 88.472069
vt 0.817109 0.881098 88.294754
vt 0.027226 0.926403 88.401405
vt 0.803365 0.905091 88.421127
vt 0.122604 0.220645 88.470200
vt 0.058249 0.971565 88.470200
vt 0.665781 0.948244 88.470200
vt 0.067095 0.856471 88.588989
vt 0.315650 0.579655 88.439148
vt 0.084443 0.827056 88.439148
vt 0.343258 0.581253 88.575500
vt 0.273056 0.533398 88.131927
vt 0.285398 0.525620 88.174332
vt 0.227131 0.431524 87.647408
vt 0.867328 0.236139 89.054741
vt 0.807522 0.247124 89.054741
vt 0.961701 0.484115 89.054741
vt 0.164514 0.230410 88.627831
vt 0.667021 0.265649 88.627831
vt 0.537779 0.265649 88.403503
vt 0.797959 0.188363 89.135056
vt 0.958304 0.397753 89.135056
vt 0.855626 0.226281 89.077026
vt 0.965069 0.574685 89.077026
vt 0.504011 0.558382 88.602539
vt 0.755676 0.301907 89.045006
vt 0.641321 0.281742 88.998375
vt 0.440598 0.503908 88.596191
vt 0.536717 0.329759 88.843262
vt 0.452458 0.418054 88.688232
vt 0.774787 0.198004 89.115921
vt 0.984299 0.837893 88.488190
vt 0.942212 0.854662 88.488190
vt 0.974051 0.852342 88.535324
vt 0.960979 0.854661 88.490067
vt 0.971382 0.820619 88.395950
vt 0.471206 0.950816 88.708931
vt 0.300582 0.315761 88.514755
vt 0.527583 0.975727 88.514755
vt 0.404550 0.539966 88.493881
vt 0.553090 0.973685 88.493881
vt 0.182570 0.355920 88.305054
vt 0.135160 0.415051 88.207458
vt 0.127115 0.489388 87.867653
vt 0.309426 0.868149 88.451805
vt 0.335836 0.864872 88.432495
vt 0.444998 0.523065 88.462517
vt 0.595012 0.969967 88.462517
vt 0.373116 0.406310 88.462517
vt 0.324045 0.401258 88.466911
vt 0.377522 0.381972 88.466911
vt 0.617797 0.962975 88.466911
vt 0.278155 0.874719 88.327698
vt 0.334639 0.823515 88.484314
vt 0.338582 0.766044 88.147339
vt 0.174867 0.806271 88.472069
vt 0.635443 0.957325 88.472069
vt 0.071549 0.977263 88.472069
vt 0.859056 0.981635 88.294754
vt 0.075276 0.922554 88.401405
vt 0.848709 0.955993 88.421127
vt 0.118943 0.080238 88.470200
vt 0.106433 0.967904 88.470200
vt 0.665781 0.948244 88.470200
vt 0.153387 0.706114 88.439148
vt 0.132638 0.822866 88.439148
vt 0.115291 0.852327 88.588989
vt 0.125915 0.702903 88.575500
vt 0.203360 0.667932 88.131927
vt 0.192552 0.658131 88.174332
vt 0.266362 0.575600 87.647408
vt 0.866690 0.064081 89.054741
vt 0.818921 0.059146 89.054741
vt 0.961701 0.484115 89.054741
vt 0.686504 0.907246 88.627831
vt 0.678372 0.026899 88.627831
vt 0.546106 0.016119 88.403503
vt 0.960608 0.635099 89.135056
vt 0.958304 0.397753 89.135056
vt 0.755676 0.301907 89.045006
vt 0.504011 0.558382 88.602539
vt 0.855623 0.074484 89.077026
vt 0.965069 0.574685 89.077026
vt 0.641321 0.281742 88.998375
vt 0.440598 0.503908 88.596191
vt 0.536717 0.329759 88.843262
vt 0.452458 0.418054 88.688232
vt 0.781010 0.105616 89.115921
# 284 texture coords

g Object002
f 4/1 1/2 10/3 74/4 
f 9/6 10/3 1/2 2/5 
f 3/7 4/1 74/4 
f 4/1 3/7 9/6 2/5 
f 6/8 5/9 4/140 2/143 
f 7/10 6/8 2/143 1/141 
f 5/145 7/10 1/141 4/139 
f 5/9 6/8 8/11 
f 6/8 7/10 8/11 
f 7/10 5/145 8/11 
f 74/4 10/3 11/12 
f 11/12 10/3 13/14 12/13 
f 12/13 13/14 16/15 
f 14/16 13/14 10/3 9/6 
f 15/17 14/16 9/6 3/7 
f 16/15 13/14 14/16 
f 20/19 18/159 17/21 19/18 
f 87/165 21/23 18/160 
f 87/163 20/155 19/154 21/169 
f 23/24 22/25 21/169 19/154 
f 24/26 23/24 19/154 17/161 
f 22/170 24/26 17/161 21/23 
f 26/27 25/28 22/25 23/24 
f 27/29 26/27 23/24 24/26 
f 25/171 27/29 24/26 22/170 
f 25/28 26/27 28/30 
f 26/27 27/29 28/30 
f 27/29 25/171 28/30 
f 30/177 29/34 31/31 32/32 
f 33/36 29/34 30/177 100/182 
f 100/180 32/173 31/172 33/192 
f 35/37 34/38 33/192 31/172 
f 36/39 35/37 31/172 29/178 
f 34/193 36/39 29/178 33/191 
f 38/40 37/41 34/38 35/37 
f 39/42 38/40 35/37 36/39 
f 37/194 39/42 36/39 34/193 
f 37/41 38/40 40/43 
f 38/40 39/42 40/43 
f 39/42 37/194 40/43 
f 20/157 87/164 100/35 30/33 
f 41/44 32/175 100/181 
f 42/46 41/196 100/183 45/45 
f 44/202 41/197 42/199 43/47 
f 45/198 100/184 44/48 43/200 
f 47/49 46/50 45/198 43/200 
f 48/51 47/204 43/47 42/199 
f 46/205 48/207 42/46 45/45 
f 50/52 49/53 46/206 47/204 
f 51/54 50/52 47/204 48/51 
f 49/208 51/209 48/207 46/205 
f 49/53 50/52 52/55 
f 50/52 51/54 52/55 
f 51/209 49/208 52/210 
f 87/22 18/20 15/17 
f 18/20 14/16 15/17 
f 14/152 18/158 53/56 16/149 
f 53/56 18/158 20/156 
f 20/156 30/176 53/56 
f 53/56 30/176 32/174 
f 32/174 41/195 53/56 
f 54/57 53/56 41/195 44/203 
f 122/58 44/201 100/185 
f 55/59 54/214 122/58 
f 54/214 44/201 122/58 
f 63/62 58/63 57/60 56/220 
f 63/62 64/65 59/64 58/63 
f 64/65 66/67 60/66 59/64 
f 61/68 62/69 63/221 53/213 
f 65/70 64/224 63/221 62/69 
f 140/225 66/226 139/224 
f 142/224 65/70 141/225 
f 56/61 53/213 63/221 
f 62/69 61/68 57/218 58/222 
f 65/70 62/69 58/222 59/223 
f 59/223 60/225 65/70 
f 67/71 61/227 53/212 
f 53/212 54/215 67/71 
f 67/71 54/215 68/72 
f 67/71 68/72 136/73 
f 55/216 69/74 68/72 
f 54/215 55/216 68/72 
f 71/75 74/142 73/76 72/77 
f 76/79 75/78 72/77 73/76 
f 3/144 74/142 71/75 
f 71/75 75/78 76/79 3/144 
f 77/81 75/231 71/229 79/80 
f 78/82 72/230 75/231 77/81 
f 79/232 71/228 72/230 78/82 
f 79/80 80/83 77/81 
f 77/81 80/83 78/82 
f 78/82 80/83 79/232 
f 74/142 11/146 73/76 
f 11/146 12/147 81/84 73/76 
f 16/148 81/84 12/147 
f 82/85 76/79 73/76 81/84 
f 15/153 3/144 76/79 82/85 
f 16/148 82/85 81/84 
f 84/89 83/86 86/87 85/88 
f 87/167 85/88 88/90 
f 87/168 88/238 83/86 84/89 
f 90/92 83/86 88/238 89/91 
f 91/93 86/87 83/86 90/92 
f 89/239 88/90 86/87 91/93 
f 93/95 90/92 89/91 92/94 
f 94/96 91/93 90/92 93/95 
f 92/240 89/239 91/93 94/96 
f 92/94 95/97 93/95 
f 93/95 95/97 94/96 
f 94/96 95/97 92/240 
f 98/245 97/247 96/98 99/99 
f 101/102 100/186 98/100 99/242 
f 100/187 101/249 96/241 97/101 
f 103/104 96/241 101/249 102/103 
f 104/105 99/242 96/241 103/104 
f 102/250 101/102 99/242 104/105 
f 106/107 103/104 102/103 105/106 
f 107/108 104/105 103/104 106/107 
f 105/251 102/250 104/105 107/108 
f 105/106 108/109 106/107 
f 106/107 108/109 107/108 
f 107/108 108/109 105/251 
f 84/236 98/243 100/179 87/166 
f 109/110 100/188 97/246 
f 111/112 110/111 100/189 109/252 
f 113/259 112/113 111/256 109/254 
f 110/255 112/257 113/114 100/190 
f 115/116 112/257 110/255 114/115 
f 116/117 111/256 112/113 115/263 
f 114/261 110/111 111/112 116/264 
f 117/119 115/263 114/262 119/118 
f 118/120 116/117 115/263 117/119 
f 119/265 114/261 116/264 118/266 
f 119/118 120/121 117/119 
f 117/119 120/121 118/120 
f 118/266 120/267 119/265 
f 87/162 15/153 85/234 
f 85/234 15/153 82/85 
f 82/233 16/151 132/122 85/235 
f 132/122 84/237 85/235 
f 84/237 132/122 98/244 
f 132/122 97/248 98/244 
f 97/248 132/122 109/253 
f 121/271 113/260 109/253 132/122 
f 122/58 100/185 113/258 
f 123/124 122/58 121/123 
f 121/123 122/58 113/258 
f 126/127 125/279 124/274 127/126 
f 126/127 127/126 128/129 129/130 
f 129/130 128/129 130/131 131/132 
f 133/134 132/270 126/277 134/133 
f 135/135 134/133 126/277 129/281 
f 144/282 135/135 143/281 
f 146/281 131/283 145/282 
f 125/128 126/277 132/270 
f 134/133 127/276 124/275 133/134 
f 135/135 128/280 127/276 134/133 
f 128/280 135/135 130/282 
f 16/150 125/278 132/268 
f 67/71 132/269 133/284 
f 132/269 67/71 121/272 
f 55/59 123/124 137/137 70/136 
f 67/71 136/73 121/272 
f 123/273 138/138 137/137 
f 121/272 136/73 123/273 
f 70/136 137/137 138/138 69/74 
f 69/74 138/138 136/73 68/72 
f 55/59 122/58 123/124 
f 55/216 70/136 69/74 
f 123/273 136/73 138/138 
f 61/227 67/71 133/284 57/217 
f 57/217 133/284 124/125 
f 57/217 124/125 125/278 56/219 
f 16/150 56/219 125/278 
f 16/150 53/211 56/219 
f 21/23 17/161 18/160 
f 85/88 86/87 88/90 
# 95 polygons - 82 triangles

