MD5Version 10 // Parameters used during export: Reorient: False; Scale: 1.0
commandline ""

numFrames 11
numJoints 27
frameRate 60
numAnimatedComponents 162

hierarchy {
  "origin" -1 63 0 //
  "chest" 0 63 6 //
  "tail" 1 63 12 //
  "leg0_upper" 1 63 18 //
  "leg0_lower" 3 63 24 //
  "leg5_upper" 1 63 30 //
  "leg5_lower" 5 63 36 //
  "leg4_upper" 1 63 42 //
  "leg4_lower" 7 63 48 //
  "leg1_upper" 1 63 54 //
  "leg1_lower" 9 63 60 //
  "leg3_upper" 1 63 66 //
  "leg3_lower" 11 63 72 //
  "leg2_upper" 1 63 78 //
  "leg2_lower" 13 63 84 //
  "antenna_upper_left0" 1 63 90 //
  "antenna_upper_left1" 15 63 96 //
  "antenna_upper_right0" 1 63 102 //
  "antenna_upper_right1" 17 63 108 //
  "antenna_right0" 1 63 114 //
  "antenna_right1" 19 63 120 //
  "antenna_left0" 1 63 126 //
  "antenna_left1" 21 63 132 //
  "antenna_lower_left0" 1 63 138 //
  "antenna_lower_left1" 23 63 144 //
  "antenna_lower_right0" 1 63 150 //
  "antenna_lower_right1" 25 63 156 //
}

bounds {
  ( -0.8838571906 -0.8362707496 -0.0060403305 ) ( 0.5015997291 0.8401566744 0.7355550528 )
  ( -0.8790281415 -0.8381306529 0.0048291055 ) ( 0.5170888305 0.8447917700 0.7152482271 )
  ( -0.8636734486 -0.8462391496 0.0307180323 ) ( 0.5336780548 0.8625128269 0.7131451368 )
  ( -0.8742799759 -0.8607472777 0.0734159425 ) ( 0.5444341302 0.8933845162 0.7323527932 )
  ( -0.8952237964 -0.8798509836 0.1098051444 ) ( 0.5485678911 0.9345108867 0.7514681220 )
  ( -0.9250526428 -0.9018502831 0.1164344475 ) ( 0.5450841188 0.9814023376 0.7655858397 )
  ( -0.9587088227 -0.9238862395 0.1290346384 ) ( 0.5340995193 1.0284980536 0.7745811939 )
  ( -0.9877679348 -1.0021435022 0.1195517257 ) ( 0.5204296708 1.0702500343 0.7754257917 )
  ( -1.0057249069 -1.0827306509 0.1073203161 ) ( 0.5070574880 1.1023504734 0.7695600986 )
  ( -1.0131306648 -1.1321560144 0.0983729735 ) ( 0.4973894954 1.1222230196 0.7653092742 )
  ( -1.0147632360 -1.1485705376 0.0936487392 ) ( 0.4946386814 1.1288598776 0.7635726929 )
}

baseframe {
  ( 0.0000000000 0.0000000000 0.1000000015 ) ( 0.7071068287 -0.0000000000 -0.0000000000 )
  ( 0.2934706807 -0.3602214158 -0.0048920386 ) ( -0.4964132011 0.5035642385 -0.4966249764 )
  ( 0.0000080311 0.5389489532 0.0002984107 ) ( -0.1784965545 0.0006216453 0.0037200444 )
  ( -0.1367243677 0.0571507215 0.0047000772 ) ( -0.1446045935 -0.1217156276 -0.6598580480 )
  ( 0.0188033730 0.4492226839 -0.0006588334 ) ( 0.2914981842 0.3391291201 -0.8406866193 )
  ( 0.1511484981 0.0609211028 0.0145796919 ) ( -0.1361550987 0.1165692955 0.6686438918 )
  ( -0.0188374277 0.4390271902 -0.0004912592 ) ( 0.2926936448 -0.3480054438 0.8343683481 )
  ( 0.1626309156 0.2403567135 -0.0111524481 ) ( -0.1080924198 0.0413611457 0.3954822123 )
  ( -0.0137833599 0.5138163567 -0.0028145127 ) ( 0.5014041662 0.0156385396 -0.0498958528 )
  ( -0.1620082557 0.2369901687 -0.0111991586 ) ( -0.1099235415 -0.0419307724 -0.3936591744 )
  ( 0.0137448302 0.5055176020 -0.0028717890 ) ( 0.5045711994 -0.0136532076 0.0436128974 )
  ( 0.1429835856 0.3892854154 -0.0090858266 ) ( 0.0111710364 -0.0027141315 0.1080545485 )
  ( -0.0040532337 0.4412065148 0.0007069071 ) ( 0.4295544028 -0.0485373773 0.0925593302 )
  ( -0.1375856400 0.3922168314 -0.0144305658 ) ( 0.0112098185 0.0028863086 -0.1146928743 )
  ( 0.0043151118 0.4400462806 0.0007065351 ) ( 0.4298218489 0.0452572927 -0.0862943754 )
  ( 0.0356778391 -0.0219234787 0.0603129305 ) ( 0.0103111053 -0.1781353056 0.9820153713 )
  ( -0.0023677417 0.0083696377 -0.0063066618 ) ( 0.3025591075 -0.0381402522 0.0498569980 )
  ( -0.0276663788 -0.0228254311 0.0601140521 ) ( 0.0233672094 0.1717036813 -0.9742456675 )
  ( 0.0054568490 0.0085394774 -0.0059142075 ) ( 0.2978127897 0.1312129349 -0.1743576527 )
  ( -0.0508979969 -0.0152415158 0.0244091116 ) ( 0.0117792804 0.0538802668 -0.9588342309 )
  ( 0.0101123052 0.0333281234 -0.0015321304 ) ( 0.1461273730 0.1195054427 -0.4428290129 )
  ( 0.0597957559 -0.0152841890 0.0240866188 ) ( 0.0117620174 -0.0538869537 0.9589529634 )
  ( -0.0101124281 0.0333282128 -0.0015321332 ) ( 0.1461275220 -0.1195051521 0.4428286254 )
  ( 0.0323061757 -0.0354717970 -0.0025340349 ) ( -0.0037301253 -0.2637203634 -0.9645053148 )
  ( 0.0005006421 0.0021384403 0.0098670051 ) ( -0.1936063468 0.1096101850 0.1188093349 )
  ( -0.0264448021 -0.0354467630 -0.0025336863 ) ( -0.0036117367 0.2637220025 0.9645107388 )
  ( -0.0005007304 0.0021384496 0.0098670144 ) ( -0.1936063617 -0.1096105203 -0.1188094392 )
}

frame 0 {
  0.0000000000 0.0000000000 0.1000000015 0.7071068287 -0.0000000000 -0.0000000000
  0.2934706807 -0.3602214158 -0.0048920386 -0.4964132011 0.5035642385 -0.4966249764
  0.0000080306 0.5389489532 0.0002984107 -0.1784965396 0.0006216418 0.0037200642
  -0.1367243379 0.0571507849 0.0047000181 -0.1536253840 -0.1339017451 -0.6706203222
  0.0188574474 0.4485884011 -0.0004705940 0.2888039052 0.3329931796 -0.8429363966
  0.1511485279 0.0609211661 0.0145796333 -0.1419776082 0.1267754436 0.6779645681
  -0.0188738648 0.4384978712 -0.0002876827 0.2899525166 -0.3419176638 0.8366848230
  0.1626309454 0.2403567433 -0.0111524481 -0.1140462756 0.0412341282 0.4074379802
  -0.0141138379 0.5134067535 -0.0029777139 0.5176978707 0.0148990443 -0.0524834432
  -0.1620082259 0.2369901687 -0.0111990990 -0.1161567345 -0.0387639739 -0.4040533006
  0.0140234549 0.5051535368 -0.0030963980 0.5158702135 -0.0112202642 0.0485521220
  0.1429836303 0.3892854154 -0.0090858266 0.0015146526 -0.0004759943 0.1134820357
  -0.0042530205 0.4411717653 0.0003532195 0.4435115159 -0.0475538671 0.0968037546
  -0.1375855953 0.3922168612 -0.0144305658 -0.0074881758 0.0006939496 -0.1158684120
  0.0043573920 0.4400499165 0.0000142902 0.4546217620 0.0446319766 -0.0912352204
  0.0356778316 -0.0219234768 0.0603128709 0.0181757677 -0.0478775315 0.9984862804
  -0.0007877732 0.0072039417 -0.0014961100 0.0028526497 -0.0339449011 0.0012019773
  -0.0276663750 -0.0228254311 0.0601140521 0.0521066077 0.0467753522 -0.9972309470
  0.0009975918 0.0068202438 -0.0014189277 0.0019716599 0.1215026528 -0.0029434087
  -0.0508979931 -0.0152415158 0.0244091116 0.0583884418 0.1457761526 -0.9873850346
  0.0010373909 0.0310551692 -0.0051118387 0.0012725762 0.1301466227 -0.0041509452
  0.0597957484 -0.0152841890 0.0240866188 0.0589689203 -0.1449001729 0.9875705838
  -0.0008646809 0.0310397036 -0.0050888136 0.0012615544 -0.1295253187 0.0041525620
  0.0323061720 -0.0354717970 -0.0025340349 0.0058949939 -0.0512847118 -0.9986659884
  0.0000236723 -0.0005176496 0.0022327851 0.0002233128 0.1057976037 0.0033464460
  -0.0264448021 -0.0354467630 -0.0025336863 0.0114129148 0.0514624193 0.9984931946
  -0.0005543958 -0.0005079508 0.0022452581 0.0002190998 -0.1046594456 -0.0033967565
}

frame 1 {
  0.0000000000 0.0000000000 0.1000000015 0.7071068287 -0.0000000000 -0.0000000000
  0.2544454932 -0.3057350814 -0.0048921192 -0.4866589904 0.5129970908 -0.4868748486
  0.0000080199 0.5389235020 0.0010231971 -0.2614205480 0.0008795708 0.0039613149
  -0.1367243826 0.0571253933 0.0054248096 -0.2071959972 -0.1983932108 -0.6868574023
  0.0188803710 0.4474693835 0.0007801866 0.2838035524 0.3060868382 -0.8551385403
  0.1511484832 0.0608957335 0.0153045179 -0.1916574240 0.1903321743 0.6982238293
  -0.0188613478 0.4372391701 0.0010897266 0.2834479809 -0.3148264587 0.8487722278
  0.1626309007 0.2403313369 -0.0104276491 -0.2025584280 0.0726330280 0.4277561009
  -0.0147687495 0.5120484829 -0.0046123005 0.5884581804 0.0115351882 -0.0637935624
  -0.1620082259 0.2369647920 -0.0104743568 -0.2022319138 -0.0678247958 -0.4225130677
  0.0146208517 0.5038781166 -0.0047089942 0.5842674375 -0.0070407847 0.0601644441
  0.1429835856 0.3892600238 -0.0083609587 -0.1336195618 0.0117427809 0.1203223094
  -0.0045270664 0.4406857789 -0.0039207404 0.5696334839 -0.0457730293 0.1185572967
  -0.1375856251 0.3921914101 -0.0137057770 -0.1464191377 -0.0135354996 -0.1226393878
  0.0046346197 0.4394503832 -0.0043812031 0.5924367905 0.0422947742 -0.1138622165
  0.0356778242 -0.0219488181 0.0610377602 0.0181753710 -0.0478777438 0.9984863400
  -0.0007617733 0.0071593318 -0.0007727973 0.0028526841 -0.0339449123 0.0012019875
  -0.0276663862 -0.0228507742 0.0608388744 0.0521047860 0.0467756949 -0.9972311258
  0.0009225812 0.0067759086 -0.0006989243 0.0019716348 0.1215026528 -0.0029434164
  -0.0508979931 -0.0152668431 0.0251339115 0.0583883822 0.1457753479 -0.9873850942
  0.0009566536 0.0308690332 -0.0044155670 0.0012725994 0.1301466078 -0.0041509341
  0.0597957447 -0.0153095219 0.0248114038 0.0589698702 -0.1448998451 0.9875705838
  -0.0007822476 0.0308552422 -0.0043923031 0.0012615463 -0.1295253485 0.0041525722
  0.0323061608 -0.0354971364 -0.0018091858 0.0058572758 -0.0512854904 -0.9986661673
  0.0000150997 -0.0004181433 0.0029511340 0.0002232416 0.1057976112 0.0033464723
  -0.0264448076 -0.0354720987 -0.0018088676 0.0114069190 0.0514622331 0.9984933138
  -0.0005359855 -0.0004085226 0.0029634235 0.0002191135 -0.1046594232 -0.0033967451
}

frame 2 {
  0.0000000000 0.0000000000 0.1000000015 0.7071068287 -0.0000000000 -0.0000000000
  0.2091506571 -0.2512270212 -0.0048920554 -0.4707083702 0.5276709795 -0.4709305167
  0.0000079792 0.5388253927 0.0021772389 -0.3563777804 0.0011548917 0.0043151099
  -0.1367244124 0.0570272096 0.0065789167 -0.2699033022 -0.2776504457 -0.6899545193
  0.0187248439 0.4471812546 0.0025249049 0.2785991728 0.3004972339 -0.8553760052
  0.1511484087 0.0607975908 0.0164585505 -0.2513310313 0.2678557336 0.7056736946
  -0.0186454691 0.4368120134 0.0029635653 0.2772611082 -0.3075320125 0.8495525718
  0.1626308560 0.2402332127 -0.0092735961 -0.3040266037 0.1086360812 0.4506433904
  -0.0155186541 0.5101971626 -0.0059416667 0.6407783031 0.0068771741 -0.0765275583
  -0.1620082706 0.2368666232 -0.0093203392 -0.3011649251 -0.1009188965 -0.4438213110
  0.0153208552 0.5021314025 -0.0060507953 0.6409661174 -0.0013976515 0.0746459290
  0.1429834962 0.3891619146 -0.0072069974 -0.2983246744 0.0291658882 0.1457497329
  -0.0055474085 0.4386407733 -0.0086147115 0.6736146212 -0.0447508059 0.1307541877
  -0.1375856549 0.3920932710 -0.0125517342 -0.3044628799 -0.0306791160 -0.1450016797
  0.0055467738 0.4374288321 -0.0088170096 0.6927626729 0.0417071395 -0.1233750060
  0.0356777906 -0.0220469441 0.0621918030 0.0181769747 -0.0478772521 0.9984862804
  -0.0007179533 0.0071457285 0.0003845897 0.0028526774 -0.0339449123 0.0012019826
  -0.0276664346 -0.0229489096 0.0619929433 0.0521068349 0.0467752852 -0.9972310662
  0.0008000005 0.0067628743 0.0004528088 0.0019716574 0.1215026677 -0.0029433758
  -0.0508980379 -0.0153649831 0.0262879655 0.0583895184 0.1457753330 -0.9873850346
  0.0008248619 0.0306279659 -0.0032903207 0.0012725772 0.1301465929 -0.0041509327
  0.0597957075 -0.0154076545 0.0259654857 0.0589699149 -0.1448993385 0.9875706434
  -0.0006482449 0.0306168906 -0.0032667737 0.0012615725 -0.1295253485 0.0041525331
  0.0323061161 -0.0355953202 -0.0006552021 0.0059163165 -0.0512856841 -0.9986657500
  0.0000013617 -0.0002023055 0.0040890439 0.0002232532 0.1057976112 0.0033464539
  -0.0264448505 -0.0355702862 -0.0006548552 0.0114069292 0.0514624268 0.9984932542
  -0.0005049603 -0.0001927281 0.0041009956 0.0002190611 -0.1046594456 -0.0033967611
}

frame 3 {
  0.0000000000 0.0000000000 0.1000000015 0.7071068287 -0.0000000000 -0.0000000000
  0.1990368664 -0.2552518249 -0.0048918691 -0.4599811733 0.5370476842 -0.4602074623
  0.0000079387 0.5387225151 0.0029317664 -0.3706537187 0.0011661424 0.0045312233
  -0.1367244720 0.0569242723 0.0073334016 -0.2930856347 -0.3024719656 -0.6811207533
  0.0186472796 0.4478408396 0.0030360557 0.2759257257 0.3354425132 -0.8348535299
  0.1511483938 0.0606947020 0.0172130298 -0.2742275298 0.2932853699 0.6979382634
  -0.0185591057 0.4374477863 0.0035515241 0.2749798596 -0.3372101486 0.8315380216
  0.1626308113 0.2401303053 -0.0085191587 -0.3448252380 0.1266492158 0.4582370520
  -0.0157987140 0.5095703006 -0.0061168820 0.6382214427 0.0058511351 -0.0785181373
  -0.1620083153 0.2367637604 -0.0085657798 -0.3392824531 -0.1157033220 -0.4494732618
  0.0155398184 0.5016267300 -0.0062406436 0.6476579309 0.0009062727 0.0797742307
  0.1429835111 0.3890589476 -0.0064525162 -0.3779809475 0.0432460830 0.1744730771
  -0.0066752867 0.4370196760 -0.0104534961 0.6971758008 -0.0461910516 0.1273951679
  -0.1375856996 0.3919903338 -0.0117972801 -0.3735674024 -0.0411078110 -0.1669798642
  0.0064095152 0.4361138344 -0.0103518888 0.7125608921 0.0440115444 -0.1174941361
  0.0356777497 -0.0221498851 0.0629462153 0.0181763154 -0.0478772745 0.9984863400
  -0.0006876667 0.0071754362 0.0011449090 0.0028526911 -0.0339449160 0.0012019826
  -0.0276664682 -0.0230518319 0.0627474338 0.0521056280 0.0467749611 -0.9972310662
  0.0007177573 0.0067927884 0.0012091773 0.0019716443 0.1215026304 -0.0029434063
  -0.0508980788 -0.0154679352 0.0270424075 0.0583891310 0.1457751989 -0.9873851538
  0.0007364781 0.0305074602 -0.0025437139 0.0012725779 0.1301465929 -0.0041509406
  0.0597956590 -0.0155105768 0.0267199613 0.0589696690 -0.1449000835 0.9875705242
  -0.0005588158 0.0304981228 -0.0025199694 0.0012615455 -0.1295253783 0.0041525951
  0.0323060788 -0.0356981978 0.0000993036 0.0058801193 -0.0512850694 -0.9986660480
  -0.0000076638 -0.0000225607 0.0048289155 0.0002232384 0.1057976112 0.0033464879
  -0.0264448896 -0.0356731974 0.0000996759 0.0114093907 0.0514623076 0.9984931946
  -0.0004835189 -0.0000131389 0.0048406040 0.0002190493 -0.1046594456 -0.0033967514
}

frame 4 {
  0.0000000000 0.0000000000 0.1000000015 0.7071068287 -0.0000000000 -0.0000000000
  0.1904436499 -0.2675637305 -0.0048917648 -0.4486945271 0.5465127826 -0.4489248395
  0.0000078835 0.5385842323 0.0037067386 -0.3714438081 0.0011217035 0.0047915620
  -0.1367245317 0.0567860045 0.0081083979 -0.3055367470 -0.3089571893 -0.6792308092
  0.0185693577 0.4483323991 0.0033929497 0.2691442668 0.3927210271 -0.7962394953
  0.1511483043 0.0605564043 0.0179879516 -0.2891452610 0.3051627874 0.6925753355
  -0.0184745565 0.4380992949 0.0039416589 0.2702319026 -0.3857776225 0.7994966507
  0.1626307517 0.2399919927 -0.0077441772 -0.3784045875 0.1435225755 0.4662082195
  -0.0160708819 0.5090758204 -0.0060641617 0.6205479503 0.0055579152 -0.0778720453
  -0.1620083749 0.2366254628 -0.0077909129 -0.3741866946 -0.1306878924 -0.4550285637
  0.0157527048 0.5011874437 -0.0063073486 0.6475510001 0.0028107776 0.0840575919
  0.1429834217 0.3889206648 -0.0056775147 -0.4522572756 0.0623894036 0.2110417932
  -0.0081060994 0.4350601733 -0.0118388981 0.7073535919 -0.0497238077 0.1161732897
  -0.1375857890 0.3918520808 -0.0110222837 -0.4371770024 -0.0539750755 -0.1945892125
  0.0074816681 0.4346220493 -0.0115393847 0.7209249139 0.0484595113 -0.1038994938
  0.0356776938 -0.0222882200 0.0637211874 0.0181757752 -0.0478774086 0.9984862804
  -0.0006551794 0.0072382507 0.0019289897 0.0028526837 -0.0339449160 0.0012019878
  -0.0276665241 -0.0231901444 0.0635223761 0.0521067642 0.0467757285 -0.9972309470
  0.0006315242 0.0068560271 0.0019891013 0.0019716476 0.1215026230 -0.0029434299
  -0.0508981310 -0.0156062078 0.0278173760 0.0583891235 0.1457759142 -0.9873850346
  0.0006438759 0.0304148290 -0.0017674132 0.0012725735 0.1301465631 -0.0041509322
  0.0597955994 -0.0156488661 0.0274949279 0.0589686856 -0.1448998302 0.9875706434
  -0.0004653852 0.0304074027 -0.0017435467 0.0012615338 -0.1295253634 0.0041525606
  0.0323060229 -0.0358365141 0.0008742388 0.0059148273 -0.0512866043 -0.9986657500
  -0.0000169958 0.0001943927 0.0055856104 0.0002232761 0.1057976186 0.0033464541
  -0.0264449473 -0.0358114801 0.0008745844 0.0114079127 0.0514629185 0.9984931946
  -0.0004605288 0.0002037570 0.0055970727 0.0002190620 -0.1046594456 -0.0033967528
}

frame 5 {
  0.0000000000 0.0000000000 0.1000000015 0.7071068287 -0.0000000000 -0.0000000000
  0.1836873889 -0.2870377302 -0.0048917430 -0.4374124408 0.5555837750 -0.4376467466
  0.0000078163 0.5384168625 0.0044620633 -0.3568144143 0.0010187186 0.0050742892
  -0.1367245615 0.0566186942 0.0088638114 -0.3034703434 -0.2920235097 -0.6889420152
  0.0185071304 0.4484062791 0.0036993269 0.2550584972 0.4670575857 -0.7350974083
  0.1511482745 0.0603890941 0.0187434163 -0.2936334014 0.2977691889 0.6952908635
  -0.0184064396 0.4384421110 0.0041953623 0.2608895302 -0.4489999712 0.7503985763
  0.1626307666 0.2398246974 -0.0069888076 -0.3992634714 0.1562724859 0.4747357368
  -0.0163076855 0.5088365078 -0.0057289377 0.5861610770 0.0061382186 -0.0739450231
  -0.1620084345 0.2364582121 -0.0070354654 -0.4025292695 -0.1445883512 -0.4601749480
  0.0159388296 0.5008909106 -0.0062232837 0.6406568885 0.0041454583 0.0868146643
  0.1429833919 0.3887533844 -0.0049221232 -0.5089848042 0.0853429735 0.2508127093
  -0.0096477428 0.4332149625 -0.0124405026 0.7007963061 -0.0556176454 0.0968418792
  -0.1375858188 0.3916848600 -0.0102668861 -0.4877188802 -0.0690222979 -0.2245777696
  0.0086372001 0.4332324862 -0.0121908709 0.7175497413 0.0550144278 -0.0832765028
  0.0356776193 -0.0224554706 0.0644766688 0.0181780849 -0.0478774756 0.9984863400
  -0.0006221433 0.0073318388 0.0026963111 0.0028526646 -0.0339449160 0.0012019768
  -0.0276666004 -0.0233574472 0.0642777458 0.0521066412 0.0467749350 -0.9972310662
  0.0005456633 0.0069499500 0.0027522899 0.0019716388 0.1215026155 -0.0029434173
  -0.0508982018 -0.0157735106 0.0285728201 0.0583891347 0.1457753032 -0.9873850942
  0.0005517418 0.0303556193 -0.0010015205 0.0012725702 0.1301465482 -0.0041509527
  0.0597955287 -0.0158162061 0.0282502901 0.0589696690 -0.1448993385 0.9875707030
  -0.0003728111 0.0303499550 -0.0009775916 0.0012615337 -0.1295253336 0.0041525913
  0.0323059522 -0.0360038243 0.0016297019 0.0058980919 -0.0512846559 -0.9986659288
  -0.0000261399 0.0004381441 0.0063198498 0.0002232953 0.1057976186 0.0033464753
  -0.0264450181 -0.0359787606 0.0016300542 0.0114112170 0.0514625907 0.9984931946
  -0.0004371633 0.0004474371 0.0063310284 0.0002191161 -0.1046594456 -0.0033967532
}

frame 6 {
  0.0000000000 0.0000000000 0.1000000015 0.7071068287 -0.0000000000 -0.0000000000
  0.1789243370 -0.3108058870 -0.0048917886 -0.4269844592 0.5636375546 -0.4272222221
  0.0000077452 0.5382379293 0.0051431954 -0.3267450631 0.0008639843 0.0053386609
  -0.1367246807 0.0564396642 0.0095448522 -0.2865495980 -0.2565834820 -0.7063249946
  0.0184509270 0.4481335878 0.0040247831 0.2317696363 0.5467740893 -0.6522287726
  0.1511481553 0.0602100641 0.0194244981 -0.2859635651 0.2744045556 0.7044988871
  -0.0183487162 0.4385009706 0.0044296030 0.2449395508 -0.5177562237 0.6859230399
  0.1626306176 0.2396456748 -0.0063076713 -0.4055162370 0.1629284471 0.4836972654
  -0.0164848417 0.5088729858 -0.0051433481 0.5368756652 0.0075582508 -0.0669043511
  -0.1620085537 0.2362791151 -0.0063544242 -0.4225580096 -0.1562810093 -0.4646045268
  0.0160799064 0.5007678270 -0.0060140938 0.6285901666 0.0047743819 0.0876997262
  0.1429832876 0.3885743618 -0.0042410525 -0.5419055223 0.1096684858 0.2882603705
  -0.0110755824 0.4319309890 -0.0122624487 0.6780253649 -0.0633544400 0.0744312108
  -0.1375859380 0.3915056884 -0.0095858080 -0.5210832953 -0.0853980556 -0.2528346181
  0.0097221425 0.4322116971 -0.0122994855 0.7038769722 0.0630077273 -0.0597870164
  0.0356775522 -0.0226345155 0.0651577115 0.0181772541 -0.0478772484 0.9984862208
  -0.0005911739 0.0074441913 0.0033907192 0.0028526946 -0.0339449234 0.0012019945
  -0.0276666656 -0.0235364623 0.0649588555 0.0521073304 0.0467745848 -0.9972309470
  0.0004667356 0.0070626335 0.0034429603 0.0019716129 0.1215026155 -0.0029434103
  -0.0508982800 -0.0159525555 0.0292539056 0.0583891831 0.1457760632 -0.9873850346
  0.0004671216 0.0303291827 -0.0003029099 0.0012725831 0.1301466227 -0.0041509545
  0.0597954579 -0.0159952138 0.0289314259 0.0589681417 -0.1448990852 0.9875708222
  -0.0002879840 0.0303252954 -0.0002789916 0.0012615210 -0.1295253932 0.0041525420
  0.0323058814 -0.0361828469 0.0023106965 0.0059071402 -0.0512872562 -0.9986657500
  -0.0000344130 0.0006859801 0.0069789435 0.0002232724 0.1057976112 0.0033464613
  -0.0264450908 -0.0361577831 0.0023110481 0.0114088971 0.0514624938 0.9984931350
  -0.0004152604 0.0006951822 0.0069898516 0.0002190330 -0.1046594605 -0.0033967532
}

frame 7 {
  0.0000000000 0.0000000000 0.1000000015 0.7071068287 -0.0000000000 -0.0000000000
  0.1760186106 -0.3345991373 -0.0048918738 -0.4183348715 0.5700867176 -0.4185754359
  0.0000076768 0.5380725265 0.0056955442 -0.2862710953 0.0006829360 0.0055385474
  -0.1367247254 0.0562743582 0.0100972261 -0.2592346370 -0.2118011862 -0.7252378464
  0.0183908790 0.4476321042 0.0043389536 0.2009130716 0.6188979745 -0.5550884604
  0.1511481404 0.0600447133 0.0199768115 -0.2688437402 0.2426367551 0.7163810730
  -0.0182926655 0.4383471310 0.0046825744 0.2232441753 -0.5808838606 0.6127528548
  0.1626306027 0.2394803017 -0.0057552708 -0.3996081650 0.1633950025 0.4923852682
  -0.0165937990 0.5090879798 -0.0044162720 0.4788398147 0.0094410665 -0.0579432733
  -0.1620085835 0.2361137718 -0.0058020116 -0.4347089529 -0.1651961058 -0.4680236876
  0.0161688998 0.5007841587 -0.0057482794 0.6143678427 0.0047383388 0.0869124308
  0.1429832578 0.3884089887 -0.0036887177 -0.5538097620 0.1319498718 0.3194475174
  -0.0122243408 0.4313130975 -0.0115994792 0.6447836757 -0.0710443184 0.0549018867
  -0.1375859976 0.3913403451 -0.0090334192 -0.5386481285 -0.1012826934 -0.2760657966
  0.0106098037 0.4316392243 -0.0120407529 0.6840586662 0.0708834156 -0.0386355855
  0.0356774777 -0.0227999035 0.0657100976 0.0181774385 -0.0478772521 0.9984862804
  -0.0005651979 0.0075554401 0.0039559514 0.0028526683 -0.0339449309 0.0012019854
  -0.0276667383 -0.0237018056 0.0655112490 0.0521073267 0.0467751026 -0.9972310066
  0.0004016343 0.0071740896 0.0040048743 0.0019716250 0.1215026081 -0.0029434448
  -0.0508983508 -0.0161178838 0.0298062768 0.0583892316 0.1457749754 -0.9873851538
  0.0003973250 0.0303270705 0.0002695038 0.0012725743 0.1301465482 -0.0041509648
  0.0597953908 -0.0161605794 0.0294837877 0.0589691810 -0.1449005753 0.9875705242
  -0.0002181970 0.0303245522 0.0002933920 0.0012615348 -0.1295253634 0.0041525480
  0.0323058143 -0.0363481529 0.0028631126 0.0059071896 -0.0512865484 -0.9986658096
  -0.0000411599 0.0009071292 0.0075114300 0.0002231988 0.1057975963 0.0033464862
  -0.0264451578 -0.0363231190 0.0028634637 0.0114110820 0.0514623523 0.9984931946
  -0.0003968757 0.0009162073 0.0075221178 0.0002190840 -0.1046594456 -0.0033967376
}

frame 8 {
  0.0000000000 0.0000000000 0.1000000015 0.7071068287 -0.0000000000 -0.0000000000
  0.1745528430 -0.3541449308 -0.0048919632 -0.4121213555 0.5745946169 -0.4123638868
  0.0000076256 0.5379445553 0.0060854554 -0.2459046245 0.0005165521 0.0056532598
  -0.1367247850 0.0561463572 0.0104871551 -0.2281712890 -0.1668495834 -0.7417652011
  0.0183269456 0.4469984770 0.0045801401 0.1674397439 0.6741598248 -0.4572679996
  0.1511480808 0.0599168018 0.0203667562 -0.2478647381 0.2108173519 0.7277097106
  -0.0182378590 0.4380540252 0.0049265064 0.1999115050 -0.6296012998 0.5423215628
  0.1626305431 0.2393523455 -0.0053654001 -0.3871291876 0.1595029682 0.4997150898
  -0.0166460574 0.5093403459 -0.0037043281 0.4221664071 0.0113773448 -0.0492371880
  -0.1620086282 0.2359858155 -0.0054121637 -0.4409418702 -0.1712536663 -0.4703075588
  0.0162135065 0.5008654594 -0.0055050775 0.6014134884 0.0043010195 0.0852422342
  0.1429831982 0.3882811069 -0.0032988207 -0.5530101657 0.1491980553 0.3422170579
  -0.0130177196 0.4311582446 -0.0108234063 0.6105354428 -0.0771649033 0.0417733900
  -0.1375860125 0.3912124336 -0.0086435499 -0.5453352928 -0.1146017313 -0.2923999727
  0.0112295561 0.4314163029 -0.0116550699 0.6639748812 0.0774656162 -0.0237926971
  0.0356774293 -0.0229278300 0.0660999939 0.0181787275 -0.0478777327 0.9984862804
  -0.0005463893 0.0076451874 0.0043559466 0.0028526532 -0.0339449272 0.0012019770
  -0.0276667885 -0.0238297470 0.0659011006 0.0521082953 0.0467746593 -0.9972310066
  0.0003550765 0.0072639007 0.0044025332 0.0019716369 0.1215026006 -0.0029434364
  -0.0508984104 -0.0162458550 0.0301961508 0.0583889112 0.1457757503 -0.9873850942
  0.0003474103 0.0303363241 0.0006766431 0.0012725935 0.1301465631 -0.0041509527
  0.0597953349 -0.0162885059 0.0298736542 0.0589687526 -0.1448996365 0.9875706434
  -0.0001684260 0.0303347837 0.0007005599 0.0012615188 -0.1295252889 0.0041526044
  0.0323057622 -0.0364760943 0.0032530089 0.0059131472 -0.0512873903 -0.9986656904
  -0.0000459381 0.0010742747 0.0078860978 0.0002232717 0.1057975963 0.0033464588
  -0.0264452063 -0.0364510603 0.0032533524 0.0114112142 0.0514623970 0.9984931946
  -0.0003835927 0.0010832774 0.0078965677 0.0002190553 -0.1046594456 -0.0033967397
}

frame 9 {
  0.0000000000 0.0000000000 0.1000000015 0.7071068287 -0.0000000000 -0.0000000000
  0.1739988178 -0.3665668666 -0.0048920279 -0.4085437655 0.5771437883 -0.4087874293
  0.0000075936 0.5378676057 0.0063071772 -0.2169744819 0.0004029804 0.0057003489
  -0.1367248297 0.0560694076 0.0107088769 -0.2016030997 -0.1312622130 -0.7538352609
  0.0182668641 0.4463853836 0.0047143921 0.1394524723 0.7079972029 -0.3790511191
  0.1511480212 0.0598397776 0.0205885116 -0.2304401994 0.1871723682 0.7359203100
  -0.0181940645 0.4377549291 0.0051026270 0.1814036518 -0.6595196128 0.4899997711
  0.1626304686 0.2392753661 -0.0051436648 -0.3751408160 0.1546785533 0.5045526028
  -0.0166630894 0.5095253587 -0.0031791069 0.3797813356 0.0128441267 -0.0429305807
  -0.1620087028 0.2359088659 -0.0051903850 -0.4434953332 -0.1747386754 -0.4714674950
  0.0162288994 0.5009447336 -0.0053416491 0.5925647616 0.0039683692 0.0835264102
  0.1429831386 0.3882040381 -0.0030770055 -0.5483937263 0.1596459001 0.3557908833
  -0.0134615041 0.4311889708 -0.0102409944 0.5852565765 -0.0809946135 0.0350311995
  -0.1375860870 0.3911354542 -0.0084217796 -0.5466268063 -0.1232444122 -0.3017196059
  0.0115784965 0.4313725829 -0.0113460496 0.6493225098 0.0817098320 -0.0156580452
  0.0356773958 -0.0230047796 0.0663217306 0.0181774218 -0.0478772037 0.9984862804
  -0.0005355186 0.0077003343 0.0045838729 0.0028526566 -0.0339449234 0.0012019880
  -0.0276668184 -0.0239067860 0.0661228523 0.0521059036 0.0467745103 -0.9972310662
  0.0003283536 0.0073192064 0.0046292273 0.0019716474 0.1215026155 -0.0029434136
  -0.0508984365 -0.0163228195 0.0304179247 0.0583884865 0.1457765251 -0.9873850346
  0.0003187656 0.0303456020 0.0009094612 0.0012725776 0.1301465631 -0.0041509708
  0.0597953051 -0.0163655300 0.0300954357 0.0589687191 -0.1448974609 0.9875710011
  -0.0001399182 0.0303445924 0.0009333305 0.0012615421 -0.1295253783 0.0041525559
  0.0323057286 -0.0365530886 0.0034747755 0.0059266523 -0.0512861758 -0.9986657500
  -0.0000486597 0.0011735754 0.0080988305 0.0002232401 0.1057976186 0.0033464937
  -0.0264452435 -0.0365280844 0.0034751487 0.0114134131 0.0514625832 0.9984930754
  -0.0003758972 0.0011825021 0.0081092212 0.0002190190 -0.1046594605 -0.0033967686
}

frame 10 {
  0.0000000000 0.0000000000 0.1000000015 0.7071068287 -0.0000000000 -0.0000000000
  0.1738941073 -0.3707299829 -0.0048920517 -0.4074263275 0.5779331923 -0.4076702595
  0.0000075845 0.5378430486 0.0063761324 -0.2066285014 0.0003633263 0.0057111266
  -0.1367247999 0.0560448058 0.0107777650 -0.1907222420 -0.1170341000 -0.7585113049
  0.0182400420 0.4461083710 0.0047462843 0.1280914247 0.7191672921 -0.3477934599
  0.1511480361 0.0598152205 0.0206574816 -0.2237232924 0.1784141362 0.7389379144
  -0.0181775987 0.4376248419 0.0051629134 0.1743581295 -0.6694044471 0.4705549777
  0.1626304984 0.2392508090 -0.0050747106 -0.3702094555 0.1525194794 0.5062087178
  -0.0166656524 0.5095914006 -0.0029863790 0.3639501333 0.0133784208 -0.0406398624
  -0.1620086730 0.2358842641 -0.0051214998 -0.4441052377 -0.1758448184 -0.4717925191
  0.0162315816 0.5009757280 -0.0052862018 0.5894543529 0.0038470905 0.0828224942
  0.1429831386 0.3881795704 -0.0030080914 -0.5461485982 0.1629982740 0.3602576554
  -0.0136009678 0.4312173128 -0.0100311302 0.5760753155 -0.0822127908 0.0329567343
  -0.1375860572 0.3911109269 -0.0083528133 -0.5465236306 -0.1261169761 -0.3046918511
  0.0116880387 0.4313742518 -0.0112319067 0.6439788342 0.0831162781 -0.0130855339
  0.0356773846 -0.0230293963 0.0663906857 0.0181758590 -0.0478777625 0.9984862804
  -0.0005321060 0.0077180648 0.0046546916 0.0028526615 -0.0339449234 0.0012019852
  -0.0276668314 -0.0239313133 0.0661918223 0.0521065220 0.0467746742 -0.9972310066
  0.0003200267 0.0073369811 0.0046995534 0.0019716332 0.1215026155 -0.0029434096
  -0.0508984476 -0.0163474064 0.0304869097 0.0583885424 0.1457771212 -0.9873848557
  0.0003098501 0.0303490236 0.0009820028 0.0012725721 0.1301465929 -0.0041509792
  0.0597952977 -0.0163900573 0.0301644057 0.0589676835 -0.1448985636 0.9875708818
  -0.0001310481 0.0303482041 0.0010057827 0.0012615469 -0.1295253485 0.0041525578
  0.0323057175 -0.0365776904 0.0035437383 0.0059026224 -0.0512884595 -0.9986658096
  -0.0000495081 0.0012049587 0.0081647905 0.0002232278 0.1057976037 0.0033465223
  -0.0264452472 -0.0365526564 0.0035440815 0.0114096254 0.0514626652 0.9984931946
  -0.0003734883 0.0012139725 0.0081752110 0.0002190635 -0.1046594605 -0.0033967479
}

