MD5Version 10
commandline ""

numFrames 11
numJoints 85
frameRate 60
numAnimatedComponents 510

hierarchy {
  "origin" -1 63 0 //
  "hips" 0 63 6 //
  "spine" 1 63 12 //
  "ribs" 2 63 18 //
  "neck" 3 63 24 //
  "neckcontol" 4 63 30 //
  "head" 4 63 36 //
  "jaw" 6 63 42 //
  "lower_lip0" 7 63 48 //
  "lip.003" 8 63 54 //
  "lip.002" 9 63 60 //
  "lip.001" 10 63 66 //
  "lip" 11 63 72 //
  "eye.L" 6 63 78 //
  "eye.R" 6 63 84 //
  "upper_lip0" 6 63 90 //
  "lip.004" 15 63 96 //
  "lip.005" 16 63 102 //
  "lip.006" 17 63 108 //
  "lip.007" 18 63 114 //
  "eyelidIK3.L" 6 63 120 //
  "eyelid2.L" 20 63 126 //
  "eyelid3.L" 21 63 132 //
  "eyelidIK2.L" 6 63 138 //
  "eyelid1.L" 23 63 144 //
  "eyelid.L" 24 63 150 //
  "eyelidIK3.R" 6 63 156 //
  "eyelid2.R" 26 63 162 //
  "eyelid3.R" 27 63 168 //
  "eyelidIK2.R" 6 63 174 //
  "eyelid1.R" 29 63 180 //
  "eyelid.R" 30 63 186 //
  "head_tag" 4 63 192 //
  "shoulder.R" 3 63 198 //
  "upper_arm.R" 33 63 204 //
  "forearm.R" 34 63 210 //
  "hand.R" 35 63 216 //
  "finger_index.01.R" 36 63 222 //
  "finger_index.02.R" 37 63 228 //
  "finger_index.03.R" 38 63 234 //
  "thumb.01.R" 36 63 240 //
  "thumb.02.R" 40 63 246 //
  "thumb.03.R" 41 63 252 //
  "tag_weapon" 36 63 258 //
  "finger_middle.01.R" 36 63 264 //
  "finger_middle.02.R" 44 63 270 //
  "finger_middle.03.R" 45 63 276 //
  "finger_ring.01.R" 36 63 282 //
  "finger_ring.02.R" 47 63 288 //
  "finger_ring.03.R" 48 63 294 //
  "finger_pinky.01.R" 36 63 300 //
  "finger_pinky.02.R" 50 63 306 //
  "finger_pinky.03.R" 51 63 312 //
  "hand_armor.R" 35 63 318 //
  "tag_gear" 3 63 324 //
  "shoulder.L" 3 63 330 //
  "upper_arm.L" 55 63 336 //
  "forearm.L" 56 63 342 //
  "hand_armor.L" 57 63 348 //
  "hand.L" 57 63 354 //
  "finger_index.01.L" 59 63 360 //
  "finger_index.02.L" 60 63 366 //
  "finger_index.03.L" 61 63 372 //
  "thumb.01.L" 59 63 378 //
  "thumb.02.L" 63 63 384 //
  "thumb.03.L" 64 63 390 //
  "finger_middle.01.L" 59 63 396 //
  "finger_middle.02.L" 66 63 402 //
  "finger_middle.03.L" 67 63 408 //
  "finger_ring.01.L" 59 63 414 //
  "finger_ring.02.L" 69 63 420 //
  "finger_ring.03.L" 70 63 426 //
  "finger_pinky.01.L" 59 63 432 //
  "finger_pinky.02.L" 72 63 438 //
  "finger_pinky.03.L" 73 63 444 //
  "thigh.R" 1 63 450 //
  "shin.R" 75 63 456 //
  "thigh.L" 1 63 462 //
  "shin.L" 77 63 468 //
  "ankle.R" 0 63 474 //
  "foot.R" 79 63 480 //
  "toe.R" 79 63 486 //
  "ankle.L" 0 63 492 //
  "toe.L" 82 63 498 //
  "foot.L" 82 63 504 //
}

bounds {
  ( -1.271443 -4.040956 2.723924 ) ( 5.366858 1.828689 12.831764 )
  ( -1.241623 -4.041418 2.651039 ) ( 5.402039 1.812893 12.837022 )
  ( -1.153301 -4.030934 2.442436 ) ( 5.502183 1.759384 12.850631 )
  ( -1.028453 -3.979265 2.123870 ) ( 5.636716 1.781223 12.865952 )
  ( -1.101777 -3.855544 1.733259 ) ( 5.752986 1.827125 12.878658 )
  ( -1.324636 -3.644756 1.314284 ) ( 5.830138 1.875642 12.890259 )
  ( -1.532097 -3.351636 0.888255 ) ( 5.887139 1.920798 12.906754 )
  ( -1.706111 -3.005130 0.512377 ) ( 5.940800 1.958213 12.930049 )
  ( -1.836411 -2.665026 0.217322 ) ( 5.974737 1.985475 12.953282 )
  ( -1.917337 -2.678944 0.026240 ) ( 5.989093 2.001715 12.969128 )
  ( -1.945048 -2.700210 -0.041077 ) ( 5.991965 2.008111 12.974941 )
}

baseframe {
  ( 0.000000 0.000000 0.000000 ) ( 0.000000 -0.707107 -0.707107 )
  ( 0.184526 6.906084 -0.013687 ) ( -0.063425 -0.704162 0.063709 )
  ( -0.000000 1.240110 0.000000 ) ( 0.191587 0.001295 -0.009840 )
  ( -0.000000 1.426178 -0.000000 ) ( -0.063779 -0.002332 0.012698 )
  ( -0.000000 1.821084 0.000000 ) ( -0.145265 -0.001328 -0.001879 )
  ( 0.000000 0.808121 0.000000 ) ( 0.001844 -0.515148 -0.857099 )
  ( -0.002195 0.809023 0.000794 ) ( 0.040325 0.000217 -0.001349 )
  ( -0.003138 0.224356 0.163703 ) ( -0.591717 0.381594 0.595702 )
  ( -0.263320 0.555491 -0.218415 ) ( -0.002580 0.003661 -0.873876 )
  ( 0.000000 0.017501 -0.000000 ) ( 0.220569 0.655870 0.690904 )
  ( 0.000000 0.135389 -0.000001 ) ( 0.037467 -0.018190 0.200649 )
  ( 0.000000 0.113742 0.000000 ) ( -0.125321 0.000000 0.210707 )
  ( 0.000000 0.113741 -0.000000 ) ( 0.037467 0.018190 0.200649 )
  ( 0.262165 0.811893 0.662538 ) ( -0.000000 -0.752543 -0.658544 )
  ( -0.244069 0.811856 0.663658 ) ( -0.000000 -0.752542 -0.658544 )
  ( 0.225828 0.266057 0.774515 ) ( 0.047000 0.705543 -0.047000 )
  ( -0.000000 0.017501 -0.000000 ) ( 0.186223 0.743981 0.598525 )
  ( -0.000000 0.145787 -0.000001 ) ( 0.114298 0.017382 0.174281 )
  ( -0.000000 0.112094 0.000000 ) ( -0.001650 -0.003770 0.248557 )
  ( -0.000000 0.111594 0.000000 ) ( 0.099455 -0.020017 0.173948 )
  ( 0.361090 0.810247 0.681599 ) ( 0.046999 0.705543 -0.046999 )
  ( -0.000000 0.011231 0.000000 ) ( 0.138551 0.777593 0.585011 )
  ( 0.000000 0.112704 0.000001 ) ( 0.248666 0.003044 0.385872 )
  ( 0.360328 0.777492 0.684141 ) ( 0.046999 0.705543 -0.046999 )
  ( -0.000000 0.010076 -0.000000 ) ( -0.135461 0.512721 0.787661 )
  ( -0.000000 0.108887 -0.000001 ) ( -0.349590 0.371748 0.224171 )
  ( -0.137678 0.812980 0.691455 ) ( 0.046999 0.705543 -0.046999 )
  ( -0.000000 0.011230 0.000000 ) ( 0.069059 0.752863 0.649633 )
  ( 0.000000 0.131865 -0.000000 ) ( 0.201215 -0.007965 0.324740 )
  ( -0.136810 0.780376 0.690930 ) ( 0.046999 0.705543 -0.046999 )
  ( -0.000000 0.010076 0.000000 ) ( 0.085597 0.645822 0.755134 )
  ( -0.000000 0.128464 -0.000001 ) ( -0.122912 -0.007699 0.282440 )
  ( -0.002195 0.809023 0.000794 ) ( 0.040325 0.000217 -0.001349 )
  ( -0.014833 1.825302 -0.071422 ) ( 0.548058 -0.398517 -0.527101 )
  ( 0.000000 1.493901 0.000000 ) ( 0.337192 0.599744 -0.369520 )
  ( 0.000000 2.103016 0.000000 ) ( -0.166080 0.071882 0.080628 )
  ( 0.000001 1.823368 0.000000 ) ( 0.026122 0.716524 0.005963 )
  ( 0.288927 0.945606 -0.016979 ) ( -0.100840 -0.682277 -0.030495 )
  ( 0.000000 0.310931 0.000000 ) ( -0.001887 -0.003346 -0.140544 )
  ( -0.000000 0.255058 0.000000 ) ( 0.014527 -0.020137 -0.079928 )
  ( 0.182657 0.102359 0.122068 ) ( 0.068809 0.469953 0.338161 )
  ( -0.000000 0.450617 0.000000 ) ( -0.099065 0.025937 0.025593 )
  ( 0.000000 0.295731 -0.000001 ) ( 0.108671 0.022517 0.026610 )
  ( 0.586577 1.443575 0.291631 ) ( 0.494772 0.504178 0.517254 )
  ( 0.081677 0.956433 -0.018380 ) ( -0.107088 -0.736173 -0.098262 )
  ( 0.000000 0.323707 0.000000 ) ( -0.004845 -0.051318 -0.175658 )
  ( 0.000000 0.229679 -0.000000 ) ( 0.016195 -0.015133 -0.050692 )
  ( -0.151893 0.951490 -0.015787 ) ( -0.155854 -0.744157 -0.130418 )
  ( -0.000001 0.298948 -0.000000 ) ( 0.022449 -0.039879 -0.150750 )
  ( -0.000000 0.222754 0.000000 ) ( 0.017543 -0.013115 -0.049400 )
  ( -0.332551 0.872253 0.059175 ) ( -0.270536 -0.079021 -0.029623 )
  ( 0.000000 0.247823 -0.000000 ) ( -0.085055 0.000243 0.004201 )
  ( 0.000000 0.155400 0.000000 ) ( -0.148243 -0.000940 -0.003131 )
  ( 0.531379 1.351308 -0.004340 ) ( 0.015885 0.004080 0.999865 )
  ( 0.002183 1.423120 -0.451181 ) ( 0.675237 0.001866 -0.002772 )
  ( 0.014634 1.825497 -0.071451 ) ( 0.552755 0.408370 0.515946 )
  ( 0.000000 1.493901 0.000000 ) ( 0.498017 -0.047311 0.047143 )
  ( 0.000000 2.103018 -0.000001 ) ( -0.075532 0.079375 0.168458 )
  ( 0.093228 1.351308 0.523154 ) ( 0.654641 0.002699 0.755929 )
  ( 0.000000 1.823368 -0.000000 ) ( -0.025836 0.094228 -0.007102 )
  ( 0.286576 1.006395 -0.107107 ) ( 0.072174 0.602406 -0.086389 )
  ( 0.000000 0.249955 0.000000 ) ( -0.000083 -0.010683 -0.125485 )
  ( -0.000000 0.254363 -0.000000 ) ( -0.016009 0.049143 -0.075943 )
  ( 0.120542 0.102358 -0.183667 ) ( 0.017564 -0.626009 0.348850 )
  ( -0.000000 0.445150 0.000000 ) ( 0.067621 -0.024966 0.008198 )
  ( 0.000000 0.302324 0.000000 ) ( -0.058338 0.684439 0.061834 )
  ( 0.073565 1.013167 -0.024132 ) ( 0.119028 -0.795213 0.100389 )
  ( -0.000000 0.266205 0.000000 ) ( 0.003820 0.009027 0.165078 )
  ( -0.000000 0.229740 -0.000000 ) ( -0.004806 0.012921 0.052363 )
  ( -0.127263 1.003840 0.060605 ) ( 0.184529 -0.779480 0.128005 )
  ( -0.000000 0.246800 0.000000 ) ( -0.001225 -0.003214 0.130582 )
  ( 0.000000 0.222126 -0.000000 ) ( 0.002051 0.007113 0.050428 )
  ( -0.358085 0.893698 0.063869 ) ( 0.227228 -0.775272 0.133791 )
  ( 0.000000 0.221431 -0.000000 ) ( -0.006730 0.001955 0.092569 )
  ( -0.000000 0.154458 0.000000 ) ( -0.003598 -0.015304 0.148050 )
  ( -0.810392 0.550812 -0.372493 ) ( -0.984551 0.027405 -0.000267 )
  ( 0.000000 3.626385 -0.000000 ) ( -0.211921 0.002430 0.007077 )
  ( 0.782400 0.551416 -0.372917 ) ( -0.984498 -0.026294 0.009171 )
  ( -0.000000 3.626384 0.000000 ) ( -0.211935 -0.017722 -0.006644 )
  ( -0.305859 0.828940 1.124649 ) ( -0.552637 0.176065 -0.801670 )
  ( -0.090614 0.138320 1.006144 ) ( 0.752092 0.018236 0.046746 )
  ( -0.090614 0.138320 1.006144 ) ( -0.854351 0.076975 -0.055594 )
  ( -0.305858 0.828940 -1.124649 ) ( 0.585870 -0.181993 -0.777713 )
  ( -0.005721 0.138319 -1.010200 ) ( -0.046568 0.515226 -0.854890 )
  ( -0.005721 0.138319 -1.010200 ) ( -0.753536 -0.000864 0.003278 )
}

frame 0 {
  -0.000000 0.000000 -0.001428 -0.707107 -0.000000 -0.000000
  0.309123 6.236876 -0.106869 -0.002698 -0.546086 -0.062769
  -0.000000 1.240110 0.000000 -0.010454 0.006525 -0.019213
  -0.000000 1.426177 -0.000000 -0.201798 0.002609 0.047825
  0.000000 1.821084 -0.000001 -0.081795 -0.211893 -0.090694
  0.000000 0.808121 -0.000000 0.001844 -0.515148 -0.857099
  -0.044148 0.766294 0.024775 0.027185 0.014681 0.061466
  -0.003138 0.224357 0.163703 -0.582226 0.395844 0.586146
  -0.259540 0.557511 -0.217253 0.909996 -0.390407 0.077365
  0.000000 0.017501 -0.000000 0.768310 -0.177154 -0.240414
  0.000000 0.135389 0.000000 0.089952 -0.090069 0.217024
  -0.000000 0.113741 -0.000000 -0.170264 -0.055102 0.170774
  0.000000 0.113741 0.000000 -0.030971 -0.024570 0.230214
  0.262165 0.811895 0.662538 0.042621 0.843428 0.534248
  -0.244069 0.811857 0.663658 0.054807 0.842376 0.533946
  0.224683 0.261800 0.775026 0.037734 -0.688963 0.232046
  -0.000000 0.017499 0.000000 0.699074 -0.202398 -0.217549
  -0.000000 0.145787 -0.000001 0.148643 -0.033577 0.191496
  0.000000 0.112093 0.000000 -0.063390 -0.082731 0.231903
  -0.000000 0.111594 -0.000001 0.021959 -0.059875 0.225690
  0.365935 0.793586 0.683419 0.046999 0.705543 -0.046999
  -0.000000 0.011232 -0.000000 0.125931 0.784488 0.580790
  0.000000 0.112704 0.000001 0.249008 -0.023434 0.387488
  0.360328 0.777494 0.684141 0.046999 0.705543 -0.046999
  -0.000000 0.010075 -0.000000 -0.099298 0.457441 0.813067
  0.000001 0.108888 -0.000000 -0.431281 0.352684 0.307497
  -0.136625 0.803882 0.692455 0.046999 0.705543 -0.046999
  -0.000000 0.011231 -0.000000 0.006459 0.734143 0.661929
  -0.000000 0.131865 -0.000001 0.074787 -0.106869 0.374313
  -0.136810 0.780377 0.690930 0.046999 0.705543 -0.046999
  -0.000000 0.010075 0.000000 0.083036 0.632373 0.750972
  -0.000000 0.128464 0.000001 -0.198546 -0.102604 0.370850
  -0.002195 0.809023 0.000794 0.040325 0.000217 -0.001349
  -0.014832 1.825302 -0.071422 0.467192 -0.533469 -0.463268
  0.000000 1.493901 -0.000000 -0.016917 0.690188 -0.617525
  0.000001 2.103015 -0.000000 -0.811213 0.031614 0.393825
  0.000000 1.823368 0.000001 0.319483 0.365261 -0.170527
  0.288928 0.945606 -0.016980 -0.051731 -0.682667 -0.029377
  -0.000000 0.310932 0.000003 0.000222 -0.001467 -0.002344
  0.000000 0.255058 0.000001 -0.029948 -0.071880 -0.099453
  0.182658 0.102359 0.122067 -0.147736 0.530623 0.238875
  -0.000000 0.450618 -0.000001 -0.221159 -0.001965 -0.022330
  -0.000000 0.295730 -0.000001 0.099075 0.156024 -0.150700
  0.586576 1.443575 0.291630 0.494772 0.504178 0.517254
  0.081676 0.956433 -0.018380 -0.233269 -0.644877 -0.350894
  -0.000000 0.323706 0.000001 0.060403 -0.029307 -0.532701
  -0.000000 0.229678 0.000000 0.030189 0.093453 -0.398566
  -0.151894 0.951490 -0.015787 -0.308044 -0.644091 -0.377097
  -0.000000 0.298947 0.000001 0.096443 -0.030547 -0.429634
  0.000000 0.222754 0.000000 0.006245 0.070173 -0.361877
  -0.332552 0.872253 0.059175 -0.391309 -0.056794 -0.073512
  0.000001 0.247823 -0.000000 -0.418423 0.003177 -0.041878
  -0.000000 0.155400 -0.000000 -0.503342 -0.045840 -0.035991
  0.531378 1.351307 -0.004340 0.015923 0.004052 0.999865
  0.002183 1.423121 -0.451181 0.675237 0.001866 -0.002772
  0.014634 1.825497 -0.071451 0.428741 0.516759 0.554093
  -0.000000 1.493901 0.000001 0.434428 0.302777 0.512522
  -0.000000 2.103015 0.000000 0.020740 0.450895 0.491783
  0.093228 1.351308 0.523155 0.654645 0.002699 0.755925
  -0.000001 1.823368 0.000001 -0.015542 0.607477 -0.301177
  0.286577 1.006396 -0.107109 0.024727 0.598347 -0.059196
  0.000000 0.249956 -0.000000 -0.029439 -0.012158 -0.324048
  0.000001 0.254363 0.000000 -0.076066 0.173005 -0.419972
  0.120543 0.102359 -0.183668 0.007275 -0.621719 0.355022
  -0.000002 0.445150 0.000000 0.209436 -0.024503 0.024127
  -0.000001 0.302324 -0.000000 -0.249706 0.522783 0.319392
  0.073565 1.013167 -0.024134 0.021294 -0.812609 0.006548
  0.000001 0.266206 0.000000 0.056265 0.004783 0.582468
  0.000000 0.229738 0.000000 -0.022480 0.184748 0.188491
  -0.127263 1.003841 0.060603 0.076596 -0.797043 0.046933
  0.000000 0.246800 0.000000 -0.008500 -0.002390 0.639219
  0.000000 0.222126 -0.000000 -0.019038 0.249660 0.025280
  -0.358085 0.893699 0.063866 0.166020 -0.779816 0.119032
  0.000001 0.221430 -0.000001 -0.065091 0.003527 0.301274
  0.000000 0.154458 -0.000000 0.132189 0.263734 0.315388
  -0.810392 0.550813 -0.372493 -0.696618 0.236712 -0.186766
  -0.000000 3.626384 0.000000 -0.935714 0.000874 0.031246
  0.782400 0.551417 -0.372917 -0.657927 -0.153587 0.181794
  -0.000000 3.626384 -0.000000 -0.891621 -0.008195 -0.027953
  -0.174225 4.277575 0.868138 -0.391951 0.396733 -0.829931
  -0.090614 0.138319 1.006144 0.934929 -0.003559 0.064254
  -0.090614 0.138319 1.006144 -0.715854 -0.014973 -0.017931
  1.694646 4.328063 -1.025876 0.620083 -0.235191 -0.702833
  -0.005721 0.138319 -1.010200 -0.038428 -0.730474 0.680940
  -0.005721 0.138319 -1.010200 -0.936095 0.005850 -0.010951
}

frame 1 {
  -0.000000 0.000000 -0.001428 -0.707107 -0.000000 -0.000000
  0.309123 6.242556 -0.106869 -0.006176 -0.546073 -0.057445
  -0.000000 1.240110 0.000000 -0.008762 0.006145 -0.020673
  0.000000 1.426178 -0.000000 -0.198815 0.001481 0.044907
  0.000000 1.821084 -0.000000 -0.081302 -0.211487 -0.089989
  0.000000 0.808122 -0.000001 0.001844 -0.515148 -0.857099
  -0.044147 0.766295 0.024774 0.027581 0.014768 0.061072
  -0.003138 0.224357 0.163703 -0.582226 0.395844 0.586146
  -0.259542 0.557510 -0.217254 0.909636 -0.390705 0.077897
  0.000000 0.017501 -0.000000 0.768800 -0.177059 -0.240774
  -0.000000 0.135388 -0.000000 0.090421 -0.090521 0.216631
  -0.000000 0.113742 0.000000 -0.170053 -0.055743 0.170941
  0.000000 0.113741 -0.000000 -0.031133 -0.025301 0.230200
  0.262165 0.811894 0.662537 0.042844 0.842996 0.534899
  -0.244068 0.811857 0.663657 0.055049 0.841938 0.534593
  0.224683 0.261799 0.775026 0.036360 -0.688607 0.232794
  -0.000000 0.017499 0.000000 0.699732 -0.202158 -0.217728
  0.000000 0.145788 -0.000000 0.148948 -0.033872 0.191085
  0.000000 0.112094 0.000000 -0.062961 -0.083544 0.231799
  -0.000000 0.111594 0.000001 0.021697 -0.060669 0.225797
  0.365935 0.793586 0.683418 0.046999 0.705543 -0.046999
  -0.000000 0.011231 -0.000000 0.125931 0.784487 0.580791
  0.000000 0.112704 0.000002 0.249009 -0.023435 0.387487
  0.360328 0.777494 0.684141 0.046999 0.705543 -0.046999
  -0.000000 0.010075 -0.000000 -0.099298 0.457442 0.813066
  0.000000 0.108887 -0.000000 -0.431285 0.352683 0.307497
  -0.136625 0.803882 0.692454 0.046999 0.705543 -0.046999
  -0.000000 0.011232 0.000000 0.006955 0.734255 0.661925
  0.000000 0.131865 0.000001 0.074861 -0.108067 0.374297
  -0.136810 0.780376 0.690930 0.046999 0.705543 -0.046999
  0.000000 0.010075 -0.000000 0.083804 0.632548 0.750887
  -0.000000 0.128464 -0.000001 -0.198288 -0.103809 0.370990
  -0.002195 0.809023 0.000793 0.040325 0.000217 -0.001349
  -0.014833 1.825302 -0.071422 0.467192 -0.533469 -0.463268
  0.000001 1.493902 0.000002 0.002019 0.682413 -0.629245
  -0.000000 2.103015 -0.000000 -0.809621 0.031882 0.393053
  -0.000000 1.823369 0.000000 0.302984 0.378877 -0.181055
  0.288928 0.945606 -0.016980 -0.051747 -0.682665 -0.029394
  0.000000 0.310931 -0.000001 0.000222 -0.001467 -0.002344
  0.000000 0.255058 -0.000001 -0.029950 -0.071880 -0.099433
  0.182658 0.102358 0.122067 -0.147768 0.530631 0.238861
  0.000000 0.450619 -0.000000 -0.221079 -0.001966 -0.022319
  0.000000 0.295730 -0.000001 0.099026 0.156029 -0.150706
  0.586577 1.443575 0.291631 0.494772 0.504178 0.517254
  0.081677 0.956433 -0.018380 -0.233293 -0.644868 -0.350917
  -0.000000 0.323706 0.000000 0.060395 -0.029310 -0.532630
  0.000000 0.229678 0.000000 0.030192 0.093449 -0.398614
  -0.151893 0.951490 -0.015788 -0.308069 -0.644075 -0.377127
  0.000000 0.298947 0.000000 0.096422 -0.030549 -0.429540
  0.000000 0.222754 -0.000001 0.006257 0.070166 -0.361938
  -0.332550 0.872253 0.059175 -0.391365 -0.056796 -0.073514
  0.000001 0.247823 -0.000001 -0.418293 0.003177 -0.041865
  0.000001 0.155400 0.000001 -0.503417 -0.045841 -0.036002
  0.531378 1.351308 -0.004341 0.015870 0.004097 0.999866
  0.002183 1.423121 -0.451181 0.675237 0.001866 -0.002772
  0.014634 1.825496 -0.071452 0.424524 0.519424 0.558418
  0.000000 1.493901 0.000000 0.447376 0.309247 0.500910
  0.000001 2.103017 -0.000001 0.020883 0.449898 0.495168
  0.093228 1.351308 0.523155 0.654642 0.002695 0.755928
  -0.000001 1.823368 0.000001 -0.016833 0.597637 -0.308702
  0.286575 1.006395 -0.107106 0.024718 0.598347 -0.059182
  -0.000001 0.249956 0.000001 -0.029444 -0.012158 -0.324088
  -0.000000 0.254363 0.000000 -0.076056 0.173004 -0.419948
  0.120542 0.102358 -0.183665 0.007262 -0.621712 0.355034
  -0.000001 0.445151 -0.000000 0.209484 -0.024503 0.024136
  0.000001 0.302323 -0.000000 -0.249735 0.522770 0.319399
  0.073565 1.013167 -0.024131 0.021289 -0.812610 0.006544
  -0.000000 0.266205 0.000000 0.056270 0.004782 0.582489
  -0.000000 0.229739 -0.000000 -0.022490 0.184744 0.188471
  -0.127263 1.003841 0.060606 0.076595 -0.797044 0.046930
  0.000000 0.246799 -0.000000 -0.008496 -0.002390 0.639237
  0.000000 0.222126 -0.000000 -0.019048 0.249655 0.025259
  -0.358086 0.893699 0.063871 0.166012 -0.779819 0.119019
  0.000000 0.221431 0.000001 -0.065098 0.003527 0.301323
  0.000000 0.154458 0.000000 0.132182 0.263737 0.315351
  -0.810392 0.550812 -0.372493 -0.705435 0.237583 -0.187617
  -0.000000 3.626384 -0.000000 -0.931828 0.000899 0.031116
  0.782400 0.551416 -0.372918 -0.664498 -0.152438 0.177955
  -0.000000 3.626384 0.000001 -0.887546 -0.008339 -0.027826
  -0.204726 4.194569 0.876844 -0.391660 0.392671 -0.831965
  -0.090614 0.138320 1.006144 0.932179 -0.003080 0.063956
  -0.090614 0.138320 1.006144 -0.719370 -0.012904 -0.018721
  1.706569 4.245831 -1.037302 0.622282 -0.233205 -0.702237
  -0.005721 0.138319 -1.010200 -0.038175 -0.726699 0.684995
  -0.005721 0.138319 -1.010200 -0.933333 0.005709 -0.010650
}

frame 2 {
  -0.000000 0.000000 -0.001428 -0.707107 -0.000000 -0.000000
  0.309123 6.259968 -0.106869 -0.016484 -0.545893 -0.041650
  0.000000 1.240110 0.000000 -0.003550 0.005033 -0.024986
  -0.000000 1.426177 -0.000000 -0.190391 -0.001697 0.036683
  -0.000000 1.821085 0.000000 -0.079815 -0.210263 -0.087865
  0.000001 0.808123 -0.000000 0.001844 -0.515148 -0.857099
  -0.044147 0.766295 0.024775 0.028774 0.015029 0.059886
  -0.003137 0.224357 0.163703 -0.582226 0.395844 0.586146
  -0.259540 0.557512 -0.217253 0.908734 -0.391261 0.079654
  0.000000 0.017501 -0.000000 0.770325 -0.176579 -0.241567
  -0.000000 0.135389 0.000001 0.091586 -0.091856 0.215620
  0.000000 0.113741 -0.000001 -0.169580 -0.057486 0.171293
  0.000000 0.113741 -0.000002 -0.031710 -0.027261 0.230141
  0.262165 0.811893 0.662538 0.043770 0.841914 0.536468
  -0.244068 0.811856 0.663658 0.056033 0.840833 0.536149
  0.224683 0.261799 0.775027 0.032714 -0.687786 0.235096
  -0.000000 0.017499 0.000000 0.701728 -0.201293 -0.218089
  -0.000000 0.145787 0.000002 0.149683 -0.034740 0.190036
  0.000000 0.112094 0.000001 -0.061934 -0.085805 0.231494
  -0.000000 0.111594 0.000001 0.020835 -0.062799 0.226091
  0.365934 0.793584 0.683419 0.046999 0.705543 -0.046999
  -0.000000 0.011231 0.000000 0.125929 0.784490 0.580787
  -0.000000 0.112704 -0.000000 0.249011 -0.023435 0.387489
  0.360328 0.777493 0.684141 0.046999 0.705543 -0.046999
  -0.000000 0.010074 0.000000 -0.099297 0.457444 0.813064
  0.000000 0.108887 -0.000000 -0.431278 0.352682 0.307499
  -0.136625 0.803881 0.692455 0.046999 0.705543 -0.046999
  -0.000000 0.011232 0.000000 0.008116 0.734518 0.661912
  -0.000000 0.131865 0.000001 0.074830 -0.111354 0.374303
  -0.136810 0.780376 0.690931 0.046999 0.705543 -0.046999
  0.000000 0.010075 0.000000 0.085674 0.632970 0.750676
  -0.000000 0.128465 -0.000001 -0.197792 -0.107108 0.371252
  -0.002194 0.809024 0.000794 0.040325 0.000217 -0.001349
  -0.014833 1.825302 -0.071422 0.467192 -0.533469 -0.463268
  -0.000000 1.493901 0.000001 0.045435 0.664153 -0.653764
  -0.000000 2.103017 0.000000 -0.804983 0.032649 0.390801
  -0.000000 1.823368 -0.000000 0.265412 0.409078 -0.204367
  0.288926 0.945606 -0.016980 -0.051801 -0.682661 -0.029439
  -0.000001 0.310931 0.000002 0.000222 -0.001467 -0.002344
  0.000000 0.255058 -0.000000 -0.029947 -0.071881 -0.099380
  0.182656 0.102358 0.122067 -0.147852 0.530651 0.238827
  0.000000 0.450618 0.000000 -0.220865 -0.001969 -0.022288
  -0.000000 0.295730 -0.000001 0.098891 0.156044 -0.150716
  0.586576 1.443575 0.291630 0.494772 0.504178 0.517254
  0.081676 0.956432 -0.018380 -0.233363 -0.644845 -0.350975
  0.000000 0.323706 0.000000 0.060370 -0.029317 -0.532435
  0.000000 0.229678 -0.000001 0.030202 0.093428 -0.398752
  -0.151893 0.951490 -0.015787 -0.308143 -0.644031 -0.377207
  0.000000 0.298947 0.000001 0.096359 -0.030555 -0.429282
  -0.000000 0.222753 -0.000001 0.006295 0.070136 -0.362109
  -0.332551 0.872253 0.059175 -0.391523 -0.056805 -0.073509
  0.000000 0.247823 -0.000000 -0.417933 0.003177 -0.041819
  0.000001 0.155400 0.000000 -0.503623 -0.045865 -0.036042
  0.531378 1.351308 -0.004340 0.015880 0.004072 0.999865
  0.002183 1.423121 -0.451181 0.675237 0.001866 -0.002772
  0.014634 1.825498 -0.071451 0.412498 0.526770 0.570432
  0.000001 1.493901 -0.000000 0.479962 0.327214 0.467713
  -0.000002 2.103014 0.000003 0.021239 0.447373 0.503610
  0.093227 1.351308 0.523155 0.654640 0.002695 0.755930
  -0.000000 1.823369 -0.000000 -0.019194 0.572187 -0.328535
  0.286576 1.006395 -0.107109 0.024699 0.598347 -0.059153
  0.000002 0.249955 0.000000 -0.029453 -0.012157 -0.324167
  0.000000 0.254363 -0.000000 -0.076040 0.172999 -0.419905
  0.120542 0.102358 -0.183669 0.007231 -0.621695 0.355062
  -0.000000 0.445150 0.000001 0.209599 -0.024502 0.024153
  -0.000001 0.302323 0.000000 -0.249802 0.522741 0.319426
  0.073565 1.013166 -0.024133 0.021290 -0.812610 0.006544
  0.000001 0.266205 0.000001 0.056275 0.004782 0.582511
  0.000000 0.229739 -0.000000 -0.022502 0.184735 0.188445
  -0.127263 1.003840 0.060604 0.076599 -0.797045 0.046931
  0.000000 0.246800 -0.000001 -0.008491 -0.002390 0.639251
  0.000000 0.222126 -0.000000 -0.019059 0.249645 0.025239
  -0.358086 0.893698 0.063867 0.166009 -0.779822 0.119007
  0.000000 0.221431 0.000000 -0.065101 0.003527 0.301375
  -0.000001 0.154458 0.000000 0.132167 0.263733 0.315313
  -0.810392 0.550812 -0.372493 -0.728910 0.237288 -0.190746
  0.000000 3.626385 0.000001 -0.918823 0.000978 0.030682
  0.782400 0.551416 -0.372917 -0.683392 -0.148694 0.164177
  0.000000 3.626384 -0.000001 -0.874235 -0.008790 -0.027409
  -0.292475 3.953318 0.904131 -0.390716 0.380364 -0.837979
  -0.090614 0.138319 1.006144 0.923513 -0.001629 0.063028
  -0.090614 0.138319 1.006144 -0.729842 -0.006659 -0.021102
  1.742736 4.003634 -1.071762 0.628859 -0.227206 -0.700384
  -0.005721 0.138319 -1.010200 -0.037398 -0.715175 0.697097
  -0.005721 0.138319 -1.010200 -0.924633 0.005280 -0.009736
}

frame 3 {
  -0.000000 0.000000 -0.001428 -0.707107 -0.000000 -0.000000
  0.309123 6.286122 -0.106869 -0.031087 -0.545283 -0.019237
  -0.000000 1.240109 0.000000 0.004334 0.003489 -0.031061
  0.000000 1.426178 -0.000000 -0.179531 -0.005777 0.026113
  0.000000 1.821084 -0.000000 -0.077397 -0.208270 -0.084411
  -0.000000 0.808122 0.000000 0.001844 -0.515148 -0.857099
  -0.044148 0.766294 0.024775 0.030712 0.015454 0.057958
  -0.003138 0.224357 0.163703 -0.582226 0.395844 0.586146
  -0.259541 0.557510 -0.217253 0.907792 -0.391542 0.082643
  0.000000 0.017501 -0.000000 0.772490 -0.175369 -0.241730
  -0.000000 0.135389 -0.000000 0.092718 -0.093533 0.214571
  0.000000 0.113741 -0.000002 -0.169204 -0.059453 0.171522
  0.000000 0.113741 -0.000000 -0.032591 -0.029427 0.230041
  0.262165 0.811896 0.662538 0.045827 0.840700 0.538067
  -0.244069 0.811858 0.663658 0.058171 0.839567 0.537728
  0.224683 0.261799 0.775026 0.028621 -0.687477 0.238142
  -0.000000 0.017499 0.000000 0.704424 -0.199618 -0.217894
  -0.000000 0.145787 0.000002 0.150376 -0.035831 0.188966
  -0.000000 0.112094 0.000000 -0.061035 -0.088427 0.231116
  0.000000 0.111595 -0.000000 0.019659 -0.065152 0.226437
  0.365934 0.793585 0.683419 0.046999 0.705543 -0.046999
  -0.000000 0.011232 0.000000 0.125929 0.784491 0.580787
  -0.000000 0.112704 0.000001 0.249011 -0.023435 0.387488
  0.360328 0.777494 0.684141 0.046999 0.705543 -0.046999
  -0.000001 0.010076 -0.000001 -0.099298 0.457441 0.813067
  0.000000 0.108887 -0.000000 -0.431283 0.352684 0.307498
  -0.136626 0.803881 0.692455 0.046999 0.705543 -0.046999
  0.000000 0.011231 -0.000000 0.009112 0.734745 0.661896
  -0.000000 0.131865 -0.000001 0.074429 -0.115114 0.374386
  -0.136810 0.780378 0.690930 0.046999 0.705543 -0.046999
  0.000000 0.010076 -0.000001 0.087427 0.633362 0.750473
  0.000000 0.128464 -0.000000 -0.197600 -0.110850 0.371353
  -0.002196 0.809024 0.000794 0.040325 0.000217 -0.001349
  -0.014833 1.825302 -0.071422 0.467192 -0.533469 -0.463268
  0.000000 1.493901 0.000001 0.086918 0.646388 -0.673974
  -0.000001 2.103017 0.000000 -0.798680 0.033657 0.387741
  0.000000 1.823368 0.000001 0.230265 0.436711 -0.225615
  0.288927 0.945606 -0.016979 -0.051818 -0.682661 -0.029442
  -0.000000 0.310931 0.000002 0.000222 -0.001468 -0.002344
  -0.000000 0.255058 -0.000001 -0.029937 -0.071881 -0.099364
  0.182656 0.102358 0.122067 -0.147932 0.530677 0.238761
  -0.000000 0.450618 -0.000001 -0.220581 -0.001968 -0.022255
  -0.000000 0.295730 0.000001 0.098709 0.156073 -0.150713
  0.586576 1.443575 0.291631 0.494772 0.504178 0.517254
  0.081675 0.956432 -0.018380 -0.233378 -0.644851 -0.350970
  -0.000000 0.323706 0.000000 0.060354 -0.029323 -0.532350
  0.000000 0.229678 0.000001 0.030215 0.093406 -0.398837
  -0.151894 0.951490 -0.015787 -0.308158 -0.644029 -0.377212
  0.000000 0.298947 -0.000001 0.096330 -0.030559 -0.429173
  0.000000 0.222753 -0.000001 0.006319 0.070115 -0.362206
  -0.332552 0.872253 0.059175 -0.391568 -0.056815 -0.073497
  -0.000000 0.247823 0.000000 -0.417734 0.003176 -0.041785
  0.000000 0.155400 -0.000000 -0.503767 -0.045893 -0.036077
  0.531378 1.351308 -0.004340 0.015878 0.004074 0.999866
  0.002183 1.423120 -0.451181 0.675237 0.001866 -0.002772
  0.014634 1.825497 -0.071451 0.396761 0.535836 0.585465
  -0.000000 1.493901 0.000001 0.514145 0.349895 0.424457
  0.000000 2.103017 0.000000 0.021594 0.444795 0.512032
  0.093227 1.351308 0.523155 0.654643 0.002695 0.755927
  0.000000 1.823368 0.000000 -0.019678 0.544166 -0.351303
  0.286576 1.006396 -0.107107 0.024672 0.598348 -0.059113
  -0.000000 0.249956 0.000000 -0.029466 -0.012157 -0.324280
  -0.000001 0.254364 -0.000000 -0.076017 0.172996 -0.419842
  0.120542 0.102359 -0.183667 0.007195 -0.621676 0.355096
  0.000001 0.445151 -0.000001 0.209734 -0.024501 0.024176
  -0.000001 0.302324 0.000000 -0.249882 0.522707 0.319451
  0.073565 1.013168 -0.024131 0.021284 -0.812612 0.006538
  -0.000000 0.266205 -0.000000 0.056284 0.004781 0.582556
  0.000000 0.229739 -0.000000 -0.022522 0.184725 0.188399
  -0.127263 1.003841 0.060605 0.076604 -0.797046 0.046932
  0.000000 0.246801 0.000000 -0.008482 -0.002390 0.639281
  -0.000000 0.222126 -0.000000 -0.019080 0.249632 0.025197
  -0.358085 0.893699 0.063870 0.165970 -0.779836 0.118951
  -0.000000 0.221431 0.000000 -0.065135 0.003526 0.301575
  0.000001 0.154459 0.000000 0.132144 0.263748 0.315175
  -0.810392 0.550811 -0.372493 -0.761756 0.230966 -0.194602
  0.000000 3.626384 0.000000 -0.893361 0.001115 0.029832
  0.782400 0.551416 -0.372917 -0.713700 -0.141526 0.136677
  0.000000 3.626383 -0.000000 -0.848661 -0.009580 -0.026607
  -0.428634 3.574853 0.950232 -0.388995 0.360104 -0.847394
  -0.090614 0.138320 1.006144 0.908172 0.000752 0.061430
  -0.090614 0.138320 1.006144 -0.746508 0.003542 -0.024977
  1.801942 3.618640 -1.127892 0.639417 -0.217379 -0.697195
  -0.005721 0.138319 -1.010200 -0.036111 -0.695928 0.716438
  -0.005721 0.138319 -1.010200 -0.909255 0.004571 -0.008226
}

frame 4 {
  -0.000000 0.000000 -0.001428 -0.707107 -0.000000 -0.000000
  0.309123 6.313889 -0.106869 -0.045113 -0.544290 0.002330
  -0.000000 1.240111 -0.000000 0.012796 0.002063 -0.036838
  0.000000 1.426178 -0.000000 -0.171044 -0.008953 0.017879
  0.000000 1.821084 0.000000 -0.074230 -0.205655 -0.079889
  0.000001 0.808123 -0.000000 0.001844 -0.515148 -0.857099
  -0.044148 0.766294 0.024775 0.033247 0.016010 0.055436
  -0.003137 0.224358 0.163703 -0.582226 0.395844 0.586146
  -0.259543 0.557510 -0.217253 0.907436 -0.391298 0.086136
  0.000000 0.017501 -0.000000 0.774280 -0.173413 -0.240082
  0.000000 0.135389 -0.000001 0.092945 -0.094519 0.214257
  -0.000000 0.113741 0.000000 -0.169266 -0.060282 0.171383
  -0.000000 0.113741 0.000001 -0.033311 -0.030293 0.229952
  0.262165 0.811895 0.662538 0.048932 0.839888 0.538851
  -0.244069 0.811857 0.663659 0.061355 0.838680 0.538487
  0.224683 0.261800 0.775027 0.026667 -0.688816 0.240119
  -0.000000 0.017499 0.000000 0.706418 -0.197340 -0.216338
  0.000000 0.145787 -0.000001 0.150477 -0.036477 0.188671
  0.000000 0.112094 0.000000 -0.061006 -0.089656 0.230902
  0.000000 0.111594 -0.000000 0.018849 -0.066082 0.226610
  0.365935 0.793586 0.683418 0.046999 0.705543 -0.046999
  -0.000000 0.011233 -0.000000 0.125930 0.784488 0.580790
  0.000000 0.112704 -0.000001 0.249007 -0.023434 0.387487
  0.360328 0.777494 0.684141 0.046999 0.705543 -0.046999
  -0.000000 0.010074 -0.000000 -0.099297 0.457444 0.813065
  0.000000 0.108887 -0.000001 -0.431279 0.352681 0.307499
  -0.136625 0.803883 0.692454 0.046999 0.705543 -0.046999
  -0.000000 0.011233 0.000000 0.009098 0.734738 0.661900
  0.000000 0.131865 0.000000 0.073721 -0.116793 0.374524
  -0.136810 0.780378 0.690930 0.046999 0.705543 -0.046999
  -0.000000 0.010074 -0.000000 0.087662 0.633415 0.750445
  0.000000 0.128464 -0.000001 -0.198039 -0.112473 0.371122
  -0.002195 0.809023 0.000794 0.040325 0.000217 -0.001349
  -0.014832 1.825302 -0.071422 0.467192 -0.533469 -0.463268
  0.000000 1.493901 -0.000001 0.112576 0.635245 -0.684875
  -0.000001 2.103017 0.000001 -0.793495 0.034458 0.385224
  -0.000000 1.823368 -0.000000 0.209189 0.453351 -0.238331
  0.288928 0.945606 -0.016980 -0.051831 -0.682662 -0.029436
  -0.000000 0.310931 -0.000001 0.000221 -0.001469 -0.002344
  0.000000 0.255058 0.000001 -0.029924 -0.071880 -0.099357
  0.182658 0.102358 0.122067 -0.147988 0.530697 0.238709
  0.000000 0.450618 -0.000000 -0.220362 -0.001967 -0.022230
  0.000000 0.295730 0.000001 0.098566 0.156097 -0.150704
  0.586577 1.443575 0.291630 0.494772 0.504178 0.517254
  0.081678 0.956432 -0.018381 -0.233385 -0.644859 -0.350955
  -0.000000 0.323706 0.000000 0.060341 -0.029327 -0.532300
  -0.000000 0.229679 0.000000 0.030226 0.093383 -0.398897
  -0.151893 0.951490 -0.015788 -0.308166 -0.644034 -0.377201
  0.000000 0.298947 0.000000 0.096310 -0.030561 -0.429112
  0.000000 0.222754 0.000002 0.006341 0.070092 -0.362272
  -0.332550 0.872253 0.059175 -0.391587 -0.056825 -0.073482
  -0.000001 0.247823 0.000000 -0.417603 0.003175 -0.041757
  0.000000 0.155400 -0.000000 -0.503870 -0.045924 -0.036107
  0.531379 1.351308 -0.004340 0.015910 0.004089 0.999865
  0.002183 1.423120 -0.451181 0.675237 0.001866 -0.002772
  0.014634 1.825497 -0.071451 0.384295 0.542601 0.596847
  0.000000 1.493901 -0.000002 0.535569 0.367497 0.390564
  -0.000000 2.103018 -0.000000 0.021789 0.443356 0.516655
  0.093228 1.351308 0.523155 0.654643 0.002695 0.755927
  0.000001 1.823369 0.000000 -0.018292 0.525483 -0.367265
  0.286577 1.006395 -0.107109 0.024662 0.598348 -0.059098
  0.000001 0.249956 -0.000000 -0.029471 -0.012157 -0.324325
  0.000000 0.254364 -0.000000 -0.076007 0.172994 -0.419816
  0.120542 0.102358 -0.183668 0.007181 -0.621668 0.355110
  0.000002 0.445150 0.000000 0.209791 -0.024500 0.024185
  -0.000001 0.302324 -0.000000 -0.249916 0.522692 0.319462
  0.073565 1.013167 -0.024133 0.021280 -0.812612 0.006534
  0.000000 0.266204 -0.000000 0.056288 0.004781 0.582576
  -0.000000 0.229740 0.000000 -0.022531 0.184721 0.188380
  -0.127263 1.003840 0.060603 0.076604 -0.797047 0.046931
  0.000000 0.246800 0.000000 -0.008478 -0.002390 0.639295
  0.000000 0.222126 -0.000001 -0.019088 0.249627 0.025180
  -0.358085 0.893698 0.063868 0.165962 -0.779840 0.118939
  -0.000000 0.221431 -0.000001 -0.065142 0.003526 0.301620
  0.000000 0.154458 0.000000 0.132137 0.263750 0.315144
  -0.810392 0.550812 -0.372493 -0.800228 0.216997 -0.194016
  0.000000 3.626385 0.000001 -0.851577 0.001301 0.028437
  0.782400 0.551417 -0.372917 -0.753727 -0.130985 0.097228
  0.000000 3.626384 0.000000 -0.806543 -0.010710 -0.025287
  -0.600083 3.093907 1.012287 -0.386390 0.333192 -0.858999
  -0.090614 0.138319 1.006144 0.885811 0.003893 0.059177
  -0.090614 0.138319 1.006144 -0.767570 0.016941 -0.030040
  1.879730 3.124339 -1.201390 0.652956 -0.204402 -0.692695
  -0.005721 0.138320 -1.010200 -0.034378 -0.669850 0.741033
  -0.005721 0.138320 -1.010200 -0.886880 0.003624 -0.006213
}

frame 5 {
  -0.000000 0.000000 -0.001428 -0.707107 -0.000000 -0.000000
  0.309123 6.337190 -0.106869 -0.054936 -0.543323 0.017449
  0.000000 1.240110 -0.000000 0.020019 0.001150 -0.040790
  -0.000000 1.426178 0.000000 -0.168026 -0.010080 0.014956
  0.000000 1.821083 -0.000000 -0.070640 -0.202683 -0.074762
  -0.000000 0.808121 0.000001 0.001844 -0.515148 -0.857099
  -0.044148 0.766294 0.024775 0.036118 0.016639 0.052578
  -0.003137 0.224357 0.163703 -0.582226 0.395844 0.586146
  -0.259541 0.557511 -0.217253 0.907998 -0.390528 0.089071
  0.000000 0.017501 -0.000000 0.774836 -0.171117 -0.236445
  0.000000 0.135389 0.000000 0.091874 -0.094123 0.215065
  0.000000 0.113742 0.000000 -0.169872 -0.059201 0.170825
  -0.000000 0.113741 0.000001 -0.033465 -0.029033 0.229924
  0.262165 0.811893 0.662538 0.052402 0.839794 0.538421
  -0.244068 0.811857 0.663658 0.064881 0.838502 0.538035
  0.224683 0.261799 0.775026 0.028360 -0.692026 0.239775
  -0.000000 0.017499 -0.000000 0.706642 -0.195018 -0.213381
  -0.000000 0.145787 0.000001 0.149755 -0.036239 0.189534
  0.000000 0.112094 -0.000001 -0.062147 -0.088448 0.231006
  -0.000000 0.111594 0.000001 0.018928 -0.064676 0.226482
  0.365935 0.793585 0.683418 0.046999 0.705543 -0.046999
  -0.000000 0.011230 0.000000 0.125931 0.784488 0.580789
  -0.000000 0.112704 -0.000001 0.249008 -0.023434 0.387490
  0.360328 0.777494 0.684141 0.046999 0.705543 -0.046999
  0.000000 0.010075 0.000000 -0.099298 0.457441 0.813068
  0.000000 0.108888 -0.000001 -0.431286 0.352685 0.307496
  -0.136625 0.803882 0.692454 0.046999 0.705543 -0.046999
  0.000000 0.011232 -0.000000 0.007760 0.734439 0.661914
  -0.000000 0.131865 -0.000000 0.072987 -0.114905 0.374668
  -0.136810 0.780377 0.690930 0.046999 0.705543 -0.046999
  0.000000 0.010077 0.000000 0.085772 0.632994 0.750663
  0.000000 0.128464 -0.000000 -0.199096 -0.110509 0.370555
  -0.002195 0.809022 0.000794 0.040325 0.000217 -0.001349
  -0.014832 1.825303 -0.071422 0.467192 -0.533469 -0.463268
  -0.000000 1.493901 0.000001 0.122228 0.630708 -0.688804
  -0.000001 2.103017 0.000000 -0.791595 0.034746 0.384302
  -0.000000 1.823369 -0.000001 0.201334 0.459698 -0.243059
  0.288927 0.945606 -0.016980 -0.051835 -0.682662 -0.029436
  0.000000 0.310931 0.000001 0.000221 -0.001469 -0.002343
  -0.000000 0.255058 -0.000002 -0.029921 -0.071880 -0.099354
  0.182656 0.102358 0.122067 -0.148010 0.530704 0.238690
  -0.000001 0.450618 0.000001 -0.220284 -0.001967 -0.022222
  -0.000000 0.295730 0.000000 0.098517 0.156106 -0.150701
  0.586576 1.443575 0.291630 0.494772 0.504178 0.517254
  0.081677 0.956433 -0.018380 -0.233387 -0.644861 -0.350952
  0.000000 0.323706 0.000001 0.060337 -0.029328 -0.532279
  0.000001 0.229678 -0.000000 0.030229 0.093377 -0.398921
  -0.151894 0.951491 -0.015787 -0.308167 -0.644035 -0.377201
  0.000000 0.298947 -0.000000 0.096303 -0.030562 -0.429085
  -0.000000 0.222753 -0.000000 0.006347 0.070087 -0.362300
  -0.332553 0.872254 0.059175 -0.391596 -0.056828 -0.073478
  0.000001 0.247823 0.000000 -0.417552 0.003175 -0.041747
  -0.000001 0.155400 0.000000 -0.503910 -0.045933 -0.036118
  0.531378 1.351309 -0.004341 0.015870 0.004096 0.999866
  0.002183 1.423120 -0.451181 0.675237 0.001866 -0.002772
  0.014634 1.825496 -0.071451 0.379829 0.544939 0.600816
  -0.000001 1.493901 0.000001 0.542524 0.374111 0.378416
  0.000000 2.103016 0.000001 0.021840 0.442973 0.517877
  0.093228 1.351308 0.523154 0.654643 0.002695 0.755927
  0.000001 1.823368 -0.000000 -0.017537 0.518899 -0.372906
  0.286577 1.006396 -0.107107 0.024661 0.598348 -0.059097
  -0.000001 0.249956 0.000001 -0.029472 -0.012157 -0.324323
  0.000000 0.254363 0.000001 -0.076007 0.172993 -0.419819
  0.120543 0.102359 -0.183666 0.007180 -0.621668 0.355110
  0.000000 0.445151 0.000001 0.209793 -0.024500 0.024185
  -0.000000 0.302323 0.000000 -0.249917 0.522691 0.319465
  0.073566 1.013167 -0.024133 0.021281 -0.812613 0.006535
  0.000001 0.266205 0.000000 0.056289 0.004781 0.582572
  -0.000000 0.229740 0.000000 -0.022531 0.184719 0.188384
  -0.127262 1.003841 0.060605 0.076603 -0.797047 0.046930
  0.000000 0.246800 -0.000000 -0.008476 -0.002390 0.639292
  0.000000 0.222127 -0.000000 -0.019089 0.249625 0.025185
  -0.358085 0.893699 0.063869 0.165964 -0.779840 0.118940
  0.000001 0.221430 -0.000000 -0.065138 0.003526 0.301609
  0.000000 0.154458 0.000000 0.132135 0.263746 0.315154
  -0.810392 0.550812 -0.372493 -0.841554 0.197425 -0.184131
  -0.000000 3.626384 0.000000 -0.790553 0.001521 0.026399
  0.782400 0.551416 -0.372917 -0.798391 -0.119635 0.058387
  -0.000000 3.626384 0.000001 -0.744193 -0.012105 -0.023332
  -0.790167 2.557846 1.083673 -0.382957 0.302227 -0.871123
  -0.090614 0.138320 1.006144 0.857472 0.007460 0.056419
  -0.090614 0.138320 1.006144 -0.790317 0.032138 -0.035745
  1.968040 2.570270 -1.284694 0.667897 -0.189555 -0.687151
  -0.005721 0.138319 -1.010200 -0.032355 -0.639175 0.767814
  -0.005721 0.138319 -1.010200 -0.858570 0.002534 -0.003899
}

frame 6 {
  -0.000000 0.000000 -0.001428 -0.707107 -0.000000 -0.000000
  0.309123 6.360491 -0.106869 -0.061943 -0.542505 0.028245
  0.000000 1.240110 0.000000 0.027421 0.000607 -0.043422
  -0.000000 1.426177 0.000000 -0.169481 -0.009221 0.017209
  0.000000 1.821083 0.000000 -0.067045 -0.199701 -0.069631
  0.000000 0.808122 -0.000000 0.001844 -0.515148 -0.857099
  -0.044148 0.766294 0.024775 0.038989 0.017268 0.049719
  -0.003138 0.224356 0.163703 -0.582226 0.395844 0.586146
  -0.259543 0.557510 -0.217253 0.909674 -0.388698 0.090830
  0.000000 0.017501 0.000000 0.774088 -0.168802 -0.231452
  0.000000 0.135389 0.000000 0.089335 -0.092436 0.217062
  0.000000 0.113742 -0.000001 -0.171143 -0.056207 0.169713
  -0.000000 0.113742 -0.000001 -0.033224 -0.025588 0.229934
  0.262165 0.811894 0.662537 0.055664 0.840779 0.536301
  -0.244069 0.811856 0.663657 0.068191 0.839405 0.535900
  0.224682 0.261798 0.775026 0.034153 -0.696524 0.237431
  -0.000000 0.017499 0.000000 0.705062 -0.193095 -0.209665
  0.000000 0.145787 0.000001 0.148084 -0.035170 0.191652
  -0.000000 0.112094 0.000001 -0.064652 -0.084833 0.231399
  -0.000000 0.111594 -0.000001 0.019739 -0.060885 0.226053
  0.365934 0.793584 0.683418 0.046999 0.705543 -0.046999
  -0.000001 0.011230 -0.000000 0.125930 0.784489 0.580788
  0.000000 0.112704 -0.000000 0.249007 -0.023434 0.387488
  0.360328 0.777494 0.684141 0.046999 0.705543 -0.046999
  0.000000 0.010075 0.000000 -0.099298 0.457443 0.813066
  0.000000 0.108887 0.000001 -0.431282 0.352683 0.307497
  -0.136626 0.803882 0.692454 0.046999 0.705543 -0.046999
  0.000000 0.011232 0.000000 0.004849 0.733771 0.661945
  0.000000 0.131865 -0.000000 0.071907 -0.109451 0.374875
  -0.136810 0.780377 0.690930 0.046999 0.705543 -0.046999
  0.000000 0.010077 0.000000 0.081480 0.632018 0.751141
  -0.000000 0.128464 -0.000001 -0.201046 -0.104957 0.369500
  -0.002195 0.809023 0.000794 0.040325 0.000217 -0.001349
  -0.014833 1.825301 -0.071422 0.467192 -0.533469 -0.463268
  -0.000000 1.493901 0.000001 0.119146 0.629502 -0.689137
  0.000000 2.103016 -0.000000 -0.793682 0.034430 0.385315
  0.000000 1.823368 0.000000 0.201858 0.459388 -0.240745
  0.288926 0.945606 -0.016980 -0.051832 -0.682661 -0.029441
  0.000000 0.310931 0.000001 0.000221 -0.001469 -0.002344
  -0.000000 0.255058 0.000001 -0.029927 -0.071880 -0.099353
  0.182655 0.102358 0.122067 -0.147990 0.530697 0.238711
  0.000001 0.450618 0.000000 -0.220366 -0.001968 -0.022230
  0.000000 0.295730 0.000001 0.098571 0.156095 -0.150708
  0.586575 1.443575 0.291630 0.494772 0.504178 0.517254
  0.081673 0.956433 -0.018380 -0.233389 -0.644856 -0.350963
  0.000000 0.323706 -0.000000 0.060341 -0.029327 -0.532288
  -0.000000 0.229678 -0.000000 0.030225 0.093386 -0.398901
  -0.151894 0.951490 -0.015787 -0.308170 -0.644029 -0.377211
  -0.000001 0.298947 0.000000 0.096308 -0.030561 -0.429096
  0.000000 0.222753 -0.000001 0.006340 0.070094 -0.362278
  -0.332554 0.872254 0.059175 -0.391599 -0.056824 -0.073483
  0.000001 0.247823 -0.000001 -0.417586 0.003175 -0.041756
  -0.000001 0.155400 0.000000 -0.503876 -0.045922 -0.036107
  0.531379 1.351309 -0.004340 0.015910 0.004086 0.999865
  0.002183 1.423120 -0.451181 0.675237 0.001866 -0.002772
  0.014634 1.825497 -0.071451 0.384295 0.542601 0.596846
  -0.000000 1.493901 0.000000 0.532697 0.367962 0.392535
  0.000000 2.103017 -0.000000 0.021900 0.442531 0.519280
  0.093228 1.351308 0.523154 0.654640 0.002695 0.755930
  0.000001 1.823368 0.000000 -0.020383 0.526526 -0.367380
  0.286576 1.006395 -0.107107 0.024660 0.598348 -0.059094
  0.000002 0.249956 0.000001 -0.029472 -0.012157 -0.324337
  0.000000 0.254364 -0.000000 -0.076005 0.172994 -0.419808
  0.120542 0.102358 -0.183668 0.007177 -0.621666 0.355114
  -0.000000 0.445151 -0.000000 0.209803 -0.024500 0.024188
  -0.000000 0.302323 -0.000000 -0.249923 0.522689 0.319465
  0.073565 1.013167 -0.024132 0.021281 -0.812613 0.006535
  0.000001 0.266205 -0.000001 0.056289 0.004781 0.582582
  -0.000000 0.229738 0.000000 -0.022534 0.184719 0.188373
  -0.127263 1.003840 0.060605 0.076607 -0.797047 0.046933
  0.000000 0.246801 0.000000 -0.008476 -0.002390 0.639297
  -0.000000 0.222127 0.000000 -0.019091 0.249624 0.025175
  -0.358085 0.893699 0.063868 0.165962 -0.779840 0.118937
  -0.000001 0.221430 0.000000 -0.065142 0.003526 0.301634
  0.000000 0.154458 0.000000 0.132133 0.263749 0.315133
  -0.810392 0.550811 -0.372493 -0.881648 0.173620 -0.164941
  0.000000 3.626384 0.000000 -0.708520 0.001753 0.023659
  0.782400 0.551416 -0.372917 -0.840483 -0.111571 0.035165
  0.000000 3.626384 0.000000 -0.659491 -0.013626 -0.020676
  -0.980251 2.021786 1.155060 -0.379027 0.270868 -0.882113
  -0.090614 0.138320 1.006144 0.826184 0.011001 0.053466
  -0.090614 0.138320 1.006144 -0.811771 0.047282 -0.041392
  2.056351 2.016201 -1.367999 0.682390 -0.174580 -0.681145
  -0.005721 0.138320 -1.010200 -0.030278 -0.607436 0.793315
  -0.005721 0.138320 -1.010200 -0.827357 0.001435 -0.001572
}

frame 7 {
  -0.000000 0.000000 -0.001428 -0.707107 -0.000000 -0.000000
  0.309123 6.388258 -0.106869 -0.068015 -0.541766 0.037617
  0.000000 1.240110 0.000000 0.036389 0.000224 -0.045478
  0.000000 1.426178 -0.000000 -0.173573 -0.006803 0.023553
  -0.000000 1.821084 0.000000 -0.063870 -0.197060 -0.065100
  -0.000000 0.808120 -0.000000 0.001844 -0.515148 -0.857099
  -0.044148 0.766293 0.024775 0.041523 0.017823 0.047194
  -0.003138 0.224356 0.163703 -0.582226 0.395844 0.586146
  -0.259539 0.557511 -0.217253 0.912384 -0.385470 0.091176
  0.000000 0.017501 -0.000000 0.772225 -0.166724 -0.225893
  -0.000000 0.135389 -0.000001 0.085435 -0.089746 0.220061
  0.000000 0.113742 -0.000001 -0.173044 -0.051716 0.168015
  0.000000 0.113741 -0.000001 -0.032842 -0.020321 0.229951
  0.262165 0.811894 0.662537 0.058307 0.842988 0.532324
  -0.244069 0.811857 0.663658 0.070887 0.841538 0.531922
  0.224683 0.261799 0.775027 0.043682 -0.701566 0.233790
  -0.000000 0.017499 0.000000 0.702026 -0.191850 -0.205877
  0.000000 0.145787 0.000000 0.145487 -0.033439 0.194854
  0.000000 0.112093 0.000000 -0.068461 -0.079313 0.231988
  -0.000001 0.111594 0.000000 0.020997 -0.055145 0.225377
  0.365934 0.793585 0.683419 0.046999 0.705543 -0.046999
  0.000000 0.011231 0.000000 0.125931 0.784487 0.580791
  0.000000 0.112704 -0.000002 0.249007 -0.023434 0.387487
  0.360328 0.777493 0.684141 0.046999 0.705543 -0.046999
  -0.000000 0.010075 0.000000 -0.099298 0.457442 0.813066
  0.000000 0.108888 0.000001 -0.431284 0.352683 0.307497
  -0.136625 0.803881 0.692455 0.046999 0.705543 -0.046999
  -0.000001 0.011232 -0.000000 0.000420 0.732732 0.661962
  0.000000 0.131865 -0.000000 0.070281 -0.101142 0.375185
  -0.136810 0.780376 0.690930 0.046999 0.705543 -0.046999
  -0.000000 0.010075 0.000000 0.075000 0.630508 0.751816
  -0.000000 0.128464 0.000002 -0.203966 -0.096549 0.367898
  -0.002195 0.809022 0.000794 0.040325 0.000217 -0.001349
  -0.014833 1.825301 -0.071422 0.467192 -0.533469 -0.463268
  -0.000000 1.493901 0.000000 0.105150 0.628800 -0.687656
  0.000000 2.103017 0.000000 -0.799287 0.033562 0.388036
  0.000001 1.823368 -0.000000 0.207981 0.454842 -0.231839
  0.288926 0.945606 -0.016980 -0.051823 -0.682660 -0.029448
  -0.000000 0.310931 -0.000001 0.000222 -0.001468 -0.002344
  0.000000 0.255058 -0.000001 -0.029938 -0.071881 -0.099355
  0.182655 0.102358 0.122067 -0.147935 0.530677 0.238767
  0.000000 0.450618 0.000001 -0.220590 -0.001969 -0.022254
  -0.000000 0.295730 0.000000 0.098716 0.156069 -0.150721
  0.586576 1.443575 0.291631 0.494772 0.504178 0.517254
  0.081676 0.956433 -0.018380 -0.233390 -0.644845 -0.350981
  -0.000000 0.323706 0.000001 0.060351 -0.029323 -0.532332
  0.000000 0.229678 -0.000000 0.030213 0.093404 -0.398840
  -0.151895 0.951491 -0.015787 -0.308172 -0.644020 -0.377227
  -0.000000 0.298947 -0.000001 0.096323 -0.030559 -0.429145
  0.000000 0.222753 0.000001 0.006322 0.070111 -0.362214
  -0.332553 0.872254 0.059175 -0.391590 -0.056815 -0.073499
  0.000001 0.247823 0.000000 -0.417707 0.003177 -0.041784
  -0.000001 0.155400 0.000000 -0.503771 -0.045891 -0.036076
  0.531379 1.351308 -0.004341 0.015867 0.004077 0.999866
  0.002183 1.423120 -0.451181 0.675237 0.001866 -0.002772
  0.014634 1.825497 -0.071451 0.396761 0.535836 0.585465
  0.000001 1.493901 -0.000002 0.498565 0.348978 0.432430
  -0.000000 2.103014 0.000001 0.021976 0.441954 0.521104
  0.093228 1.351309 0.523154 0.654644 0.002695 0.755926
  0.000002 1.823369 -0.000001 -0.026557 0.553133 -0.348525
  0.286576 1.006395 -0.107106 0.024651 0.598348 -0.059082
  -0.000001 0.249956 -0.000001 -0.029476 -0.012157 -0.324366
  0.000000 0.254362 -0.000000 -0.076000 0.172993 -0.419796
  0.120543 0.102359 -0.183666 0.007164 -0.621660 0.355124
  -0.000000 0.445150 0.000000 0.209844 -0.024500 0.024192
  -0.000000 0.302324 -0.000000 -0.249944 0.522680 0.319476
  0.073565 1.013167 -0.024131 0.021280 -0.812613 0.006533
  -0.000001 0.266205 -0.000000 0.056291 0.004781 0.582590
  0.000000 0.229740 0.000000 -0.022537 0.184717 0.188366
  -0.127262 1.003840 0.060606 0.076604 -0.797047 0.046930
  -0.000001 0.246800 -0.000001 -0.008475 -0.002390 0.639308
  0.000000 0.222126 -0.000000 -0.019095 0.249622 0.025166
  -0.358085 0.893699 0.063870 0.165949 -0.779844 0.118920
  0.000001 0.221430 0.000000 -0.065151 0.003526 0.301682
  -0.000000 0.154456 0.000000 0.132129 0.263753 0.315105
  -0.810392 0.550811 -0.372493 -0.916645 0.148498 -0.139114
  0.000000 3.626385 -0.000000 -0.607786 0.001974 0.020296
  0.782400 0.551416 -0.372917 -0.875884 -0.107824 0.034383
  0.000000 3.626385 0.000000 -0.555202 -0.015079 -0.017407
  -1.151699 1.540840 1.217114 -0.375156 0.242958 -0.890840
  -0.090614 0.138320 1.006144 0.796388 0.014078 0.050724
  -0.090614 0.138320 1.006144 -0.829559 0.060548 -0.046306
  2.134139 1.521900 -1.441497 0.694786 -0.161279 -0.675469
  -0.005721 0.138319 -1.010200 -0.028408 -0.578660 0.814668
  -0.005721 0.138319 -1.010200 -0.797658 0.000466 0.000474
}

frame 8 {
  -0.000000 0.000000 -0.001428 -0.707107 -0.000000 -0.000000
  0.309123 6.414411 -0.106869 -0.072385 -0.541226 0.044373
  0.000000 1.240109 0.000000 0.044921 0.000018 -0.046772
  -0.000000 1.426177 -0.000000 -0.178811 -0.003697 0.031698
  -0.000000 1.821082 0.000000 -0.061441 -0.195036 -0.061634
  0.000001 0.808121 -0.000000 0.001844 -0.515148 -0.857099
  -0.044147 0.766294 0.024775 0.043459 0.018247 0.045263
  -0.003138 0.224357 0.163702 -0.582226 0.395844 0.586146
  -0.259542 0.557510 -0.217253 0.915228 -0.381908 0.090475
  0.000000 0.017501 -0.000000 0.769734 -0.165199 -0.220876
  0.000000 0.135389 0.000001 0.081289 -0.086638 0.223189
  -0.000000 0.113742 0.000000 -0.174995 -0.046996 0.166256
  0.000000 0.113741 -0.000000 -0.032306 -0.014661 0.229983
  0.262165 0.811895 0.662538 0.060024 0.845597 0.527830
  -0.244069 0.811857 0.663658 0.072654 0.844091 0.527437
  0.224683 0.261800 0.775026 0.054183 -0.706154 0.229665
  -0.000000 0.017499 0.000000 0.698325 -0.191326 -0.202652
  0.000000 0.145787 -0.000000 0.142704 -0.031398 0.198221
  -0.000000 0.112094 -0.000000 -0.072435 -0.073351 0.232618
  0.000000 0.111594 -0.000000 0.022440 -0.049062 0.224617
  0.365934 0.793585 0.683418 0.046999 0.705543 -0.046999
  -0.000000 0.011230 0.000000 0.125931 0.784487 0.580791
  0.000000 0.112704 -0.000000 0.249007 -0.023434 0.387488
  0.360328 0.777494 0.684140 0.046999 0.705543 -0.046999
  -0.000000 0.010075 0.000000 -0.099298 0.457445 0.813064
  0.000001 0.108887 -0.000001 -0.431281 0.352681 0.307497
  -0.136625 0.803883 0.692454 0.046999 0.705543 -0.046999
  -0.000000 0.011232 0.000000 -0.004210 0.731612 0.661947
  -0.000000 0.131865 -0.000000 0.068688 -0.092217 0.375479
  -0.136810 0.780377 0.690930 0.046999 0.705543 -0.046999
  -0.000000 0.010074 -0.000000 0.068265 0.628893 0.752456
  0.000000 0.128464 0.000002 -0.206896 -0.087591 0.366258
  -0.002195 0.809023 0.000794 0.040325 0.000217 -0.001349
  -0.014833 1.825300 -0.071422 0.467192 -0.533469 -0.463268
  0.000000 1.493901 0.000001 0.084473 0.628052 -0.684496
  -0.000000 2.103016 0.000000 -0.805906 0.032499 0.391250
  0.000000 1.823369 -0.000001 0.218401 0.447495 -0.219556
  0.288929 0.945605 -0.016979 -0.051814 -0.682659 -0.029453
  0.000000 0.310931 0.000000 0.000222 -0.001467 -0.002344
  0.000000 0.255058 -0.000000 -0.029948 -0.071881 -0.099360
  0.182659 0.102358 0.122067 -0.147869 0.530653 0.238831
  0.000000 0.450617 0.000000 -0.220851 -0.001970 -0.022283
  -0.000000 0.295730 0.000001 0.098886 0.156039 -0.150734
  0.586578 1.443575 0.291630 0.494772 0.504178 0.517254
  0.081678 0.956432 -0.018380 -0.233388 -0.644833 -0.351004
  0.000000 0.323706 -0.000002 0.060365 -0.029318 -0.532381
  -0.000000 0.229678 0.000000 0.030200 0.093430 -0.398771
  -0.151892 0.951490 -0.015787 -0.308170 -0.644011 -0.377243
  -0.000001 0.298947 -0.000002 0.096343 -0.030556 -0.429206
  -0.000000 0.222754 0.000000 0.006299 0.070133 -0.362140
  -0.332551 0.872253 0.059175 -0.391577 -0.056805 -0.073514
  -0.000000 0.247823 0.000000 -0.417850 0.003178 -0.041813
  0.000001 0.155400 0.000000 -0.503650 -0.045860 -0.036042
  0.531378 1.351308 -0.004341 0.015908 0.004114 0.999865
  0.002183 1.423120 -0.451181 0.675237 0.001866 -0.002772
  0.014634 1.825496 -0.071451 0.412498 0.526770 0.570432
  0.000001 1.493901 -0.000002 0.439897 0.321783 0.482369
  0.000000 2.103017 -0.000001 0.021889 0.442609 0.519031
  0.093229 1.351309 0.523154 0.654646 0.002695 0.755924
  0.000001 1.823369 -0.000000 -0.030281 0.597536 -0.317361
  0.286576 1.006395 -0.107109 0.024652 0.598348 -0.059080
  0.000002 0.249956 0.000001 -0.029475 -0.012157 -0.324366
  0.000000 0.254363 -0.000000 -0.076002 0.172996 -0.419795
  0.120541 0.102358 -0.183671 0.007171 -0.621662 0.355120
  -0.000000 0.445150 -0.000000 0.209821 -0.024500 0.024191
  0.000000 0.302324 0.000000 -0.249931 0.522687 0.319465
  0.073564 1.013167 -0.024135 0.021275 -0.812613 0.006531
  0.000000 0.266206 -0.000000 0.056290 0.004781 0.582595
  -0.000000 0.229740 0.000001 -0.022536 0.184720 0.188364
  -0.127263 1.003841 0.060602 0.076604 -0.797047 0.046931
  0.000001 0.246800 -0.000000 -0.008478 -0.002390 0.639310
  -0.000000 0.222127 -0.000000 -0.019093 0.249627 0.025161
  -0.358086 0.893699 0.063866 0.165949 -0.779844 0.118922
  0.000001 0.221431 -0.000000 -0.065154 0.003526 0.301687
  -0.000000 0.154458 0.000000 0.132131 0.263758 0.315098
  -0.810392 0.550812 -0.372493 -0.943726 0.127805 -0.111617
  0.000000 3.626384 0.000000 -0.500248 0.002152 0.016705
  0.782400 0.551416 -0.372917 -0.904503 -0.104923 0.043636
  0.000000 3.626384 -0.000000 -0.442144 -0.016263 -0.013862
  -1.287859 1.162375 1.263215 -0.371953 0.221529 -0.896885
  -0.090614 0.138320 1.006144 0.772409 0.016384 0.048558
  -0.090614 0.138320 1.006144 -0.842394 0.070594 -0.050008
  2.193346 1.136905 -1.497627 0.704002 -0.151072 -0.670899
  -0.005721 0.138320 -1.010200 -0.026961 -0.556256 0.830217
  -0.005721 0.138320 -1.010200 -0.773771 -0.000268 0.002023
}

frame 9 {
  -0.000000 0.000000 -0.001428 -0.707107 -0.000000 -0.000000
  0.309123 6.431823 -0.106869 -0.074722 -0.540943 0.047992
  -0.000000 1.240110 -0.000000 0.050636 -0.000052 -0.047361
  0.000000 1.426178 -0.000000 -0.182877 -0.001279 0.038037
  0.000000 1.821083 -0.000000 -0.059947 -0.193790 -0.059502
  0.000000 0.808122 -0.000001 0.001844 -0.515148 -0.857099
  -0.044148 0.766294 0.024775 0.044650 0.018508 0.044076
  -0.003138 0.224357 0.163703 -0.582226 0.395844 0.586146
  -0.259540 0.557512 -0.217253 0.917153 -0.379458 0.089625
  0.000000 0.017501 -0.000000 0.767647 -0.164351 -0.217526
  0.000000 0.135389 -0.000001 0.078373 -0.084200 0.225371
  -0.000000 0.113742 -0.000002 -0.176300 -0.043645 0.165071
  0.000000 0.113742 -0.000001 -0.031790 -0.010569 0.230023
  0.262165 0.811894 0.662537 0.060878 0.847453 0.524671
  -0.244069 0.811857 0.663659 0.073540 0.845916 0.524287
  0.224683 0.261799 0.775026 0.061785 -0.709243 0.226422
  -0.000000 0.017499 0.000000 0.695385 -0.191221 -0.200541
  0.000000 0.145787 0.000001 0.140727 -0.029769 0.200579
  0.000000 0.112094 -0.000001 -0.075168 -0.068995 0.233092
  -0.000000 0.111594 0.000001 0.023600 -0.044722 0.224036
  0.365934 0.793584 0.683419 0.046999 0.705543 -0.046999
  0.000000 0.011232 -0.000000 0.125932 0.784490 0.580787
  0.000000 0.112704 -0.000001 0.249008 -0.023434 0.387491
  0.360328 0.777494 0.684141 0.046999 0.705543 -0.046999
  0.000000 0.010076 0.000000 -0.099298 0.457442 0.813066
  0.000000 0.108887 0.000000 -0.431284 0.352683 0.307497
  -0.136625 0.803882 0.692454 0.046999 0.705543 -0.046999
  -0.000000 0.011233 0.000000 -0.007389 0.730821 0.661919
  -0.000000 0.131865 0.000001 0.067721 -0.085742 0.375657
  -0.136810 0.780378 0.690930 0.046999 0.705543 -0.046999
  -0.000000 0.010077 -0.000000 0.063637 0.627751 0.752863
  0.000000 0.128464 0.000001 -0.208790 -0.081148 0.365183
  -0.002195 0.809023 0.000794 0.040325 0.000217 -0.001349
  -0.014833 1.825302 -0.071422 0.467192 -0.533469 -0.463268
  0.000001 1.493901 0.000000 0.066390 0.627439 -0.680902
  -0.000000 2.103017 -0.000000 -0.810622 0.031714 0.393539
  -0.000000 1.823369 0.000000 0.228498 0.440645 -0.209373
  0.288926 0.945606 -0.016980 -0.051803 -0.682660 -0.029447
  0.000000 0.310931 0.000000 0.000222 -0.001467 -0.002344
  0.000000 0.255058 0.000001 -0.029952 -0.071881 -0.099371
  0.182655 0.102358 0.122067 -0.147814 0.530635 0.238878
  -0.000000 0.450618 0.000001 -0.221043 -0.001971 -0.022305
  0.000000 0.295730 0.000001 0.099008 0.156018 -0.150742
  0.586576 1.443575 0.291630 0.494772 0.504178 0.517254
  0.081676 0.956433 -0.018380 -0.233380 -0.644831 -0.351005
  0.000000 0.323706 -0.000001 0.060375 -0.029314 -0.532444
  0.000000 0.229678 -0.000001 0.030192 0.093441 -0.398706
  -0.151893 0.951490 -0.015788 -0.308161 -0.644012 -0.377240
  -0.000000 0.298948 0.000001 0.096363 -0.030554 -0.429282
  0.000000 0.222753 -0.000000 0.006281 0.070148 -0.362068
  -0.332552 0.872254 0.059175 -0.391548 -0.056798 -0.073522
  -0.000001 0.247823 -0.000000 -0.417991 0.003178 -0.041837
  0.000000 0.155400 -0.000000 -0.503545 -0.045841 -0.036017
  0.531378 1.351308 -0.004341 0.015913 0.004104 0.999865
  0.002183 1.423120 -0.451181 0.675237 0.001866 -0.002772
  0.014634 1.825497 -0.071451 0.424524 0.519424 0.558419
  0.000001 1.493901 -0.000002 0.379868 0.297458 0.518682
  -0.000000 2.103016 -0.000001 0.021682 0.444145 0.514128
  0.093228 1.351308 0.523154 0.654643 0.002699 0.755927
  -0.000000 1.823368 -0.000000 -0.029264 0.641310 -0.286314
  0.286577 1.006395 -0.107106 0.024668 0.598348 -0.059104
  0.000001 0.249956 -0.000001 -0.029467 -0.012157 -0.324311
  0.000000 0.254363 0.000000 -0.076014 0.173000 -0.419824
  0.120542 0.102358 -0.183667 0.007183 -0.621669 0.355107
  0.000001 0.445150 0.000000 0.209766 -0.024501 0.024181
  -0.000000 0.302324 0.000000 -0.249895 0.522702 0.319456
  0.073565 1.013166 -0.024131 0.021279 -0.812612 0.006536
  0.000001 0.266204 -0.000001 0.056284 0.004781 0.582578
  0.000000 0.229739 -0.000001 -0.022526 0.184727 0.188381
  -0.127263 1.003840 0.060606 0.076605 -0.797046 0.046934
  -0.000001 0.246800 -0.000000 -0.008485 -0.002390 0.639295
  0.000000 0.222129 -0.000000 -0.019081 0.249635 0.025179
  -0.358086 0.893698 0.063870 0.165957 -0.779840 0.118936
  -0.000000 0.221431 0.000000 -0.065150 0.003526 0.301638
  -0.000000 0.154458 -0.000000 0.132143 0.263758 0.315133
  -0.810392 0.550811 -0.372493 -0.960681 0.115043 -0.090501
  0.000000 3.626384 -0.000000 -0.410150 0.002267 0.013696
  0.782400 0.551416 -0.372917 -0.924741 -0.101976 0.050060
  0.000000 3.626383 -0.000000 -0.344142 -0.017025 -0.010789
  -1.375608 0.921124 1.290502 -0.369882 0.208330 -0.900331
  -0.090614 0.138320 1.006144 0.757211 0.017777 0.047201
  -0.090614 0.138320 1.006144 -0.849951 0.076720 -0.052257
  2.229512 0.894709 -1.532087 0.709553 -0.144782 -0.667992
  -0.005721 0.138319 -1.010200 -0.026063 -0.542329 0.839434
  -0.005721 0.138319 -1.010200 -0.758634 -0.000716 0.002966
}

frame 10 {
  -0.000000 0.000000 -0.001428 -0.707107 -0.000000 -0.000000
  0.309123 6.437504 -0.106869 -0.075371 -0.540867 0.048998
  -0.000000 1.240110 -0.000000 0.052507 -0.000062 -0.047498
  -0.000000 1.426178 0.000000 -0.184318 -0.000420 0.040287
  0.000000 1.821082 -0.000000 -0.059450 -0.193375 -0.058793
  0.000000 0.808121 -0.000000 0.001844 -0.515148 -0.857099
  -0.044148 0.766293 0.024775 0.045046 0.018595 0.043682
  -0.003137 0.224358 0.163702 -0.582226 0.395844 0.586146
  -0.259541 0.557511 -0.217253 0.917771 -0.378686 0.089287
  0.000000 0.017501 -0.000000 0.766855 -0.164101 -0.216398
  0.000000 0.135389 0.000001 0.077406 -0.083308 0.226103
  -0.000000 0.113741 -0.000000 -0.176718 -0.042501 0.164695
  -0.000000 0.113742 -0.000001 -0.031558 -0.009163 0.230041
  0.262165 0.811894 0.662538 0.061119 0.848054 0.523650
  -0.244068 0.811857 0.663658 0.073789 0.846507 0.523269
  0.224683 0.261799 0.775026 0.064377 -0.710294 0.225210
  -0.000000 0.017499 0.000000 0.694299 -0.191224 -0.199823
  0.000000 0.145787 -0.000000 0.140073 -0.029166 0.201370
  0.000000 0.112094 0.000001 -0.076060 -0.067477 0.233263
  0.000000 0.111594 0.000001 0.024045 -0.043243 0.223826
  0.365935 0.793586 0.683418 0.046999 0.705543 -0.046999
  -0.000000 0.011232 0.000000 0.125932 0.784485 0.580794
  -0.000000 0.112704 0.000000 0.249001 -0.023430 0.387489
  0.360328 0.777494 0.684140 0.046999 0.705543 -0.046999
  -0.000000 0.010075 0.000000 -0.099297 0.457441 0.813067
  -0.000000 0.108887 0.000001 -0.431279 0.352683 0.307498
  -0.136625 0.803882 0.692455 0.046999 0.705543 -0.046999
  0.000000 0.011231 0.000000 -0.008426 0.730560 0.661906
  0.000000 0.131865 0.000000 0.067457 -0.083498 0.375702
  -0.136810 0.780378 0.690930 0.046999 0.705543 -0.046999
  -0.000001 0.010075 -0.000000 0.062122 0.627371 0.752991
  0.000000 0.128464 -0.000001 -0.209364 -0.078930 0.364853
  -0.002195 0.809022 0.000794 0.040325 0.000217 -0.001349
  -0.014832 1.825301 -0.071422 0.467192 -0.533469 -0.463268
  -0.000000 1.493901 0.000001 0.059428 0.627281 -0.679270
  0.000001 2.103014 -0.000000 -0.812206 0.031445 0.394308
  0.000001 1.823368 0.000001 0.232623 0.437869 -0.205557
  0.288927 0.945606 -0.016979 -0.051765 -0.682662 -0.029421
  0.000000 0.310930 0.000000 0.000222 -0.001467 -0.002344
  0.000000 0.255058 -0.000000 -0.029958 -0.071880 -0.099401
  0.182657 0.102358 0.122067 -0.147784 0.530629 0.238881
  -0.000000 0.450618 0.000000 -0.221108 -0.001969 -0.022316
  0.000000 0.295730 -0.000000 0.099052 0.156016 -0.150739
  0.586577 1.443575 0.291630 0.494772 0.504178 0.517254
  0.081676 0.956432 -0.018380 -0.233333 -0.644845 -0.350968
  -0.000000 0.323706 0.000003 0.060391 -0.029310 -0.532553
  0.000000 0.229678 -0.000001 0.030185 0.093456 -0.398630
  -0.151893 0.951489 -0.015787 -0.308112 -0.644040 -0.377191
  -0.000000 0.298947 -0.000003 0.096399 -0.030550 -0.429427
  -0.000000 0.222754 0.000001 0.006259 0.070167 -0.361974
  -0.332552 0.872253 0.059175 -0.391453 -0.056793 -0.073524
  -0.000001 0.247824 -0.000000 -0.418184 0.003178 -0.041860
  0.000001 0.155400 -0.000000 -0.503436 -0.045830 -0.035997
  0.531378 1.351308 -0.004339 0.015910 0.004093 0.999865
  0.002183 1.423120 -0.451181 0.675237 0.001866 -0.002772
  0.014634 1.825496 -0.071451 0.428741 0.516759 0.554093
  -0.000001 1.493901 0.000002 0.354925 0.287907 0.530634
  0.000001 2.103016 -0.000000 0.021581 0.444893 0.511717
  0.093228 1.351308 0.523154 0.654645 0.002695 0.755925
  -0.000001 1.823369 0.000001 -0.027938 0.658978 -0.273543
  0.286575 1.006395 -0.107108 0.024670 0.598348 -0.059105
  -0.000002 0.249956 -0.000001 -0.029465 -0.012157 -0.324299
  0.000001 0.254364 -0.000000 -0.076018 0.173001 -0.419832
  0.120541 0.102358 -0.183668 0.007188 -0.621672 0.355102
  -0.000002 0.445149 0.000000 0.209745 -0.024501 0.024177
  0.000000 0.302324 -0.000000 -0.249881 0.522709 0.319452
  0.073565 1.013167 -0.024132 0.021280 -0.812612 0.006536
  0.000001 0.266206 -0.000000 0.056283 0.004781 0.582570
  -0.000000 0.229739 0.000000 -0.022523 0.184729 0.188389
  -0.127263 1.003840 0.060605 0.076600 -0.797046 0.046930
  0.000000 0.246800 -0.000001 -0.008485 -0.002390 0.639297
  -0.000000 0.222128 -0.000001 -0.019080 0.249636 0.025184
  -0.358087 0.893698 0.063867 0.165953 -0.779840 0.118934
  -0.000001 0.221431 -0.000001 -0.065152 0.003526 0.301639
  0.000000 0.154458 0.000000 0.132146 0.263761 0.315136
  -0.810392 0.550811 -0.372493 -0.966435 0.110867 -0.082632
  -0.000000 3.626384 0.000000 -0.373016 0.002306 0.012456
  0.782400 0.551415 -0.372917 -0.932379 -0.100583 0.052530
  -0.000000 3.626385 -0.000000 -0.302329 -0.017285 -0.009478
  -1.406109 0.838118 1.299208 -0.369178 0.203943 -0.901430
  -0.090614 0.138320 1.006144 0.752092 0.018236 0.046746
  -0.090614 0.138320 1.006144 -0.852404 0.078746 -0.052999
  2.241435 0.812477 -1.543512 0.711378 -0.142690 -0.667010
  -0.005721 0.138320 -1.010200 -0.025764 -0.537679 0.842437
  -0.005721 0.138320 -1.010200 -0.753536 -0.000863 0.003278
}

