MD5Version 10 // Parameters used during export: Reorient: False; Scale: 1.0
commandline ""

numFrames 21
numJoints 27
frameRate 60
numAnimatedComponents 162

hierarchy {
  "origin" -1 63 0 //
  "chest" 0 63 6 //
  "tail" 1 63 12 //
  "leg0_upper" 1 63 18 //
  "leg0_lower" 3 63 24 //
  "leg5_upper" 1 63 30 //
  "leg5_lower" 5 63 36 //
  "leg4_upper" 1 63 42 //
  "leg4_lower" 7 63 48 //
  "leg1_upper" 1 63 54 //
  "leg1_lower" 9 63 60 //
  "leg3_upper" 1 63 66 //
  "leg3_lower" 11 63 72 //
  "leg2_upper" 1 63 78 //
  "leg2_lower" 13 63 84 //
  "antenna_upper_left0" 1 63 90 //
  "antenna_upper_left1" 15 63 96 //
  "antenna_upper_right0" 1 63 102 //
  "antenna_upper_right1" 17 63 108 //
  "antenna_right0" 1 63 114 //
  "antenna_right1" 19 63 120 //
  "antenna_left0" 1 63 126 //
  "antenna_left1" 21 63 132 //
  "antenna_lower_left0" 1 63 138 //
  "antenna_lower_left1" 23 63 144 //
  "antenna_lower_right0" 1 63 150 //
  "antenna_lower_right1" 25 63 156 //
}

bounds {
  ( -0.9550526738 -1.1487096548 0.4059851766 ) ( 0.4946153760 1.1198637486 0.9835631847 )
  ( -0.9565154910 -1.1397435665 0.4067464769 ) ( 0.4987179637 1.1184493303 0.9810352921 )
  ( -0.9581909180 -1.1278688908 0.4090366662 ) ( 0.5041012168 1.1141996384 0.9735446572 )
  ( -0.9598366618 -1.1143816710 0.3995206654 ) ( 0.5102120042 1.1073080301 0.9624364376 )
  ( -0.9612584710 -1.1007984877 0.3885378838 ) ( 0.5163046122 1.0983241796 0.9513673782 )
  ( -0.9623496532 -1.0887142420 0.3916963041 ) ( 0.5216599107 1.0881787539 0.9442994595 )
  ( -0.9630839825 -1.0793887377 0.4020630419 ) ( 0.5257380009 1.0780602694 0.9433632493 )
  ( -0.9634851813 -1.0735713243 0.4192223549 ) ( 0.5282447934 1.0734238625 0.9472726583 )
  ( -0.9635793567 -1.0715290308 0.4275295436 ) ( 0.5290940404 1.0713851452 0.9544132352 )
  ( -0.9633644819 -1.0732594728 0.4203545153 ) ( 0.5283058286 1.0684046745 0.9644034505 )
  ( -0.9628155828 -1.0787819624 0.4179699719 ) ( 0.5258772969 1.0647094250 0.9763897657 )
  ( -0.9619054198 -1.0878539085 0.4203545749 ) ( 0.5219053626 1.0606675148 0.9890051484 )
  ( -0.9606373310 -1.0997656584 0.4275297821 ) ( 0.5166807771 1.0623381138 1.0006263256 )
  ( -0.9590869546 -1.1132831573 0.4334170222 ) ( 0.5107146502 1.0691452026 1.0098005533 )
  ( -0.9574138522 -1.1268277168 0.4285899103 ) ( 0.5046841502 1.0780601501 1.0155681372 )
  ( -0.9558341503 -1.1388709545 0.4231093824 ) ( 0.4992932677 1.0881789923 1.0175914764 )
  ( -0.9545656443 -1.1480891705 0.4176168144 ) ( 0.4950763583 1.0983242989 1.0161005259 )
  ( -0.9537808299 -1.1538276672 0.4127570391 ) ( 0.4923980832 1.1073082685 1.0116238594 )
  ( -0.9535841346 -1.1558452845 0.4090366066 ) ( 0.4914103150 1.1141998768 1.0045951605 )
  ( -0.9540247321 -1.1541484594 0.4067463577 ) ( 0.4921418428 1.1184495687 0.9954073429 )
  ( -0.9550526738 -1.1487100124 0.4059851766 ) ( 0.4946153760 1.1198637486 0.9845727682 )
}

baseframe {
  ( 0.0000000000 0.0000000000 0.1000000015 ) ( 0.7071068287 -0.0000000000 -0.0000000000 )
  ( 0.2934706807 -0.3602214158 -0.0048920386 ) ( -0.4964132011 0.5035642385 -0.4966249764 )
  ( 0.0000080311 0.5389489532 0.0002984107 ) ( -0.1784965545 0.0006216453 0.0037200444 )
  ( -0.1367243677 0.0571507215 0.0047000772 ) ( -0.1446045935 -0.1217156276 -0.6598580480 )
  ( 0.0188033730 0.4492226839 -0.0006588334 ) ( 0.2914981842 0.3391291201 -0.8406866193 )
  ( 0.1511484981 0.0609211028 0.0145796919 ) ( -0.1361550987 0.1165692955 0.6686438918 )
  ( -0.0188374277 0.4390271902 -0.0004912592 ) ( 0.2926936448 -0.3480054438 0.8343683481 )
  ( 0.1626309156 0.2403567135 -0.0111524481 ) ( -0.1080924198 0.0413611457 0.3954822123 )
  ( -0.0137833599 0.5138163567 -0.0028145127 ) ( 0.5014041662 0.0156385396 -0.0498958528 )
  ( -0.1620082557 0.2369901687 -0.0111991586 ) ( -0.1099235415 -0.0419307724 -0.3936591744 )
  ( 0.0137448302 0.5055176020 -0.0028717890 ) ( 0.5045711994 -0.0136532076 0.0436128974 )
  ( 0.1429835856 0.3892854154 -0.0090858266 ) ( 0.0111710364 -0.0027141315 0.1080545485 )
  ( -0.0040532337 0.4412065148 0.0007069071 ) ( 0.4295544028 -0.0485373773 0.0925593302 )
  ( -0.1375856400 0.3922168314 -0.0144305658 ) ( 0.0112098185 0.0028863086 -0.1146928743 )
  ( 0.0043151118 0.4400462806 0.0007065351 ) ( 0.4298218489 0.0452572927 -0.0862943754 )
  ( 0.0356778391 -0.0219234787 0.0603129305 ) ( 0.0103111053 -0.1781353056 0.9820153713 )
  ( -0.0023677417 0.0083696377 -0.0063066618 ) ( 0.3025591075 -0.0381402522 0.0498569980 )
  ( -0.0276663788 -0.0228254311 0.0601140521 ) ( 0.0233672094 0.1717036813 -0.9742456675 )
  ( 0.0054568490 0.0085394774 -0.0059142075 ) ( 0.2978127897 0.1312129349 -0.1743576527 )
  ( -0.0508979969 -0.0152415158 0.0244091116 ) ( 0.0117792804 0.0538802668 -0.9588342309 )
  ( 0.0101123052 0.0333281234 -0.0015321304 ) ( 0.1461273730 0.1195054427 -0.4428290129 )
  ( 0.0597957559 -0.0152841890 0.0240866188 ) ( 0.0117620174 -0.0538869537 0.9589529634 )
  ( -0.0101124281 0.0333282128 -0.0015321332 ) ( 0.1461275220 -0.1195051521 0.4428286254 )
  ( 0.0323061757 -0.0354717970 -0.0025340349 ) ( -0.0037301253 -0.2637203634 -0.9645053148 )
  ( 0.0005006421 0.0021384403 0.0098670051 ) ( -0.1936063468 0.1096101850 0.1188093349 )
  ( -0.0264448021 -0.0354467630 -0.0025336863 ) ( -0.0036117367 0.2637220025 0.9645107388 )
  ( -0.0005007304 0.0021384496 0.0098670144 ) ( -0.1936063617 -0.1096105203 -0.1188094392 )
}

frame 0 {
  0.0000000000 0.0000000000 0.1000000015 0.7071068287 -0.0000000000 -0.0000000000
  0.2576283813 -0.6307470202 -0.0048920205 -0.5045900345 0.4953704178 -0.5047982931
  0.0000080228 0.5389485359 -0.0003201365 0.0834346190 -0.0004147576 0.0040179146
  -0.1367243528 0.0571504273 0.0040816418 -0.0532421581 -0.0945030749 -0.6875520945
  0.0188644119 0.4483186007 0.0006996021 0.1130021513 0.5940938592 -0.3826743960
  0.1511484832 0.0609208234 0.0139611345 -0.1473634094 0.1838760674 0.6078770757
  -0.0184717849 0.4415894151 -0.0002871440 0.1684282422 -0.5370241404 0.5489474535
  0.1626309305 0.2403563708 -0.0117709236 -0.1263535172 0.0788029954 0.4719123542
  -0.0158737265 0.5109872222 -0.0030519180 0.3301784694 0.0246247370 -0.0252346788
  -0.1620082706 0.2369898856 -0.0118177664 -0.1755235791 -0.0923628509 -0.4588646293
  0.0156342164 0.5025145411 -0.0044354834 0.4973198175 -0.0146408342 0.0415983871
  0.1429836005 0.3892850280 -0.0097044529 -0.1513911337 0.1156600565 0.2860516310
  -0.0108478069 0.4375908971 -0.0044215396 0.5169391632 -0.0585402213 0.0850626901
  -0.1375856251 0.3922164738 -0.0150490683 -0.0808224231 -0.0446839482 -0.2539990246
  0.0093987249 0.4378107190 -0.0028252974 0.4900456071 0.0660636947 -0.0535610728
  0.0356778279 -0.0219237600 0.0596942678 0.0181776024 -0.0478776544 0.9984862208
  -0.0008090213 0.0072639235 -0.0021114266 0.0028526955 -0.0339449048 0.0012019814
  -0.0276663881 -0.0228256807 0.0594954900 0.0521063544 0.0467753187 -0.9972309470
  0.0010604113 0.0068799267 -0.0020313147 0.0019716544 0.1215026528 -0.0029434226
  -0.0508979931 -0.0152418399 0.0237904843 0.0583909415 0.1457762271 -0.9873849154
  0.0011050683 0.0312350076 -0.0056999633 0.0012725375 0.1301466227 -0.0041509313
  0.0597957484 -0.0152844973 0.0234680604 0.0589697994 -0.1449005306 0.9875704646
  -0.0009339936 0.0312182084 -0.0056770947 0.0012615563 -0.1295253485 0.0041525532
  0.0323061720 -0.0354720615 -0.0031527027 0.0058978871 -0.0512855202 -0.9986658692
  0.0000309651 -0.0005806717 0.0016173691 0.0002232504 0.1057976112 0.0033464681
  -0.0264448076 -0.0354470275 -0.0031523539 0.0114090294 0.0514624491 0.9984931350
  -0.0005694600 -0.0005709961 0.0016300216 0.0002191009 -0.1046594307 -0.0033967686
}

frame 1 {
  0.0000000000 0.0000000000 0.1000000015 0.7071068287 -0.0000000000 -0.0000000000
  0.2576283813 -0.6304202676 -0.0048920205 -0.5045900345 0.4953704178 -0.5047982931
  0.0000080225 0.5389485359 -0.0003201365 0.0779408813 -0.0003938282 0.0040185889
  -0.1367243528 0.0571504012 0.0040816423 -0.0539205261 -0.0950734019 -0.6867979169
  0.0188629813 0.4483543634 0.0006922795 0.1164344698 0.5924211740 -0.3933811486
  0.1511484832 0.0609207675 0.0139611354 -0.1455551684 0.1817741245 0.6111619473
  -0.0184997618 0.4414596260 -0.0002519472 0.1678117812 -0.5394144654 0.5460792780
  0.1626309305 0.2403563261 -0.0117709227 -0.1281781942 0.0794646516 0.4722721279
  -0.0158845242 0.5109557509 -0.0030960552 0.3340093195 0.0242802277 -0.0258627292
  -0.1620082706 0.2369898409 -0.0118177654 -0.1710162312 -0.0879287049 -0.4589967430
  0.0156154558 0.5025727153 -0.0043742470 0.4957020283 -0.0134482617 0.0432782099
  0.1429836005 0.3892849982 -0.0097044520 -0.1507862806 0.1146632507 0.2853130102
  -0.0108176246 0.4376143217 -0.0044168755 0.5175538063 -0.0586255901 0.0849262252
  -0.1375856251 0.3922164142 -0.0150490673 -0.0802899599 -0.0451443493 -0.2536006272
  0.0093862917 0.4378219545 -0.0028026029 0.4877884686 0.0656814650 -0.0541816428
  0.0356778279 -0.0219237842 0.0596942678 0.0181775931 -0.0478776358 0.9984862804
  -0.0008090250 0.0072638718 -0.0021114862 0.0028526932 -0.0339449085 0.0012019814
  -0.0276663899 -0.0228257049 0.0594954900 0.0521063879 0.0467752703 -0.9972310662
  0.0010604076 0.0068799183 -0.0020313670 0.0019716765 0.1215026453 -0.0029434194
  -0.0508979894 -0.0152418641 0.0237904862 0.0583905950 0.1457762867 -0.9873849154
  0.0011050701 0.0312350299 -0.0056999107 0.0012725682 0.1301466227 -0.0041509219
  0.0597957522 -0.0152844917 0.0234680604 0.0589697994 -0.1449006498 0.9875704646
  -0.0009339862 0.0312182009 -0.0056771543 0.0012615563 -0.1295253485 0.0041525541
  0.0323061720 -0.0354720876 -0.0031527022 0.0058994023 -0.0512859486 -0.9986658692
  0.0000309661 -0.0005807349 0.0016174455 0.0002232561 0.1057975963 0.0033464662
  -0.0264448095 -0.0354470797 -0.0031523525 0.0114090070 0.0514624417 0.9984931946
  -0.0005694600 -0.0005710089 0.0016300194 0.0002190999 -0.1046594307 -0.0033967679
}

frame 2 {
  0.0000000000 0.0000000000 0.1000000015 0.7071068287 -0.0000000000 -0.0000000000
  0.2576283813 -0.6294368505 -0.0048920205 -0.5045900345 0.4953704178 -0.5047982931
  0.0000080222 0.5389485359 -0.0003201961 0.0711203739 -0.0003678371 0.0040192385
  -0.1367243528 0.0571504161 0.0040815226 -0.0558251552 -0.0956580713 -0.6867183447
  0.0188645683 0.4483495355 0.0006560679 0.1210517213 0.5917666554 -0.4066333771
  0.1511484832 0.0609207526 0.0139611354 -0.1403369308 0.1755513847 0.6207528710
  -0.0185767934 0.4410740733 -0.0001566975 0.1659621298 -0.5465792418 0.5374816060
  0.1626309305 0.2403563559 -0.0117710428 -0.1335053146 0.0813777745 0.4733900428
  -0.0159177780 0.5108594894 -0.0032242574 0.3452262282 0.0232398380 -0.0277633611
  -0.1620082706 0.2369898558 -0.0118177654 -0.1586862952 -0.0758964643 -0.4594862461
  0.0155712347 0.5027192235 -0.0042008758 0.4905022979 -0.0102321682 0.0477057472
  0.1429836005 0.3892849684 -0.0097044520 -0.1488792002 0.1116465926 0.2830856740
  -0.0107265711 0.4376855493 -0.0043992922 0.5192900300 -0.0588758998 0.0845121965
  -0.1375856251 0.3922164738 -0.0150490683 -0.0785961971 -0.0464935154 -0.2524647117
  0.0093507543 0.4378547072 -0.0027312934 0.4808645248 0.0645339489 -0.0559924766
  0.0356778279 -0.0219237693 0.0596942678 0.0181776024 -0.0478776544 0.9984862208
  -0.0008090204 0.0072639007 -0.0021114899 0.0028526955 -0.0339449048 0.0012019814
  -0.0276663899 -0.0228257198 0.0594954900 0.0521066524 0.0467753150 -0.9972310066
  0.0010604132 0.0068798889 -0.0020314790 0.0019716674 0.1215026677 -0.0029434308
  -0.0508979931 -0.0152418492 0.0237904843 0.0583906211 0.1457759887 -0.9873849154
  0.0011050664 0.0312349778 -0.0056998902 0.0012725607 0.1301465929 -0.0041509219
  0.0597957484 -0.0152845066 0.0234680604 0.0589697994 -0.1449005306 0.9875704646
  -0.0009339899 0.0312182084 -0.0056771543 0.0012615563 -0.1295253485 0.0041525532
  0.0323061720 -0.0354720727 -0.0031527027 0.0058978200 -0.0512858778 -0.9986659288
  0.0000309660 -0.0005807023 0.0016173130 0.0002232638 0.1057975963 0.0033464588
  -0.0264448058 -0.0354470350 -0.0031523539 0.0114085358 0.0514624566 0.9984932542
  -0.0005694544 -0.0005709962 0.0016300068 0.0002190928 -0.1046594381 -0.0033967656
}

frame 3 {
  0.0000000000 0.0000000000 0.1000000015 0.7071068287 -0.0000000000 -0.0000000000
  0.2576283813 -0.6278379560 -0.0048920205 -0.5045900345 0.4953704178 -0.5047982931
  0.0000080227 0.5389485359 -0.0003202557 0.0636949539 -0.0003395319 0.0040197116
  -0.1367243826 0.0571504422 0.0040814630 -0.0588234030 -0.0958719552 -0.6877334714
  0.0188698601 0.4482822120 0.0005868142 0.1263270974 0.5921506882 -0.4203963578
  0.1511484832 0.0609207824 0.0139611354 -0.1329511851 0.1665735990 0.6347354650
  -0.0186761469 0.4404933155 -0.0000307814 0.1631630361 -0.5579822063 0.5244666338
  0.1626309305 0.2403563708 -0.0117711024 -0.1416899562 0.0842532739 0.4753243327
  -0.0159731582 0.5106998682 -0.0034189858 0.3625540137 0.0215468444 -0.0308994055
  -0.1620082706 0.2369898856 -0.0118177654 -0.1460702270 -0.0626772940 -0.4611239731
  0.0155538917 0.5028181076 -0.0040285513 0.4839710593 -0.0062579378 0.0530201383
  0.1429835707 0.3892849982 -0.0097044520 -0.1455020756 0.1066925377 0.2794446945
  -0.0105767623 0.4378034472 -0.0043601170 0.5217505693 -0.0592621453 0.0838311166
  -0.1375856549 0.3922164440 -0.0150491875 -0.0755435601 -0.0485668629 -0.2508258522
  0.0092990436 0.4379051328 -0.0026050918 0.4691702127 0.0626771674 -0.0587423891
  0.0356778279 -0.0219237730 0.0596942678 0.0181768518 -0.0478780083 0.9984862208
  -0.0008090166 0.0072639310 -0.0021114773 0.0028527102 -0.0339449085 0.0012019837
  -0.0276663899 -0.0228256937 0.0594954304 0.0521066524 0.0467753150 -0.9972310066
  0.0010604113 0.0068799192 -0.0020314150 0.0019716674 0.1215026677 -0.0029434308
  -0.0508979931 -0.0152418241 0.0237904247 0.0583905168 0.1457763612 -0.9873848557
  0.0011050776 0.0312350225 -0.0056998711 0.0012725592 0.1301467121 -0.0041509205
  0.0597957484 -0.0152844815 0.0234680008 0.0589697883 -0.1449008584 0.9875704050
  -0.0009339936 0.0312182140 -0.0056770639 0.0012615279 -0.1295253783 0.0041525583
  0.0323061720 -0.0354720429 -0.0031527623 0.0058978871 -0.0512855202 -0.9986658692
  0.0000309688 -0.0005806493 0.0016174288 0.0002232504 0.1057976112 0.0033464681
  -0.0264448058 -0.0354470089 -0.0031524135 0.0114085358 0.0514624566 0.9984932542
  -0.0005694581 -0.0005710485 0.0016300702 0.0002190928 -0.1046594381 -0.0033967656
}

frame 4 {
  0.0000000000 0.0000000000 0.1000000015 0.7071068287 -0.0000000000 -0.0000000000
  0.2576283813 -0.6257466674 -0.0048920210 -0.5045900345 0.4953704178 -0.5047982931
  0.0000080223 0.5389485359 -0.0003201961 0.0564761013 -0.0003120052 0.0040199370
  -0.1367243826 0.0571504198 0.0040815226 -0.0624442920 -0.0958462581 -0.6897352338
  0.0188771989 0.4481598735 0.0005008532 0.1316069216 0.5934992433 -0.4331248403
  0.1511484832 0.0609207563 0.0139611354 -0.1271688044 0.1574478596 0.6497268081
  -0.0187665671 0.4398284554 0.0000473204 0.1607261747 -0.5716362596 0.5105516911
  0.1626309305 0.2403563559 -0.0117710428 -0.1516187638 0.0876206830 0.4780732393
  -0.0160482340 0.5104843974 -0.0036513768 0.3837349117 0.0193437021 -0.0351005644
  -0.1620082706 0.2369898558 -0.0118177654 -0.1426867843 -0.0554616675 -0.4651810229
  0.0156179368 0.5027170181 -0.0040294901 0.4813649058 -0.0026927597 0.0581090860
  0.1429835707 0.3892850280 -0.0097044529 -0.1405727565 0.1001359969 0.2746292055
  -0.0103777573 0.4379617274 -0.0042887926 0.5242990255 -0.0597266592 0.0829374939
  -0.1375856549 0.3922164738 -0.0150490683 -0.0709768683 -0.0510447547 -0.2490903437
  0.0092427023 0.4379657805 -0.0024208501 0.4530081451 0.0602651425 -0.0619393811
  0.0356778279 -0.0219237655 0.0596942678 0.0181776024 -0.0478776544 0.9984862208
  -0.0008090176 0.0072639231 -0.0021114266 0.0028526955 -0.0339449048 0.0012019814
  -0.0276663862 -0.0228256863 0.0594954900 0.0521066524 0.0467753150 -0.9972310066
  0.0010604095 0.0068799262 -0.0020313596 0.0019716674 0.1215026677 -0.0029434308
  -0.0508979931 -0.0152418455 0.0237904843 0.0583909415 0.1457762271 -0.9873849154
  0.0011050664 0.0312350225 -0.0056998953 0.0012725375 0.1301466227 -0.0041509313
  0.0597957484 -0.0152845029 0.0234680604 0.0589697994 -0.1449005306 0.9875704646
  -0.0009339899 0.0312181935 -0.0056770947 0.0012615563 -0.1295253485 0.0041525532
  0.0323061720 -0.0354720689 -0.0031527027 0.0058978871 -0.0512855202 -0.9986658692
  0.0000309688 -0.0005806642 0.0016173691 0.0002232504 0.1057976112 0.0033464681
  -0.0264448058 -0.0354470313 -0.0031523539 0.0114085246 0.0514624380 0.9984932542
  -0.0005694600 -0.0005710081 0.0016300662 0.0002190875 -0.1046594381 -0.0033967677
}

frame 5 {
  0.0000000000 0.0000000000 0.1000000015 0.7071068287 -0.0000000000 -0.0000000000
  0.2576283813 -0.6233775616 -0.0048920210 -0.5045900345 0.4953704178 -0.5047982931
  0.0000080228 0.5389485359 -0.0003201365 0.0502132736 -0.0002881168 0.0040199440
  -0.1367243677 0.0571504012 0.0040816423 -0.0663721263 -0.0957274586 -0.6923890114
  0.0188845731 0.4480003119 0.0004090057 0.1363559514 0.5955528021 -0.4436382651
  0.1511484683 0.0609207675 0.0139611354 -0.1262352914 0.1513909101 0.6621705890
  -0.0188280661 0.4392230511 0.0000410494 0.1600453556 -0.5851280093 0.5002654791
  0.1626309603 0.2403563261 -0.0117709227 -0.1619526595 0.0909726992 0.4814732969
  -0.0161364451 0.5102320910 -0.0038875714 0.4060002863 0.0168646313 -0.0399878100
  -0.1620082706 0.2369898409 -0.0118177654 -0.1470931023 -0.0538897999 -0.4711136520
  0.0157427490 0.5024569035 -0.0041682124 0.4825896323 0.0003344112 0.0627163798
  0.1429835856 0.3892849982 -0.0097044520 -0.1342940927 0.0926307812 0.2690726221
  -0.0101477802 0.4381459951 -0.0041802153 0.5262780190 -0.0601942055 0.0819413215
  -0.1375856400 0.3922164142 -0.0150490673 -0.0650147423 -0.0534382649 -0.2478217930
  0.0091991574 0.4380235672 -0.0021854229 0.4334257543 0.0575249121 -0.0648120120
  0.0356778279 -0.0219237842 0.0596942678 0.0181772429 -0.0478776842 0.9984862804
  -0.0008090204 0.0072639524 -0.0021114822 0.0028527013 -0.0339449011 0.0012019821
  -0.0276663844 -0.0228257049 0.0594954900 0.0521066524 0.0467753150 -0.9972310066
  0.0010604020 0.0068798885 -0.0020314795 0.0019716674 0.1215026677 -0.0029434308
  -0.0508979931 -0.0152418651 0.0237904862 0.0583906434 0.1457758397 -0.9873849154
  0.0011050645 0.0312349759 -0.0056998990 0.0012725542 0.1301465929 -0.0041509266
  0.0597957484 -0.0152844926 0.0234680604 0.0589697994 -0.1449005306 0.9875704646
  -0.0009339824 0.0312181935 -0.0056771543 0.0012615563 -0.1295253485 0.0041525532
  0.0323061757 -0.0354720876 -0.0031527022 0.0058994023 -0.0512859486 -0.9986658692
  0.0000309605 -0.0005807275 0.0016175050 0.0002232561 0.1057975963 0.0033464662
  -0.0264448039 -0.0354470797 -0.0031523525 0.0114090201 0.0514624380 0.9984931946
  -0.0005694628 -0.0005710713 0.0016299619 0.0002190991 -0.1046594307 -0.0033967716
}

frame 6 {
  0.0000000000 0.0000000000 0.1000000015 0.7071068287 -0.0000000000 -0.0000000000
  0.2576283813 -0.6210084558 -0.0048920214 -0.5045900345 0.4953704178 -0.5047982931
  0.0000080227 0.5389485359 -0.0003201365 0.0454904512 -0.0002700983 0.0040198355
  -0.1367243528 0.0571504273 0.0040816418 -0.0702884346 -0.0957143530 -0.6951672435
  0.0188902952 0.4478326142 0.0003217706 0.1401901394 0.5979793072 -0.4513414502
  0.1511484832 0.0609207787 0.0139611354 -0.1312196851 0.1502991915 0.6700812578
  -0.0188609995 0.4387743473 -0.0000373484 0.1618403494 -0.5964735150 0.4964715540
  0.1626309305 0.2403563559 -0.0117709236 -0.1714476943 0.0939049795 0.4851591885
  -0.0162275229 0.5099720955 -0.0040985718 0.4267024994 0.0144040640 -0.0449950658
  -0.1620082706 0.2369898707 -0.0118177654 -0.1548640430 -0.0556176603 -0.4777881801
  0.0158928074 0.5021243095 -0.0043465681 0.4851806164 0.0027555437 0.0665155798
  0.1429836005 0.3892849982 -0.0097044520 -0.1272854805 0.0850751773 0.2633747756
  -0.0099122003 0.4383356571 -0.0040416941 0.5272991657 -0.0605959408 0.0809842497
  -0.1375856251 0.3922164440 -0.0150490683 -0.0581174716 -0.0554592870 -0.2472060919
  0.0091741160 0.4380711615 -0.0019177608 0.4123092890 0.0548144206 -0.0669647083
  0.0356778279 -0.0219237730 0.0596942678 0.0181772429 -0.0478776842 0.9984862804
  -0.0008090213 0.0072638853 -0.0021113669 0.0028527013 -0.0339449011 0.0012019821
  -0.0276663862 -0.0228256937 0.0594954900 0.0521066524 0.0467753150 -0.9972310066
  0.0010604113 0.0068799118 -0.0020314150 0.0019716674 0.1215026677 -0.0029434308
  -0.0508979931 -0.0152418241 0.0237904843 0.0583909415 0.1457762271 -0.9873849154
  0.0011050738 0.0312350299 -0.0056998357 0.0012725375 0.1301466227 -0.0041509313
  0.0597957484 -0.0152844815 0.0234680604 0.0589697994 -0.1449005306 0.9875704646
  -0.0009339899 0.0312181935 -0.0056770947 0.0012615563 -0.1295253485 0.0041525532
  0.0323061720 -0.0354720466 -0.0031527027 0.0058994023 -0.0512859486 -0.9986658692
  0.0000309632 -0.0005806530 0.0016174418 0.0002232561 0.1057975963 0.0033464662
  -0.0264448058 -0.0354470089 -0.0031523539 0.0114090201 0.0514624380 0.9984931946
  -0.0005694591 -0.0005710266 0.0016300271 0.0002190991 -0.1046594307 -0.0033967716
}

frame 7 {
  0.0000000000 0.0000000000 0.1000000015 0.7071068287 -0.0000000000 -0.0000000000
  0.2576283813 -0.6189171076 -0.0048920214 -0.5045900345 0.4953704178 -0.5047982931
  0.0000080228 0.5389485359 -0.0003202557 0.0426837169 -0.0002593881 0.0040197247
  -0.1367243528 0.0571504161 0.0040814630 -0.0738936886 -0.0959474221 -0.6975634694
  0.0188936144 0.4476851225 0.0002482231 0.1428862512 0.6004912853 -0.4560689032
  0.1511484832 0.0609207824 0.0139609566 -0.1399260759 0.1534136683 0.6738868356
  -0.0188760161 0.4384866059 -0.0001386498 0.1653314382 -0.6047332883 0.4981147647
  0.1626309305 0.2403563559 -0.0117711024 -0.1792152971 0.0961862728 0.4886417389
  -0.0163098946 0.5097361803 -0.0042663030 0.4438497424 0.0122492285 -0.0495075248
  -0.1620082706 0.2369898558 -0.0118179442 -0.1651833206 -0.0606343299 -0.4845390320
  0.0160539299 0.5017470717 -0.0045365877 0.4884153903 0.0042136419 0.0690654144
  0.1429836005 0.3892849684 -0.0097045712 -0.1204989254 0.0783910975 0.2582006752
  -0.0096991882 0.4385064542 -0.0038938373 0.5274071097 -0.0608930625 0.0801887959
  -0.1375856251 0.3922164440 -0.0150492471 -0.0511666499 -0.0569364317 -0.2472079694
  0.0091673173 0.4381037652 -0.0016511790 0.3922122419 0.0524563976 -0.0682310313
  0.0356778279 -0.0219237693 0.0596942082 0.0181775931 -0.0478776358 0.9984862804
  -0.0008090222 0.0072639240 -0.0021114266 0.0028526932 -0.0339449085 0.0012019814
  -0.0276663844 -0.0228257198 0.0594953708 0.0521063879 0.0467752703 -0.9972310662
  0.0010604076 0.0068799104 -0.0020314273 0.0019716765 0.1215026453 -0.0029434194
  -0.0508979894 -0.0152418502 0.0237903651 0.0583909899 0.1457763463 -0.9873849154
  0.0011050813 0.0312350057 -0.0056999628 0.0012725377 0.1301466376 -0.0041509238
  0.0597957484 -0.0152845066 0.0234679412 0.0589697585 -0.1449011564 0.9875704050
  -0.0009339880 0.0312182456 -0.0056770639 0.0012615341 -0.1295253783 0.0041525583
  0.0323061720 -0.0354720689 -0.0031527623 0.0058978871 -0.0512855202 -0.9986658692
  0.0000309660 -0.0005806456 0.0016173673 0.0002232504 0.1057976112 0.0033464681
  -0.0264448039 -0.0354470350 -0.0031524135 0.0114090024 0.0514624529 0.9984932542
  -0.0005694609 -0.0005710538 0.0016299505 0.0002190861 -0.1046594307 -0.0033967560
}

frame 8 {
  0.0000000000 0.0000000000 0.1000000015 0.7071068287 -0.0000000000 -0.0000000000
  0.2576283813 -0.6173182726 -0.0048920214 -0.5045900345 0.4953704178 -0.5047982931
  0.0000080228 0.5389485359 -0.0003201365 0.0419939794 -0.0002567559 0.0040196911
  -0.1367243826 0.0571504459 0.0040816418 -0.0769535601 -0.0964721888 -0.6992366314
  0.0188951883 0.4475776851 0.0001928478 0.1443523765 0.6029093266 -0.4578819573
  0.1511484832 0.0609207824 0.0139611354 -0.1501350999 0.1595796943 0.6742218137
  -0.0188809484 0.4383508265 -0.0002285461 0.1695443392 -0.6093735695 0.5034474730
  0.1626309305 0.2403563708 -0.0117709236 -0.1848021448 0.0977543294 0.4914449751
  -0.0163737610 0.5095523000 -0.0043835342 0.4563235343 0.0106134778 -0.0530120619
  -0.1620082706 0.2369898856 -0.0118177654 -0.1767673343 -0.0684041306 -0.4906792343
  0.0162118450 0.5013628602 -0.0047072135 0.4913209677 0.0045660757 0.0699734911
  0.1429835707 0.3892849982 -0.0097044520 -0.1149338111 0.0732878596 0.2541356683
  -0.0095329173 0.4386388063 -0.0037647635 0.5269853473 -0.0610923618 0.0796308517
  -0.1375856549 0.3922164738 -0.0150490683 -0.0452515110 -0.0578517132 -0.2475857735
  0.0091728084 0.4381217957 -0.0014264360 0.3757986724 0.0506735407 -0.0687378049
  0.0356778279 -0.0219237395 0.0596942678 0.0181775931 -0.0478776358 0.9984862804
  -0.0008090222 0.0072639240 -0.0021114266 0.0028526932 -0.0339449085 0.0012019814
  -0.0276663844 -0.0228256900 0.0594954900 0.0521063879 0.0467752703 -0.9972310662
  0.0010604076 0.0068799104 -0.0020314869 0.0019716765 0.1215026453 -0.0029434194
  -0.0508979894 -0.0152418204 0.0237904843 0.0583906434 0.1457759440 -0.9873849154
  0.0011050664 0.0312349759 -0.0056998320 0.0012725544 0.1301465780 -0.0041509271
  0.0597957484 -0.0152844777 0.0234680604 0.0589697994 -0.1449006498 0.9875704646
  -0.0009339899 0.0312182084 -0.0056770951 0.0012615563 -0.1295253485 0.0041525541
  0.0323061720 -0.0354720429 -0.0031527027 0.0058978871 -0.0512855202 -0.9986658692
  0.0000309642 -0.0005807387 0.0016173747 0.0002232504 0.1057976112 0.0033464681
  -0.0264448039 -0.0354470052 -0.0031523539 0.0114090024 0.0514624529 0.9984932542
  -0.0005694646 -0.0005711358 0.0016299560 0.0002190861 -0.1046594307 -0.0033967560
}

frame 9 {
  0.0000000000 0.0000000000 0.1000000015 0.7071068287 -0.0000000000 -0.0000000000
  0.2576283813 -0.6163349152 -0.0048920214 -0.5045900345 0.4953704178 -0.5047982931
  0.0000080217 0.5389485359 -0.0003201365 0.0435473844 -0.0002626838 0.0040197619
  -0.1367243528 0.0571504049 0.0040816423 -0.0793126896 -0.0972499922 -0.7000465989
  0.0188957471 0.4475194514 0.0001574344 0.1445579082 0.6051784754 -0.4568439424
  0.1511484832 0.0609207712 0.0139611354 -0.1611355245 0.1685321778 0.6709051728
  -0.0188786723 0.4383813739 -0.0003026016 0.1741056591 -0.6100950837 0.5119636655
  0.1626309305 0.2403563261 -0.0117709227 -0.1880974025 0.0986480936 0.4932282567
  -0.0164135918 0.5094374418 -0.0044515170 0.4637435675 0.0096129114 -0.0551897772
  -0.1620082706 0.2369898409 -0.0118177654 -0.1880435050 -0.0779381096 -0.4955549240
  0.0163521245 0.5010170341 -0.0048317499 0.4930278361 0.0038171487 0.0690275580
  0.1429835707 0.3892849982 -0.0097044520 -0.1113502905 0.0701573938 0.2515825629
  -0.0094289556 0.4387209415 -0.0036782473 0.5265074372 -0.0612100028 0.0793188065
  -0.1375856251 0.3922164142 -0.0150490673 -0.0413305797 -0.0583140627 -0.2479926944
  0.0091811195 0.4381293654 -0.0012783594 0.3651986718 0.0495851301 -0.0688268468
  0.0356778279 -0.0219237842 0.0596942678 0.0181776024 -0.0478776544 0.9984862208
  -0.0008090222 0.0072639459 -0.0021114824 0.0028526955 -0.0339449048 0.0012019814
  -0.0276663899 -0.0228257049 0.0594954900 0.0521066524 0.0467753150 -0.9972310066
  0.0010604057 0.0068799038 -0.0020314194 0.0019716674 0.1215026677 -0.0029434308
  -0.0508979931 -0.0152418641 0.0237904862 0.0583906434 0.1457758397 -0.9873849154
  0.0011050645 0.0312349536 -0.0056998385 0.0012725542 0.1301465929 -0.0041509266
  0.0597957484 -0.0152844917 0.0234680604 0.0589697994 -0.1449006498 0.9875704646
  -0.0009339862 0.0312182009 -0.0056772144 0.0012615563 -0.1295253485 0.0041525541
  0.0323061720 -0.0354720876 -0.0031527022 0.0058994023 -0.0512859486 -0.9986658692
  0.0000309623 -0.0005807163 0.0016173859 0.0002232561 0.1057975963 0.0033464662
  -0.0264448095 -0.0354470797 -0.0031523525 0.0114090294 0.0514624491 0.9984931350
  -0.0005694600 -0.0005709848 0.0016300757 0.0002191009 -0.1046594307 -0.0033967686
}

frame 10 {
  0.0000000000 0.0000000000 0.1000000015 0.7071068287 -0.0000000000 -0.0000000000
  0.2576283813 -0.6160081625 -0.0048920214 -0.5045900345 0.4953704178 -0.5047982931
  0.0000080227 0.5389485359 -0.0003201365 0.0472757854 -0.0002769102 0.0040198881
  -0.1367243826 0.0571504086 0.0040816423 -0.0808845684 -0.0981945917 -0.7000097036
  0.0188958962 0.4475108683 0.0001417703 0.1434480250 0.6073656082 -0.4528108835
  0.1511484832 0.0609207749 0.0139611354 -0.1722459197 0.1794333756 0.6642128229
  -0.0188688673 0.4385699332 -0.0003694450 0.1785938591 -0.6070507765 0.5226489902
  0.1626309305 0.2403563559 -0.0117709236 -0.1891691685 0.0989334136 0.4938306808
  -0.0164268911 0.5093990564 -0.0044732764 0.4661681354 0.0092814434 -0.0559169874
  -0.1620083004 0.2369898409 -0.0118177654 -0.1975816935 -0.0879184827 -0.4987660050
  0.0164633691 0.5007495880 -0.0048969947 0.4931556582 0.0021019557 0.0663943514
  0.1429835707 0.3892849982 -0.0097044520 -0.1101325750 0.0691188276 0.2507255971
  -0.0093941167 0.4387482405 -0.0036483854 0.5263117552 -0.0612462051 0.0792184845
  -0.1375856549 0.3922164440 -0.0150490683 -0.0399774499 -0.0584498160 -0.2481587231
  0.0091848075 0.4381312132 -0.0012273360 0.3615854979 0.0492246673 -0.0688162372
  0.0356778279 -0.0219237786 0.0596942678 0.0181775931 -0.0478776358 0.9984862804
  -0.0008090232 0.0072638718 -0.0021114266 0.0028526932 -0.0339449085 0.0012019814
  -0.0276663899 -0.0228256993 0.0594954900 0.0521063879 0.0467752703 -0.9972310662
  0.0010604113 0.0068799108 -0.0020313673 0.0019716765 0.1215026453 -0.0029434194
  -0.0508979894 -0.0152418595 0.0237904862 0.0583903268 0.1457759738 -0.9873850346
  0.0011050776 0.0312350187 -0.0056997859 0.0012725564 0.1301465631 -0.0041509341
  0.0597957484 -0.0152844870 0.0234680604 0.0589698032 -0.1449006498 0.9875705242
  -0.0009339899 0.0312181935 -0.0056771170 0.0012615485 -0.1295253485 0.0041525601
  0.0323061720 -0.0354720503 -0.0031527027 0.0058994023 -0.0512859486 -0.9986658692
  0.0000309651 -0.0005806939 0.0016174455 0.0002232561 0.1057975963 0.0033464662
  -0.0264448095 -0.0354470164 -0.0031523539 0.0114090070 0.0514624417 0.9984931946
  -0.0005694618 -0.0005709939 0.0016300231 0.0002190999 -0.1046594307 -0.0033967679
}

frame 11 {
  0.0000000000 0.0000000000 0.1000000015 0.7071068287 -0.0000000000 -0.0000000000
  0.2576283813 -0.6163349152 -0.0048920214 -0.5045900345 0.4953704178 -0.5047982931
  0.0000080217 0.5389485359 -0.0003201365 0.0528570898 -0.0002982020 0.0040199622
  -0.1367243528 0.0571504049 0.0040816423 -0.0815151110 -0.0991158262 -0.6992692351
  0.0188957267 0.4475454092 0.0001450835 0.1409843117 0.6094842553 -0.4456380904
  0.1511484832 0.0609207712 0.0139611354 -0.1824185699 0.1910082698 0.6547701955
  -0.0188481994 0.4388952851 -0.0004352881 0.1824544668 -0.6007310748 0.5341616869
  0.1626309305 0.2403563261 -0.0117709227 -0.1880973130 0.0986480638 0.4932282865
  -0.0164135918 0.5094374418 -0.0044515617 0.4637434185 0.0096129281 -0.0551897474
  -0.1620082706 0.2369898409 -0.0118177654 -0.2044697851 -0.0971362218 -0.5001310706
  0.0165371932 0.5005871654 -0.0049067624 0.4920046628 -0.0003616893 0.0624898523
  0.1429835707 0.3892849982 -0.0097044520 -0.1113502085 0.0701573864 0.2515825629
  -0.0094289258 0.4387209415 -0.0036782250 0.5265072584 -0.0612100437 0.0793187991
  -0.1375856251 0.3922164142 -0.0150490673 -0.0413305797 -0.0583140627 -0.2479926944
  0.0091811195 0.4381293654 -0.0012783594 0.3651986718 0.0495851301 -0.0688268468
  0.0356778279 -0.0219237842 0.0596942678 0.0181776024 -0.0478776544 0.9984862208
  -0.0008090222 0.0072639459 -0.0021114824 0.0028526955 -0.0339449048 0.0012019814
  -0.0276663899 -0.0228257049 0.0594954900 0.0521066524 0.0467753150 -0.9972310066
  0.0010604057 0.0068799038 -0.0020314194 0.0019716674 0.1215026677 -0.0029434308
  -0.0508979931 -0.0152418641 0.0237904862 0.0583906434 0.1457758397 -0.9873849154
  0.0011050645 0.0312349536 -0.0056998385 0.0012725542 0.1301465929 -0.0041509266
  0.0597957484 -0.0152844917 0.0234680604 0.0589697994 -0.1449006498 0.9875704646
  -0.0009339862 0.0312182009 -0.0056772144 0.0012615563 -0.1295253485 0.0041525541
  0.0323061720 -0.0354720876 -0.0031527022 0.0058994023 -0.0512859486 -0.9986658692
  0.0000309623 -0.0005807163 0.0016173859 0.0002232561 0.1057975963 0.0033464662
  -0.0264448095 -0.0354470797 -0.0031523525 0.0114090294 0.0514624491 0.9984931350
  -0.0005694600 -0.0005709848 0.0016300757 0.0002191009 -0.1046594307 -0.0033967686
}

frame 12 {
  0.0000000000 0.0000000000 0.1000000015 0.7071068287 -0.0000000000 -0.0000000000
  0.2576283813 -0.6173182726 -0.0048920214 -0.5045900345 0.4953704178 -0.5047982931
  0.0000080228 0.5389485359 -0.0003201365 0.0597421043 -0.0003244600 0.0040198625
  -0.1367243826 0.0571504459 0.0040816418 -0.0808859691 -0.0997161269 -0.6980321407
  0.0188951585 0.4476146996 0.0001692045 0.1371914148 0.6113099456 -0.4354073107
  0.1511484832 0.0609207824 0.0139611354 -0.1902888119 0.2017290890 0.6433957219
  -0.0188115649 0.4393351674 -0.0005016802 0.1850805581 -0.5916056633 0.5451559424
  0.1626309305 0.2403563708 -0.0117709236 -0.1848021597 0.0977543369 0.4914449155
  -0.0163737927 0.5095521808 -0.0043835603 0.4563235343 0.0106134908 -0.0530121066
  -0.1620082706 0.2369898856 -0.0118177654 -0.2083865702 -0.1048439965 -0.4995382130
  0.0165671967 0.5005441904 -0.0048728585 0.4903561473 -0.0034002224 0.0577248074
  0.1429835707 0.3892849982 -0.0097044520 -0.1149340123 0.0732879043 0.2541356981
  -0.0095329210 0.4386388958 -0.0037646741 0.5269854069 -0.0610923357 0.0796308666
  -0.1375856549 0.3922164738 -0.0150490683 -0.0452513173 -0.0578516759 -0.2475858778
  0.0091728345 0.4381217360 -0.0014264695 0.3757985234 0.0506735705 -0.0687377378
  0.0356778279 -0.0219237395 0.0596942678 0.0181775931 -0.0478776358 0.9984862804
  -0.0008090222 0.0072639240 -0.0021114266 0.0028526932 -0.0339449085 0.0012019814
  -0.0276663844 -0.0228256900 0.0594954900 0.0521063879 0.0467752703 -0.9972310662
  0.0010604076 0.0068799104 -0.0020314869 0.0019716765 0.1215026453 -0.0029434194
  -0.0508979894 -0.0152418204 0.0237904843 0.0583906434 0.1457759440 -0.9873849154
  0.0011050664 0.0312349759 -0.0056998320 0.0012725544 0.1301465780 -0.0041509271
  0.0597957484 -0.0152844777 0.0234680604 0.0589697994 -0.1449006498 0.9875704646
  -0.0009339899 0.0312182084 -0.0056770951 0.0012615563 -0.1295253485 0.0041525541
  0.0323061720 -0.0354720429 -0.0031527027 0.0058978871 -0.0512855202 -0.9986658692
  0.0000309642 -0.0005807387 0.0016173747 0.0002232504 0.1057976112 0.0033464681
  -0.0264448039 -0.0354470052 -0.0031523539 0.0114090024 0.0514624529 0.9984932542
  -0.0005694646 -0.0005711358 0.0016299560 0.0002190861 -0.1046594307 -0.0033967560
}

frame 13 {
  0.0000000000 0.0000000000 0.1000000015 0.7071068287 -0.0000000000 -0.0000000000
  0.2576283813 -0.6189171076 -0.0048920214 -0.5045900345 0.4953704178 -0.5047982931
  0.0000080228 0.5389485359 -0.0003202557 0.0671826601 -0.0003528281 0.0040195202
  -0.1367243528 0.0571504161 0.0040814630 -0.0787117556 -0.0997228697 -0.6965456605
  0.0188937485 0.4477071464 0.0002164426 0.1322749108 0.6124155521 -0.4226962924
  0.1511484832 0.0609207824 0.0139609566 -0.1946706176 0.2102026939 0.6311035752
  -0.0187546089 0.4398585260 -0.0005619917 0.1860575378 -0.5802242756 0.5545813441
  0.1626309305 0.2403563559 -0.0117711024 -0.1792153120 0.0961862579 0.4886417091
  -0.0163098667 0.5097362399 -0.0042663068 0.4438496232 0.0122492090 -0.0495075211
  -0.1620082706 0.2369898558 -0.0118179442 -0.2094674408 -0.1107054576 -0.4970003068
  0.0165501311 0.5006204247 -0.0048095770 0.4890496731 -0.0068365419 0.0524827130
  0.1429836005 0.3892849684 -0.0097045712 -0.1204994172 0.0783913806 0.2582006752
  -0.0096992031 0.4385063648 -0.0038939044 0.5274072886 -0.0608929731 0.0801888630
  -0.1375856251 0.3922164440 -0.0150492471 -0.0511667095 -0.0569363907 -0.2472079992
  0.0091673657 0.4381038547 -0.0016511977 0.3922123313 0.0524564013 -0.0682309344
  0.0356778279 -0.0219237693 0.0596942082 0.0181775931 -0.0478776358 0.9984862804
  -0.0008090222 0.0072639240 -0.0021114266 0.0028526932 -0.0339449085 0.0012019814
  -0.0276663844 -0.0228257198 0.0594953708 0.0521063879 0.0467752703 -0.9972310662
  0.0010604076 0.0068799104 -0.0020314273 0.0019716765 0.1215026453 -0.0029434194
  -0.0508979894 -0.0152418502 0.0237903651 0.0583909899 0.1457763463 -0.9873849154
  0.0011050813 0.0312350057 -0.0056999628 0.0012725377 0.1301466376 -0.0041509238
  0.0597957484 -0.0152845066 0.0234679412 0.0589697585 -0.1449011564 0.9875704050
  -0.0009339880 0.0312182456 -0.0056770639 0.0012615341 -0.1295253783 0.0041525583
  0.0323061720 -0.0354720689 -0.0031527623 0.0058978871 -0.0512855202 -0.9986658692
  0.0000309660 -0.0005806456 0.0016173673 0.0002232504 0.1057976112 0.0033464681
  -0.0264448039 -0.0354470350 -0.0031524135 0.0114090024 0.0514624529 0.9984932542
  -0.0005694609 -0.0005710538 0.0016299505 0.0002190861 -0.1046594307 -0.0033967560
}

frame 14 {
  0.0000000000 0.0000000000 0.1000000015 0.7071068287 -0.0000000000 -0.0000000000
  0.2576283813 -0.6210084558 -0.0048920214 -0.5045900345 0.4953704178 -0.5047982931
  0.0000080227 0.5389485359 -0.0003201365 0.0743618160 -0.0003801904 0.0040189559
  -0.1367243528 0.0571504273 0.0040816418 -0.0749575496 -0.0990344062 -0.6950329542
  0.0188912600 0.4478104711 0.0002866122 0.1266858578 0.6123226285 -0.4087066650
  0.1511484832 0.0609207787 0.0139611354 -0.1949692518 0.2155164033 0.6190615892
  -0.0186773762 0.4404213428 -0.0006043487 0.1853205711 -0.5673865080 0.5617974401
  0.1626309305 0.2403563559 -0.0117709236 -0.1714475751 0.0939049125 0.4851591885
  -0.0162274688 0.5099720359 -0.0040985346 0.4267021120 0.0144041106 -0.0449950248
  -0.1620082706 0.2369898707 -0.0118177654 -0.2080563754 -0.1145800948 -0.4927111268
  0.0164868273 0.5008028150 -0.0047292411 0.4886181653 -0.0104247686 0.0471652225
  0.1429836005 0.3892849982 -0.0097044520 -0.1272860318 0.0850756466 0.2633748055
  -0.0099121556 0.4383355975 -0.0040415600 0.5272991061 -0.0605958663 0.0809845254
  -0.1375856251 0.3922164440 -0.0150490683 -0.0581177063 -0.0554592311 -0.2472060323
  0.0091741271 0.4380710721 -0.0019174889 0.4123097658 0.0548144914 -0.0669646263
  0.0356778279 -0.0219237730 0.0596942678 0.0181772429 -0.0478776842 0.9984862804
  -0.0008090213 0.0072638853 -0.0021113669 0.0028527013 -0.0339449011 0.0012019821
  -0.0276663862 -0.0228256937 0.0594954900 0.0521066524 0.0467753150 -0.9972310066
  0.0010604113 0.0068799118 -0.0020314150 0.0019716674 0.1215026677 -0.0029434308
  -0.0508979931 -0.0152418241 0.0237904843 0.0583909415 0.1457762271 -0.9873849154
  0.0011050738 0.0312350299 -0.0056998357 0.0012725375 0.1301466227 -0.0041509313
  0.0597957484 -0.0152844815 0.0234680604 0.0589697994 -0.1449005306 0.9875704646
  -0.0009339899 0.0312181935 -0.0056770947 0.0012615563 -0.1295253485 0.0041525532
  0.0323061720 -0.0354720466 -0.0031527027 0.0058994023 -0.0512859486 -0.9986658692
  0.0000309632 -0.0005806530 0.0016174418 0.0002232561 0.1057975963 0.0033464662
  -0.0264448058 -0.0354470089 -0.0031523539 0.0114090201 0.0514624380 0.9984931946
  -0.0005694591 -0.0005710266 0.0016300271 0.0002190991 -0.1046594307 -0.0033967716
}

frame 15 {
  0.0000000000 0.0000000000 0.1000000015 0.7071068287 -0.0000000000 -0.0000000000
  0.2576283813 -0.6233775616 -0.0048920210 -0.5045900345 0.4953704178 -0.5047982931
  0.0000080228 0.5389485359 -0.0003201365 0.0805470347 -0.0004037574 0.0040182853
  -0.1367243677 0.0571504012 0.0040816423 -0.0700806603 -0.0977144316 -0.6936812401
  0.0188876707 0.4479109347 0.0003716117 0.1211088151 0.6107358336 -0.3950594664
  0.1511484683 0.0609207675 0.0139611354 -0.1913597286 0.2173827738 0.6085129976
  -0.0185872987 0.4409644604 -0.0006148284 0.1831610501 -0.5542731881 0.5664971471
  0.1626309603 0.2403563261 -0.0117709227 -0.1619525254 0.0909726173 0.4814732075
  -0.0161364246 0.5102320910 -0.0038873740 0.4059998393 0.0168646742 -0.0399877429
  -0.1620082706 0.2369898409 -0.0118177654 -0.2048887759 -0.1164847612 -0.4870372713
  0.0163820460 0.5010632277 -0.0046488307 0.4893148839 -0.0137865953 0.0423032567
  0.1429835856 0.3892849982 -0.0097044520 -0.1342950463 0.0926314592 0.2690726221
  -0.0101477653 0.4381460547 -0.0041801929 0.5262781382 -0.0601941012 0.0819416195
  -0.1375856400 0.3922164142 -0.0150490673 -0.0650151670 -0.0534382164 -0.2478217930
  0.0091991127 0.4380235970 -0.0021853261 0.4334265292 0.0575250164 -0.0648119375
  0.0356778279 -0.0219237842 0.0596942678 0.0181772429 -0.0478776842 0.9984862804
  -0.0008090204 0.0072639524 -0.0021114822 0.0028527013 -0.0339449011 0.0012019821
  -0.0276663844 -0.0228257049 0.0594954900 0.0521066524 0.0467753150 -0.9972310066
  0.0010604020 0.0068798885 -0.0020314795 0.0019716674 0.1215026677 -0.0029434308
  -0.0508979931 -0.0152418651 0.0237904862 0.0583906434 0.1457758397 -0.9873849154
  0.0011050645 0.0312349759 -0.0056998990 0.0012725542 0.1301465929 -0.0041509266
  0.0597957484 -0.0152844926 0.0234680604 0.0589697994 -0.1449005306 0.9875704646
  -0.0009339824 0.0312181935 -0.0056771543 0.0012615563 -0.1295253485 0.0041525532
  0.0323061757 -0.0354720876 -0.0031527022 0.0058994023 -0.0512859486 -0.9986658692
  0.0000309605 -0.0005807275 0.0016175050 0.0002232561 0.1057975963 0.0033464662
  -0.0264448039 -0.0354470797 -0.0031523525 0.0114090201 0.0514624380 0.9984931946
  -0.0005694628 -0.0005710713 0.0016299619 0.0002190991 -0.1046594307 -0.0033967716
}

frame 16 {
  0.0000000000 0.0000000000 0.1000000015 0.7071068287 -0.0000000000 -0.0000000000
  0.2576283813 -0.6257467270 -0.0048920210 -0.5045900345 0.4953704178 -0.5047982931
  0.0000080223 0.5389485359 -0.0003201961 0.0851852298 -0.0004214257 0.0040176716
  -0.1367243826 0.0571504198 0.0040815226 -0.0648364946 -0.0962597653 -0.6924008727
  0.0188831016 0.4480077922 0.0004640399 0.1163077205 0.6077463031 -0.3838371336
  0.1511484832 0.0609207898 0.0139611354 -0.1846659034 0.2160595059 0.6006242037
  -0.0184996128 0.4414238632 -0.0005838531 0.1800894290 -0.5423737168 0.5685632229
  0.1626309305 0.2403563559 -0.0117710428 -0.1516183168 0.0876204669 0.4780731797
  -0.0160482973 0.5104843974 -0.0036513694 0.3837339878 0.0193437804 -0.0351004601
  -0.1620082706 0.2369898558 -0.0118177654 -0.2005803138 -0.1162315458 -0.4805032015
  0.0162434988 0.5013703704 -0.0045830198 0.4910979569 -0.0164213553 0.0385728702
  0.1429835707 0.3892850280 -0.0097044529 -0.1405737251 0.1001368091 0.2746291757
  -0.0103777498 0.4379616380 -0.0042888820 0.5242990851 -0.0597265102 0.0829378814
  -0.1375856549 0.3922164738 -0.0150490683 -0.0709770173 -0.0510446317 -0.2490903586
  0.0092427656 0.4379658103 -0.0024208128 0.4530085623 0.0602652431 -0.0619392395
  0.0356778279 -0.0219237637 0.0596942678 0.0181776024 -0.0478776544 0.9984862208
  -0.0008090213 0.0072639161 -0.0021114266 0.0028526955 -0.0339449048 0.0012019814
  -0.0276663862 -0.0228256844 0.0594954900 0.0521066524 0.0467753150 -0.9972310066
  0.0010604095 0.0068799336 -0.0020313596 0.0019716674 0.1215026677 -0.0029434308
  -0.0508979931 -0.0152418446 0.0237904843 0.0583906211 0.1457759887 -0.9873849154
  0.0011050589 0.0312349554 -0.0056999498 0.0012725607 0.1301465929 -0.0041509219
  0.0597957484 -0.0152845019 0.0234680604 0.0589697994 -0.1449005306 0.9875704646
  -0.0009339824 0.0312182084 -0.0056770947 0.0012615563 -0.1295253485 0.0041525532
  0.0323061720 -0.0354720652 -0.0031527027 0.0058978871 -0.0512855202 -0.9986658692
  0.0000309679 -0.0005807201 0.0016173747 0.0002232504 0.1057976112 0.0033464681
  -0.0264448058 -0.0354470313 -0.0031523539 0.0114085246 0.0514624380 0.9984932542
  -0.0005694600 -0.0005710081 0.0016300066 0.0002190875 -0.1046594381 -0.0033967677
}

frame 17 {
  0.0000000000 0.0000000000 0.1000000015 0.7071068287 -0.0000000000 -0.0000000000
  0.2576283813 -0.6278379560 -0.0048920205 -0.5045900345 0.4953704178 -0.5047982931
  0.0000080227 0.5389485359 -0.0003202557 0.0879311562 -0.0004318841 0.0040172627
  -0.1367243826 0.0571504422 0.0040814630 -0.0599786974 -0.0950497612 -0.6911481619
  0.0188778657 0.4480989575 0.0005539297 0.1128407121 0.6039525270 -0.3764514923
  0.1511484832 0.0609207824 0.0139611354 -0.1759478301 0.2120586783 0.5963104367
  -0.0184331760 0.4417432845 -0.0005104640 0.1766123623 -0.5331652761 0.5679216385
  0.1626309305 0.2403563708 -0.0117711024 -0.1416898370 0.0842532441 0.4753243327
  -0.0159731768 0.5106998682 -0.0034188814 0.3625536859 0.0215468649 -0.0308993366
  -0.1620082706 0.2369898856 -0.0118177654 -0.1952841282 -0.1134903133 -0.4737844467
  0.0160831623 0.5016954541 -0.0045339614 0.4934710562 -0.0178927556 0.0365501121
  0.1429835707 0.3892849982 -0.0097044520 -0.1455028355 0.1066931412 0.2794446051
  -0.0105768070 0.4378033280 -0.0043601319 0.5217506289 -0.0592620410 0.0838313550
  -0.1375856549 0.3922164440 -0.0150491875 -0.0755436867 -0.0485667661 -0.2508258522
  0.0092990510 0.4379051626 -0.0026050806 0.4691705406 0.0626772642 -0.0587422960
  0.0356778279 -0.0219237730 0.0596942678 0.0181768518 -0.0478780083 0.9984862208
  -0.0008090166 0.0072639310 -0.0021114773 0.0028527102 -0.0339449085 0.0012019837
  -0.0276663899 -0.0228256937 0.0594954304 0.0521066524 0.0467753150 -0.9972310066
  0.0010604113 0.0068799192 -0.0020314150 0.0019716674 0.1215026677 -0.0029434308
  -0.0508979931 -0.0152418241 0.0237904247 0.0583905168 0.1457763612 -0.9873848557
  0.0011050776 0.0312350225 -0.0056998711 0.0012725592 0.1301467121 -0.0041509205
  0.0597957484 -0.0152844815 0.0234680008 0.0589697883 -0.1449008584 0.9875704050
  -0.0009339936 0.0312182140 -0.0056770639 0.0012615279 -0.1295253783 0.0041525583
  0.0323061720 -0.0354720429 -0.0031527623 0.0058978871 -0.0512855202 -0.9986658692
  0.0000309688 -0.0005806493 0.0016174288 0.0002232504 0.1057976112 0.0033464681
  -0.0264448058 -0.0354470089 -0.0031524135 0.0114085358 0.0514624566 0.9984932542
  -0.0005694581 -0.0005710485 0.0016300702 0.0002190928 -0.1046594381 -0.0033967656
}

frame 18 {
  0.0000000000 0.0000000000 0.1000000015 0.7071068287 -0.0000000000 -0.0000000000
  0.2576283813 -0.6294368505 -0.0048920205 -0.5045900345 0.4953704178 -0.5047982931
  0.0000080222 0.5389485359 -0.0003201961 0.0886046588 -0.0004344489 0.0040171570
  -0.1367243528 0.0571504161 0.0040815226 -0.0562194921 -0.0943346098 -0.6898907423
  0.0188725628 0.4481829703 0.0006283158 0.1110790372 0.6000640392 -0.3737301230
  0.1511484832 0.0609207526 0.0139611354 -0.1660331488 0.2057482749 0.5962077379
  -0.0184040293 0.4418829978 -0.0004003118 0.1730501056 -0.5277901888 0.5643817186
  0.1626309305 0.2403563559 -0.0117710428 -0.1335052401 0.0813777596 0.4733899534
  -0.0159177613 0.5108595490 -0.0032242984 0.3452260792 0.0232398063 -0.0277633313
  -0.1620082706 0.2369898558 -0.0118177654 -0.1891254485 -0.1082320064 -0.4675661922
  0.0159165300 0.5020108819 -0.0044969842 0.4957016408 -0.0179924872 0.0365132578
  0.1429836005 0.3892849684 -0.0097044520 -0.1488795429 0.1116469577 0.2830856740
  -0.0107265487 0.4376854897 -0.0043992475 0.5192899108 -0.0588759035 0.0845122784
  -0.1375856251 0.3922164738 -0.0150490683 -0.0785962716 -0.0464934409 -0.2524647415
  0.0093507804 0.4378546476 -0.0027313046 0.4808647037 0.0645340011 -0.0559923314
  0.0356778279 -0.0219237693 0.0596942678 0.0181776024 -0.0478776544 0.9984862208
  -0.0008090204 0.0072639007 -0.0021114899 0.0028526955 -0.0339449048 0.0012019814
  -0.0276663899 -0.0228257198 0.0594954900 0.0521066524 0.0467753150 -0.9972310066
  0.0010604132 0.0068798889 -0.0020314790 0.0019716674 0.1215026677 -0.0029434308
  -0.0508979931 -0.0152418492 0.0237904843 0.0583906211 0.1457759887 -0.9873849154
  0.0011050664 0.0312349778 -0.0056998902 0.0012725607 0.1301465929 -0.0041509219
  0.0597957484 -0.0152845066 0.0234680604 0.0589697994 -0.1449005306 0.9875704646
  -0.0009339899 0.0312182084 -0.0056771543 0.0012615563 -0.1295253485 0.0041525532
  0.0323061720 -0.0354720727 -0.0031527027 0.0058978200 -0.0512858778 -0.9986659288
  0.0000309660 -0.0005807023 0.0016173130 0.0002232638 0.1057975963 0.0033464588
  -0.0264448058 -0.0354470350 -0.0031523539 0.0114085358 0.0514624566 0.9984932542
  -0.0005694544 -0.0005709962 0.0016300068 0.0002190928 -0.1046594381 -0.0033967656
}

frame 19 {
  0.0000000000 0.0000000000 0.1000000015 0.7071068287 -0.0000000000 -0.0000000000
  0.2576283813 -0.6304203272 -0.0048920205 -0.5045900345 0.4953704178 -0.5047982931
  0.0000080225 0.5389485359 -0.0003201365 0.0870870501 -0.0004286692 0.0040173908
  -0.1367243528 0.0571504049 0.0040816423 -0.0539503135 -0.0941825509 -0.6886585951
  0.0188677758 0.4482578337 0.0006782762 0.1111394912 0.5966821313 -0.3758588135
  0.1511484832 0.0609207712 0.0139611354 -0.1555208415 0.1974835545 0.6003946066
  -0.0184189230 0.4418291152 -0.0002648339 0.1695413589 -0.5267937183 0.5578582883
  0.1626309305 0.2403563261 -0.0117709227 -0.1281780750 0.0794646069 0.4722720981
  -0.0158845261 0.5109556913 -0.0030961148 0.3340091705 0.0242802650 -0.0258626770
  -0.1620082706 0.2369898409 -0.0118177654 -0.1823552102 -0.1008917913 -0.4624434412
  0.0157610849 0.5022916198 -0.0044651181 0.4970930517 -0.0168065522 0.0383426473
  0.1429836005 0.3892849982 -0.0097044520 -0.1507863551 0.1146633998 0.2853130102
  -0.0108176544 0.4376143813 -0.0044168457 0.5175538063 -0.0586255565 0.0849263445
  -0.1375856251 0.3922164142 -0.0150490673 -0.0802899525 -0.0451442786 -0.2536006868
  0.0093862154 0.4378219247 -0.0028027594 0.4877884984 0.0656815097 -0.0541816019
  0.0356778279 -0.0219237823 0.0596942678 0.0181775931 -0.0478776358 0.9984862804
  -0.0008090241 0.0072638793 -0.0021114266 0.0028526932 -0.0339449085 0.0012019814
  -0.0276663899 -0.0228257030 0.0594954900 0.0521063879 0.0467752703 -0.9972310662
  0.0010604076 0.0068799406 -0.0020314229 0.0019716765 0.1215026453 -0.0029434194
  -0.0508979894 -0.0152418632 0.0237904862 0.0583906434 0.1457758397 -0.9873849154
  0.0011050589 0.0312349834 -0.0056998911 0.0012725542 0.1301465929 -0.0041509266
  0.0597957522 -0.0152844908 0.0234680604 0.0589697994 -0.1449006498 0.9875704646
  -0.0009339862 0.0312182009 -0.0056771543 0.0012615563 -0.1295253485 0.0041525541
  0.0323061720 -0.0354720838 -0.0031527022 0.0058994023 -0.0512859486 -0.9986658692
  0.0000309653 -0.0005807908 0.0016174492 0.0002232561 0.1057975963 0.0033464662
  -0.0264448095 -0.0354470797 -0.0031523525 0.0114090070 0.0514624417 0.9984931946
  -0.0005694600 -0.0005710612 0.0016300230 0.0002190999 -0.1046594307 -0.0033967679
}

frame 20 {
  0.0000000000 0.0000000000 0.1000000015 0.7071068287 -0.0000000000 -0.0000000000
  0.2576283813 -0.6307470202 -0.0048920205 -0.5045900345 0.4953704178 -0.5047982931
  0.0000080228 0.5389485359 -0.0003201365 0.0834346712 -0.0004147578 0.0040179151
  -0.1367243528 0.0571504273 0.0040816418 -0.0532421842 -0.0945031568 -0.6875520945
  0.0188644230 0.4483186305 0.0006997436 0.1130019799 0.5940939188 -0.3826739192
  0.1511484832 0.0609208234 0.0139611345 -0.1449790001 0.1877655983 0.6083155274
  -0.0184723809 0.4415952861 -0.0001212677 0.1661452502 -0.5300932527 0.5485796332
  0.1626309305 0.2403563708 -0.0117709236 -0.1263535172 0.0788029954 0.4719123542
  -0.0158737265 0.5109872222 -0.0030519180 0.3301784694 0.0246247370 -0.0252346788
  -0.1620082706 0.2369898856 -0.0118177664 -0.1755235791 -0.0923628509 -0.4588646293
  0.0156342164 0.5025145411 -0.0044354834 0.4973198175 -0.0146408342 0.0415983871
  0.1429836005 0.3892850280 -0.0097044529 -0.1513911337 0.1156600565 0.2860516310
  -0.0108478069 0.4375908971 -0.0044215396 0.5169391632 -0.0585402213 0.0850626901
  -0.1375856251 0.3922164738 -0.0150490683 -0.0808224231 -0.0446839482 -0.2539990246
  0.0093987249 0.4378107190 -0.0028252974 0.4900456071 0.0660636947 -0.0535610728
  0.0356778279 -0.0219237600 0.0596942678 0.0181776024 -0.0478776544 0.9984862208
  -0.0008090213 0.0072639235 -0.0021114266 0.0028526955 -0.0339449048 0.0012019814
  -0.0276663881 -0.0228256807 0.0594954900 0.0521063544 0.0467753187 -0.9972309470
  0.0010604113 0.0068799267 -0.0020313147 0.0019716544 0.1215026528 -0.0029434226
  -0.0508979931 -0.0152418399 0.0237904843 0.0583909415 0.1457762271 -0.9873849154
  0.0011050683 0.0312350076 -0.0056999633 0.0012725375 0.1301466227 -0.0041509313
  0.0597957484 -0.0152844973 0.0234680604 0.0589697994 -0.1449005306 0.9875704646
  -0.0009339936 0.0312182084 -0.0056770947 0.0012615563 -0.1295253485 0.0041525532
  0.0323061720 -0.0354720615 -0.0031527027 0.0058978871 -0.0512855202 -0.9986658692
  0.0000309651 -0.0005806717 0.0016173691 0.0002232504 0.1057976112 0.0033464681
  -0.0264448076 -0.0354470275 -0.0031523539 0.0114090294 0.0514624491 0.9984931350
  -0.0005694600 -0.0005709961 0.0016300216 0.0002191009 -0.1046594307 -0.0033967686
}

