MD5Version 10
commandline ""

numFrames 11
numJoints 85
frameRate 60
numAnimatedComponents 510

hierarchy {
  "origin" -1 63 0 //
  "hips" 0 63 6 //
  "spine" 1 63 12 //
  "ribs" 2 63 18 //
  "neck" 3 63 24 //
  "neckcontol" 4 63 30 //
  "head" 4 63 36 //
  "jaw" 6 63 42 //
  "lower_lip0" 7 63 48 //
  "lip.003" 8 63 54 //
  "lip.002" 9 63 60 //
  "lip.001" 10 63 66 //
  "lip" 11 63 72 //
  "eye.L" 6 63 78 //
  "eye.R" 6 63 84 //
  "upper_lip0" 6 63 90 //
  "lip.004" 15 63 96 //
  "lip.005" 16 63 102 //
  "lip.006" 17 63 108 //
  "lip.007" 18 63 114 //
  "eyelidIK3.L" 6 63 120 //
  "eyelid2.L" 20 63 126 //
  "eyelid3.L" 21 63 132 //
  "eyelidIK2.L" 6 63 138 //
  "eyelid1.L" 23 63 144 //
  "eyelid.L" 24 63 150 //
  "eyelidIK3.R" 6 63 156 //
  "eyelid2.R" 26 63 162 //
  "eyelid3.R" 27 63 168 //
  "eyelidIK2.R" 6 63 174 //
  "eyelid1.R" 29 63 180 //
  "eyelid.R" 30 63 186 //
  "head_tag" 4 63 192 //
  "shoulder.R" 3 63 198 //
  "upper_arm.R" 33 63 204 //
  "forearm.R" 34 63 210 //
  "hand.R" 35 63 216 //
  "finger_index.01.R" 36 63 222 //
  "finger_index.02.R" 37 63 228 //
  "finger_index.03.R" 38 63 234 //
  "thumb.01.R" 36 63 240 //
  "thumb.02.R" 40 63 246 //
  "thumb.03.R" 41 63 252 //
  "tag_weapon" 36 63 258 //
  "finger_middle.01.R" 36 63 264 //
  "finger_middle.02.R" 44 63 270 //
  "finger_middle.03.R" 45 63 276 //
  "finger_ring.01.R" 36 63 282 //
  "finger_ring.02.R" 47 63 288 //
  "finger_ring.03.R" 48 63 294 //
  "finger_pinky.01.R" 36 63 300 //
  "finger_pinky.02.R" 50 63 306 //
  "finger_pinky.03.R" 51 63 312 //
  "hand_armor.R" 35 63 318 //
  "tag_gear" 3 63 324 //
  "shoulder.L" 3 63 330 //
  "upper_arm.L" 55 63 336 //
  "forearm.L" 56 63 342 //
  "hand_armor.L" 57 63 348 //
  "hand.L" 57 63 354 //
  "finger_index.01.L" 59 63 360 //
  "finger_index.02.L" 60 63 366 //
  "finger_index.03.L" 61 63 372 //
  "thumb.01.L" 59 63 378 //
  "thumb.02.L" 63 63 384 //
  "thumb.03.L" 64 63 390 //
  "finger_middle.01.L" 59 63 396 //
  "finger_middle.02.L" 66 63 402 //
  "finger_middle.03.L" 67 63 408 //
  "finger_ring.01.L" 59 63 414 //
  "finger_ring.02.L" 69 63 420 //
  "finger_ring.03.L" 70 63 426 //
  "finger_pinky.01.L" 59 63 432 //
  "finger_pinky.02.L" 72 63 438 //
  "finger_pinky.03.L" 73 63 444 //
  "thigh.R" 1 63 450 //
  "shin.R" 75 63 456 //
  "thigh.L" 1 63 462 //
  "shin.L" 77 63 468 //
  "ankle.R" 0 63 474 //
  "foot.R" 79 63 480 //
  "toe.R" 79 63 486 //
  "ankle.L" 0 63 492 //
  "toe.L" 82 63 498 //
  "foot.L" 82 63 504 //
}

bounds {
  ( -1.945048 -2.700210 -0.041077 ) ( 5.991968 2.008111 12.974941 )
  ( -1.917337 -2.680727 0.026240 ) ( 6.004648 2.001715 12.959403 )
  ( -1.836411 -2.658530 0.217322 ) ( 6.035739 1.985475 12.915839 )
  ( -1.706111 -2.994736 0.512377 ) ( 6.056131 1.958213 12.854560 )
  ( -1.532097 -3.341710 0.888255 ) ( 6.052924 1.920798 12.796074 )
  ( -1.324636 -3.640180 1.314284 ) ( 6.051095 1.875642 12.757268 )
  ( -1.101777 -3.857631 1.733259 ) ( 6.059828 1.827125 12.740803 )
  ( -0.889051 -3.989728 2.123871 ) ( 6.066099 1.781223 12.743521 )
  ( -0.819568 -4.053708 2.442436 ) ( 6.053365 1.763496 12.757007 )
  ( -0.833581 -4.076114 2.651039 ) ( 6.029202 1.818918 12.768635 )
  ( -0.843644 -4.080544 2.723924 ) ( 6.019765 1.836067 12.772512 )
}

baseframe {
  ( 0.000000 0.000000 0.000000 ) ( 0.000000 -0.707107 -0.707107 )
  ( 0.184526 6.906084 -0.013687 ) ( -0.063425 -0.704162 0.063709 )
  ( -0.000000 1.240110 0.000000 ) ( 0.191587 0.001295 -0.009840 )
  ( -0.000000 1.426178 -0.000000 ) ( -0.063779 -0.002332 0.012698 )
  ( -0.000000 1.821084 0.000000 ) ( -0.145265 -0.001328 -0.001879 )
  ( 0.000000 0.808121 0.000000 ) ( 0.001844 -0.515148 -0.857099 )
  ( -0.002195 0.809023 0.000794 ) ( 0.040325 0.000217 -0.001349 )
  ( -0.003138 0.224356 0.163703 ) ( -0.591717 0.381594 0.595702 )
  ( -0.263320 0.555491 -0.218415 ) ( -0.002580 0.003661 -0.873876 )
  ( 0.000000 0.017501 -0.000000 ) ( 0.220569 0.655870 0.690904 )
  ( 0.000000 0.135389 -0.000001 ) ( 0.037467 -0.018190 0.200649 )
  ( 0.000000 0.113742 0.000000 ) ( -0.125321 0.000000 0.210707 )
  ( 0.000000 0.113741 -0.000000 ) ( 0.037467 0.018190 0.200649 )
  ( 0.262165 0.811893 0.662538 ) ( -0.000000 -0.752543 -0.658544 )
  ( -0.244069 0.811856 0.663658 ) ( -0.000000 -0.752542 -0.658544 )
  ( 0.225828 0.266057 0.774515 ) ( 0.047000 0.705543 -0.047000 )
  ( -0.000000 0.017501 -0.000000 ) ( 0.186223 0.743981 0.598525 )
  ( -0.000000 0.145787 -0.000001 ) ( 0.114298 0.017382 0.174281 )
  ( -0.000000 0.112094 0.000000 ) ( -0.001650 -0.003770 0.248557 )
  ( -0.000000 0.111594 0.000000 ) ( 0.099455 -0.020017 0.173948 )
  ( 0.361090 0.810247 0.681599 ) ( 0.046999 0.705543 -0.046999 )
  ( -0.000000 0.011231 0.000000 ) ( 0.138551 0.777593 0.585011 )
  ( 0.000000 0.112704 0.000001 ) ( 0.248666 0.003044 0.385872 )
  ( 0.360328 0.777492 0.684141 ) ( 0.046999 0.705543 -0.046999 )
  ( -0.000000 0.010076 -0.000000 ) ( -0.135461 0.512721 0.787661 )
  ( -0.000000 0.108887 -0.000001 ) ( -0.349590 0.371748 0.224171 )
  ( -0.137678 0.812980 0.691455 ) ( 0.046999 0.705543 -0.046999 )
  ( -0.000000 0.011230 0.000000 ) ( 0.069059 0.752863 0.649633 )
  ( 0.000000 0.131865 -0.000000 ) ( 0.201215 -0.007965 0.324740 )
  ( -0.136810 0.780376 0.690930 ) ( 0.046999 0.705543 -0.046999 )
  ( -0.000000 0.010076 0.000000 ) ( 0.085597 0.645822 0.755134 )
  ( -0.000000 0.128464 -0.000001 ) ( -0.122912 -0.007699 0.282440 )
  ( -0.002195 0.809023 0.000794 ) ( 0.040325 0.000217 -0.001349 )
  ( -0.014833 1.825302 -0.071422 ) ( 0.548058 -0.398517 -0.527101 )
  ( 0.000000 1.493901 0.000000 ) ( 0.337192 0.599744 -0.369520 )
  ( 0.000000 2.103016 0.000000 ) ( -0.166080 0.071882 0.080628 )
  ( 0.000001 1.823368 0.000000 ) ( 0.026122 0.716524 0.005963 )
  ( 0.288927 0.945606 -0.016979 ) ( -0.100840 -0.682277 -0.030495 )
  ( 0.000000 0.310931 0.000000 ) ( -0.001887 -0.003346 -0.140544 )
  ( -0.000000 0.255058 0.000000 ) ( 0.014527 -0.020137 -0.079928 )
  ( 0.182657 0.102359 0.122068 ) ( 0.068809 0.469953 0.338161 )
  ( -0.000000 0.450617 0.000000 ) ( -0.099065 0.025937 0.025593 )
  ( 0.000000 0.295731 -0.000001 ) ( 0.108671 0.022517 0.026610 )
  ( 0.586577 1.443575 0.291631 ) ( 0.494772 0.504178 0.517254 )
  ( 0.081677 0.956433 -0.018380 ) ( -0.107088 -0.736173 -0.098262 )
  ( 0.000000 0.323707 0.000000 ) ( -0.004845 -0.051318 -0.175658 )
  ( 0.000000 0.229679 -0.000000 ) ( 0.016195 -0.015133 -0.050692 )
  ( -0.151893 0.951490 -0.015787 ) ( -0.155854 -0.744157 -0.130418 )
  ( -0.000001 0.298948 -0.000000 ) ( 0.022449 -0.039879 -0.150750 )
  ( -0.000000 0.222754 0.000000 ) ( 0.017543 -0.013115 -0.049400 )
  ( -0.332551 0.872253 0.059175 ) ( -0.270536 -0.079021 -0.029623 )
  ( 0.000000 0.247823 -0.000000 ) ( -0.085055 0.000243 0.004201 )
  ( 0.000000 0.155400 0.000000 ) ( -0.148243 -0.000940 -0.003131 )
  ( 0.531379 1.351308 -0.004340 ) ( 0.015885 0.004080 0.999865 )
  ( 0.002183 1.423120 -0.451181 ) ( 0.675237 0.001866 -0.002772 )
  ( 0.014634 1.825497 -0.071451 ) ( 0.552755 0.408370 0.515946 )
  ( 0.000000 1.493901 0.000000 ) ( 0.498017 -0.047311 0.047143 )
  ( 0.000000 2.103018 -0.000001 ) ( -0.075532 0.079375 0.168458 )
  ( 0.093228 1.351308 0.523154 ) ( 0.654641 0.002699 0.755929 )
  ( 0.000000 1.823368 -0.000000 ) ( -0.025836 0.094228 -0.007102 )
  ( 0.286576 1.006395 -0.107107 ) ( 0.072174 0.602406 -0.086389 )
  ( 0.000000 0.249955 0.000000 ) ( -0.000083 -0.010683 -0.125485 )
  ( -0.000000 0.254363 -0.000000 ) ( -0.016009 0.049143 -0.075943 )
  ( 0.120542 0.102358 -0.183667 ) ( 0.017564 -0.626009 0.348850 )
  ( -0.000000 0.445150 0.000000 ) ( 0.067621 -0.024966 0.008198 )
  ( 0.000000 0.302324 0.000000 ) ( -0.058338 0.684439 0.061834 )
  ( 0.073565 1.013167 -0.024132 ) ( 0.119028 -0.795213 0.100389 )
  ( -0.000000 0.266205 0.000000 ) ( 0.003820 0.009027 0.165078 )
  ( -0.000000 0.229740 -0.000000 ) ( -0.004806 0.012921 0.052363 )
  ( -0.127263 1.003840 0.060605 ) ( 0.184529 -0.779480 0.128005 )
  ( -0.000000 0.246800 0.000000 ) ( -0.001225 -0.003214 0.130582 )
  ( 0.000000 0.222126 -0.000000 ) ( 0.002051 0.007113 0.050428 )
  ( -0.358085 0.893698 0.063869 ) ( 0.227228 -0.775272 0.133791 )
  ( 0.000000 0.221431 -0.000000 ) ( -0.006730 0.001955 0.092569 )
  ( -0.000000 0.154458 0.000000 ) ( -0.003598 -0.015304 0.148050 )
  ( -0.810392 0.550812 -0.372493 ) ( -0.984551 0.027405 -0.000267 )
  ( 0.000000 3.626385 -0.000000 ) ( -0.211921 0.002430 0.007077 )
  ( 0.782400 0.551416 -0.372917 ) ( -0.984498 -0.026294 0.009171 )
  ( -0.000000 3.626384 0.000000 ) ( -0.211935 -0.017722 -0.006644 )
  ( -0.305859 0.828940 1.124649 ) ( -0.552637 0.176065 -0.801670 )
  ( -0.090614 0.138320 1.006144 ) ( 0.752092 0.018236 0.046746 )
  ( -0.090614 0.138320 1.006144 ) ( -0.854351 0.076975 -0.055594 )
  ( -0.305858 0.828940 -1.124649 ) ( 0.585870 -0.181993 -0.777713 )
  ( -0.005721 0.138319 -1.010200 ) ( -0.046568 0.515226 -0.854890 )
  ( -0.005721 0.138319 -1.010200 ) ( -0.753536 -0.000864 0.003278 )
}

frame 0 {
  -0.000000 0.000000 -0.001428 -0.707107 -0.000000 -0.000000
  0.309123 6.437504 -0.106869 -0.075371 -0.540867 0.048998
  -0.000000 1.240110 -0.000000 0.052507 -0.000062 -0.047498
  -0.000000 1.426178 0.000000 -0.184318 -0.000420 0.040287
  0.000000 1.821082 -0.000000 -0.059450 -0.193375 -0.058793
  0.000000 0.808121 -0.000000 0.001844 -0.515148 -0.857099
  -0.044148 0.766293 0.024775 0.045046 0.018595 0.043682
  -0.003137 0.224358 0.163702 -0.582226 0.395844 0.586146
  -0.259541 0.557511 -0.217253 0.917771 -0.378686 0.089287
  0.000000 0.017501 -0.000000 0.766855 -0.164101 -0.216398
  0.000000 0.135389 0.000001 0.077406 -0.083308 0.226103
  -0.000000 0.113741 -0.000000 -0.176718 -0.042501 0.164695
  -0.000000 0.113742 -0.000001 -0.031558 -0.009163 0.230041
  0.262165 0.811894 0.662538 0.061119 0.848054 0.523650
  -0.244068 0.811857 0.663658 0.073789 0.846507 0.523269
  0.224683 0.261799 0.775026 0.064377 -0.710294 0.225210
  -0.000000 0.017499 0.000000 0.694299 -0.191224 -0.199823
  0.000000 0.145787 -0.000000 0.140073 -0.029166 0.201370
  0.000000 0.112094 0.000001 -0.076060 -0.067477 0.233263
  0.000000 0.111594 0.000001 0.024045 -0.043243 0.223826
  0.365935 0.793586 0.683418 0.046999 0.705543 -0.046999
  -0.000000 0.011232 0.000000 0.125932 0.784485 0.580794
  -0.000000 0.112704 0.000000 0.249001 -0.023430 0.387489
  0.360328 0.777494 0.684140 0.046999 0.705543 -0.046999
  -0.000000 0.010075 0.000000 -0.099297 0.457441 0.813067
  -0.000000 0.108887 0.000001 -0.431279 0.352683 0.307498
  -0.136625 0.803882 0.692455 0.046999 0.705543 -0.046999
  0.000000 0.011231 0.000000 -0.008426 0.730560 0.661906
  0.000000 0.131865 0.000000 0.067457 -0.083498 0.375702
  -0.136810 0.780378 0.690930 0.046999 0.705543 -0.046999
  -0.000001 0.010075 -0.000000 0.062122 0.627371 0.752991
  0.000000 0.128464 -0.000001 -0.209364 -0.078930 0.364853
  -0.002195 0.809022 0.000794 0.040325 0.000217 -0.001349
  -0.014832 1.825301 -0.071422 0.467192 -0.533469 -0.463268
  -0.000000 1.493901 0.000001 0.059428 0.627281 -0.679270
  0.000001 2.103014 -0.000000 -0.812206 0.031445 0.394308
  0.000001 1.823368 0.000001 0.232623 0.437869 -0.205557
  0.288927 0.945606 -0.016979 -0.051765 -0.682662 -0.029421
  0.000000 0.310930 0.000000 0.000222 -0.001467 -0.002344
  0.000000 0.255058 -0.000000 -0.029958 -0.071880 -0.099401
  0.182657 0.102358 0.122067 -0.147784 0.530629 0.238881
  -0.000000 0.450618 0.000000 -0.221108 -0.001969 -0.022316
  0.000000 0.295730 -0.000000 0.099052 0.156016 -0.150739
  0.586577 1.443575 0.291630 0.494772 0.504178 0.517254
  0.081676 0.956432 -0.018380 -0.233333 -0.644845 -0.350968
  -0.000000 0.323706 0.000003 0.060391 -0.029310 -0.532553
  0.000000 0.229678 -0.000001 0.030185 0.093456 -0.398630
  -0.151893 0.951489 -0.015787 -0.308112 -0.644040 -0.377191
  -0.000000 0.298947 -0.000003 0.096399 -0.030550 -0.429427
  -0.000000 0.222754 0.000001 0.006259 0.070167 -0.361974
  -0.332552 0.872253 0.059175 -0.391453 -0.056793 -0.073524
  -0.000001 0.247824 -0.000000 -0.418184 0.003178 -0.041860
  0.000001 0.155400 -0.000000 -0.503436 -0.045830 -0.035997
  0.531378 1.351308 -0.004339 0.015910 0.004093 0.999865
  0.002183 1.423120 -0.451181 0.675237 0.001866 -0.002772
  0.014634 1.825496 -0.071451 0.428741 0.516759 0.554093
  -0.000001 1.493901 0.000002 0.393187 0.314606 0.528206
  0.000000 2.103016 -0.000000 0.060762 0.499935 0.508538
  0.093228 1.351308 0.523154 0.654644 0.002695 0.755926
  0.000001 1.823369 0.000000 -0.056884 0.560516 -0.296864
  0.286577 1.006395 -0.107108 0.024627 0.598349 -0.059043
  -0.000001 0.249956 -0.000001 -0.029486 -0.012157 -0.324467
  0.000001 0.254363 0.000000 -0.075983 0.172994 -0.419743
  0.120541 0.102358 -0.183668 0.007132 -0.621642 0.355154
  -0.000001 0.445150 0.000000 0.209953 -0.024499 0.024210
  0.000001 0.302323 -0.000000 -0.250001 0.522657 0.319495
  0.073565 1.013167 -0.024132 0.021266 -0.812614 0.006524
  -0.000001 0.266204 0.000001 0.056298 0.004780 0.582640
  -0.000000 0.229740 0.000000 -0.022553 0.184712 0.188325
  -0.127264 1.003840 0.060603 0.076602 -0.797048 0.046927
  -0.000002 0.246799 -0.000000 -0.008472 -0.002391 0.639346
  0.000000 0.222126 -0.000000 -0.019109 0.249618 0.025123
  -0.358086 0.893699 0.063867 0.165925 -0.779853 0.118886
  0.000001 0.221431 0.000000 -0.065175 0.003525 0.301814
  0.000001 0.154459 0.000000 0.132116 0.263767 0.315014
  -0.810392 0.550811 -0.372493 -0.966435 0.110867 -0.082632
  -0.000000 3.626384 0.000000 -0.373016 0.002306 0.012456
  0.782400 0.551415 -0.372917 -0.932379 -0.100583 0.052530
  -0.000000 3.626385 -0.000000 -0.302329 -0.017285 -0.009478
  -1.406109 0.838118 1.299208 -0.369178 0.203943 -0.901430
  -0.090614 0.138320 1.006144 0.752092 0.018236 0.046746
  -0.090614 0.138320 1.006144 -0.852404 0.078746 -0.052999
  2.241435 0.812477 -1.543512 0.711378 -0.142690 -0.667010
  -0.005721 0.138320 -1.010200 -0.025764 -0.537679 0.842437
  -0.005721 0.138320 -1.010200 -0.753536 -0.000863 0.003278
}

frame 1 {
  -0.000000 0.000000 -0.001428 -0.707107 -0.000000 -0.000000
  0.309123 6.433055 -0.106869 -0.075414 -0.540861 0.049064
  -0.000000 1.240110 0.000000 0.049622 -0.000007 -0.047109
  0.000000 1.426178 0.000000 -0.183762 -0.001267 0.038037
  -0.000000 1.821083 0.000000 -0.059947 -0.193790 -0.059502
  0.000000 0.808122 0.000001 0.001844 -0.515148 -0.857099
  -0.044148 0.766295 0.024775 0.044650 0.018508 0.044076
  -0.003138 0.224357 0.163703 -0.582226 0.395844 0.586146
  -0.259541 0.557510 -0.217253 0.918299 -0.376527 0.090009
  0.000000 0.017501 -0.000000 0.768886 -0.163751 -0.217653
  0.000000 0.135389 -0.000000 0.077090 -0.085143 0.225984
  -0.000000 0.113741 0.000001 -0.177257 -0.043443 0.163971
  0.000000 0.113742 -0.000000 -0.033217 -0.010121 0.229835
  0.262165 0.811895 0.662537 0.061551 0.849220 0.521666
  -0.244069 0.811857 0.663658 0.074236 0.847658 0.521292
  0.224683 0.261799 0.775026 0.063656 -0.708858 0.228891
  -0.000000 0.017499 0.000000 0.696742 -0.190959 -0.201120
  -0.000000 0.145787 0.000000 0.139757 -0.030443 0.201332
  0.000000 0.112094 -0.000001 -0.076826 -0.069190 0.232828
  0.000000 0.111594 -0.000001 0.022404 -0.044160 0.224134
  0.365934 0.793585 0.683418 0.046999 0.705543 -0.046999
  -0.000000 0.011229 -0.000000 0.125930 0.784489 0.580789
  -0.000000 0.112704 0.000000 0.249009 -0.023435 0.387488
  0.360328 0.777494 0.684141 0.046999 0.705543 -0.046999
  -0.000000 0.010075 0.000000 -0.099298 0.457443 0.813065
  -0.000000 0.108887 0.000002 -0.431281 0.352683 0.307497
  -0.136625 0.803882 0.692454 0.046999 0.705543 -0.046999
  -0.000000 0.011230 -0.000000 -0.009420 0.730306 0.661894
  -0.000000 0.131865 -0.000000 0.065456 -0.085622 0.376057
  -0.136810 0.780377 0.690930 0.046999 0.705543 -0.046999
  -0.000000 0.010076 -0.000000 0.061200 0.627141 0.753066
  0.000000 0.128463 -0.000001 -0.211051 -0.080919 0.363877
  -0.002195 0.809024 0.000794 0.040325 0.000217 -0.001349
  -0.014833 1.825302 -0.071422 0.467192 -0.533469 -0.463268
  -0.000000 1.493901 0.000000 0.066023 0.627667 -0.680686
  -0.000000 2.103016 0.000000 -0.810622 0.031715 0.393540
  -0.000001 1.823367 -0.000001 0.228846 0.440382 -0.209168
  0.288926 0.945606 -0.016980 -0.051808 -0.682659 -0.029457
  0.000000 0.310931 -0.000000 0.000222 -0.001467 -0.002344
  0.000000 0.255058 -0.000001 -0.029955 -0.071882 -0.099364
  0.182656 0.102358 0.122067 -0.147819 0.530635 0.238878
  0.000000 0.450618 -0.000000 -0.221044 -0.001972 -0.022304
  -0.000000 0.295730 0.000001 0.099011 0.156017 -0.150743
  0.586577 1.443575 0.291630 0.494772 0.504178 0.517254
  0.081676 0.956433 -0.018380 -0.233389 -0.644827 -0.351014
  -0.000000 0.323706 -0.000001 0.060372 -0.029315 -0.532424
  -0.000000 0.229678 0.000002 0.030192 0.093440 -0.398718
  -0.151895 0.951490 -0.015788 -0.308170 -0.644005 -0.377253
  0.000000 0.298947 0.000001 0.096357 -0.030554 -0.429254
  0.000000 0.222753 -0.000000 0.006283 0.070147 -0.362084
  -0.332551 0.872254 0.059175 -0.391566 -0.056797 -0.073524
  0.000001 0.247823 -0.000000 -0.417962 0.003178 -0.041835
  -0.000000 0.155400 0.000000 -0.503558 -0.045839 -0.036018
  0.531378 1.351308 -0.004341 0.015854 0.004081 0.999866
  0.002183 1.423119 -0.451180 0.675237 0.001866 -0.002772
  0.014634 1.825496 -0.071451 0.424524 0.519424 0.558419
  -0.000001 1.493901 0.000000 0.411723 0.320323 0.515883
  0.000000 2.103016 0.000000 0.061049 0.499095 0.510936
  0.093227 1.351308 0.523154 0.654640 0.002699 0.755930
  -0.000001 1.823368 0.000001 -0.057938 0.547937 -0.305460
  0.286577 1.006395 -0.107107 0.024625 0.598349 -0.059037
  -0.000000 0.249956 0.000000 -0.029488 -0.012157 -0.324491
  -0.000001 0.254363 -0.000000 -0.075979 0.172995 -0.419726
  0.120542 0.102359 -0.183665 0.007123 -0.621637 0.355162
  0.000000 0.445152 -0.000000 0.209984 -0.024499 0.024216
  0.000001 0.302323 0.000000 -0.250020 0.522649 0.319501
  0.073565 1.013167 -0.024131 0.021270 -0.812614 0.006526
  -0.000000 0.266205 0.000000 0.056299 0.004780 0.582647
  0.000000 0.229739 -0.000000 -0.022557 0.184711 0.188313
  -0.127263 1.003841 0.060606 0.076608 -0.797047 0.046932
  -0.000002 0.246799 -0.000000 -0.008472 -0.002390 0.639347
  -0.000000 0.222127 -0.000000 -0.019111 0.249617 0.025114
  -0.358086 0.893699 0.063869 0.165927 -0.779852 0.118887
  -0.000000 0.221431 -0.000000 -0.065176 0.003525 0.301829
  0.000000 0.154458 -0.000000 0.132112 0.263767 0.314997
  -0.810392 0.550812 -0.372493 -0.960603 0.114384 -0.090769
  0.000000 3.626385 -0.000000 -0.409200 0.002268 0.013664
  0.782400 0.551417 -0.372917 -0.924354 -0.102368 0.050032
  -0.000000 3.626384 0.000000 -0.343926 -0.017027 -0.010783
  -1.375608 0.921124 1.290502 -0.369882 0.208331 -0.900331
  -0.090614 0.138320 1.006144 0.757211 0.017777 0.047201
  -0.090614 0.138320 1.006144 -0.849951 0.076720 -0.052257
  2.229512 0.894708 -1.532087 0.709553 -0.144782 -0.667992
  -0.005721 0.138320 -1.010200 -0.026062 -0.542329 0.839434
  -0.005721 0.138320 -1.010200 -0.758634 -0.000716 0.002966
}

frame 2 {
  -0.000000 0.000000 -0.001428 -0.707107 -0.000000 -0.000000
  0.309123 6.419667 -0.106869 -0.075543 -0.540843 0.049263
  0.000000 1.240110 0.000000 0.041492 0.000172 -0.045921
  -0.000000 1.426178 0.000000 -0.181803 -0.003658 0.031699
  0.000000 1.821084 -0.000000 -0.061441 -0.195036 -0.061634
  -0.000000 0.808123 -0.000000 0.001844 -0.515148 -0.857099
  -0.044148 0.766294 0.024775 0.043459 0.018247 0.045264
  -0.003138 0.224357 0.163703 -0.582226 0.395844 0.586146
  -0.259541 0.557511 -0.217253 0.919639 -0.370608 0.091979
  0.000000 0.017501 -0.000000 0.774417 -0.162788 -0.221182
  -0.000000 0.135389 0.000001 0.076283 -0.090264 0.225618
  0.000000 0.113742 -0.000002 -0.178709 -0.046053 0.161992
  0.000000 0.113741 0.000000 -0.037742 -0.012824 0.229208
  0.262165 0.811892 0.662539 0.062770 0.852372 0.516241
  -0.244068 0.811855 0.663659 0.075496 0.850763 0.515885
  0.224683 0.261800 0.775026 0.061545 -0.704788 0.239030
  0.000000 0.017499 0.000000 0.703421 -0.190218 -0.204739
  -0.000000 0.145788 -0.000001 0.138926 -0.033988 0.201177
  0.000000 0.112094 -0.000000 -0.078844 -0.073968 0.231614
  0.000000 0.111594 -0.000001 0.017860 -0.046768 0.224925
  0.365934 0.793585 0.683419 0.046999 0.705543 -0.046999
  0.000000 0.011232 -0.000000 0.125932 0.784489 0.580788
  0.000000 0.112704 0.000000 0.249012 -0.023436 0.387488
  0.360328 0.777494 0.684141 0.046999 0.705543 -0.046999
  -0.000000 0.010075 -0.000000 -0.099298 0.457444 0.813065
  -0.000001 0.108888 -0.000001 -0.431280 0.352682 0.307498
  -0.136625 0.803882 0.692455 0.046999 0.705543 -0.046999
  -0.000000 0.011232 -0.000000 -0.012092 0.729618 0.661852
  0.000000 0.131865 -0.000001 0.059970 -0.091594 0.376970
  -0.136810 0.780377 0.690931 0.046999 0.705543 -0.046999
  0.000000 0.010076 -0.000000 0.058739 0.626521 0.753261
  -0.000000 0.128464 -0.000001 -0.215644 -0.086457 0.361177
  -0.002196 0.809023 0.000794 0.040325 0.000217 -0.001349
  -0.014832 1.825302 -0.071422 0.467192 -0.533469 -0.463268
  -0.000000 1.493901 -0.000001 0.084386 0.628106 -0.684447
  -0.000002 2.103017 -0.000000 -0.805907 0.032498 0.391250
  -0.000001 1.823368 -0.000001 0.218480 0.447432 -0.219510
  0.288925 0.945605 -0.016979 -0.051814 -0.682660 -0.029449
  0.000000 0.310931 0.000001 0.000222 -0.001468 -0.002344
  0.000000 0.255058 0.000000 -0.029945 -0.071881 -0.099362
  0.182656 0.102358 0.122068 -0.147871 0.530654 0.238828
  -0.000000 0.450617 -0.000001 -0.220839 -0.001970 -0.022282
  0.000000 0.295730 -0.000000 0.098878 0.156041 -0.150734
  0.586578 1.443575 0.291630 0.494772 0.504178 0.517254
  0.081675 0.956432 -0.018380 -0.233387 -0.644836 -0.350997
  0.000000 0.323706 -0.000001 0.060363 -0.029318 -0.532386
  0.000000 0.229678 -0.000001 0.030202 0.093424 -0.398771
  -0.151895 0.951490 -0.015787 -0.308169 -0.644014 -0.377238
  0.000000 0.298947 -0.000000 0.096343 -0.030557 -0.429211
  0.000000 0.222753 -0.000000 0.006300 0.070132 -0.362140
  -0.332554 0.872253 0.059176 -0.391573 -0.056806 -0.073511
  0.000001 0.247823 -0.000000 -0.417853 0.003177 -0.041811
  0.000001 0.155400 0.000000 -0.503651 -0.045866 -0.036045
  0.531377 1.351308 -0.004341 0.015905 0.004096 0.999865
  0.002183 1.423121 -0.451181 0.675237 0.001866 -0.002772
  0.014634 1.825497 -0.071451 0.412498 0.526770 0.570432
  0.000001 1.493901 0.000000 0.458184 0.336116 0.479553
  -0.000002 2.103016 0.000000 0.061631 0.497369 0.515809
  0.093228 1.351309 0.523155 0.654646 0.002690 0.755924
  0.000001 1.823369 0.000000 -0.058653 0.516019 -0.327545
  0.286576 1.006395 -0.107109 0.024620 0.598348 -0.059034
  0.000000 0.249956 0.000000 -0.029492 -0.012157 -0.324504
  0.000001 0.254362 0.000000 -0.075971 0.172990 -0.419718
  0.120542 0.102359 -0.183668 0.007117 -0.621634 0.355169
  -0.000001 0.445151 0.000000 0.210018 -0.024499 0.024222
  -0.000000 0.302323 -0.000000 -0.250044 0.522639 0.319508
  0.073564 1.013167 -0.024133 0.021271 -0.812615 0.006525
  -0.000000 0.266205 0.000001 0.056304 0.004780 0.582650
  -0.000000 0.229739 -0.000000 -0.022564 0.184704 0.188309
  -0.127264 1.003840 0.060603 0.076612 -0.797049 0.046932
  0.000001 0.246800 -0.000000 -0.008465 -0.002391 0.639345
  -0.000000 0.222126 -0.000000 -0.019119 0.249609 0.025113
  -0.358086 0.893699 0.063868 0.165936 -0.779851 0.118893
  0.000001 0.221430 -0.000000 -0.065167 0.003525 0.301810
  0.000001 0.154457 0.000000 0.132105 0.263758 0.315006
  -0.810392 0.550811 -0.372493 -0.943139 0.124756 -0.112994
  0.000000 3.626384 -0.000000 -0.496960 0.002157 0.016595
  0.782400 0.551416 -0.372917 -0.902456 -0.106718 0.043433
  -0.000000 3.626384 0.000000 -0.441531 -0.016269 -0.013842
  -1.287859 1.162375 1.263215 -0.371953 0.221529 -0.896885
  -0.090614 0.138320 1.006144 0.772409 0.016384 0.048558
  -0.090614 0.138320 1.006144 -0.842394 0.070594 -0.050008
  2.193345 1.136905 -1.497627 0.704002 -0.151072 -0.670899
  -0.005721 0.138320 -1.010200 -0.026961 -0.556256 0.830217
  -0.005721 0.138320 -1.010200 -0.773771 -0.000268 0.002023
}

frame 3 {
  -0.000000 0.000000 -0.001428 -0.707107 -0.000000 -0.000000
  0.309122 6.397901 -0.106869 -0.075753 -0.540814 0.049588
  0.000000 1.240110 -0.000000 0.031047 0.000463 -0.044150
  0.000000 1.426178 -0.000000 -0.178235 -0.006741 0.023557
  0.000000 1.821083 -0.000000 -0.063870 -0.197060 -0.065100
  0.000000 0.808121 0.000000 0.001844 -0.515148 -0.857099
  -0.044148 0.766294 0.024775 0.041523 0.017823 0.047194
  -0.003137 0.224356 0.163702 -0.582226 0.395844 0.586146
  -0.259543 0.557509 -0.217254 0.921135 -0.363098 0.094224
  0.000000 0.017501 -0.000000 0.781234 -0.161695 -0.225985
  0.000000 0.135388 -0.000001 0.075406 -0.096907 0.225094
  -0.000000 0.113742 0.000001 -0.180479 -0.049393 0.159502
  -0.000000 0.113741 0.000000 -0.043447 -0.016367 0.228289
  0.262165 0.811891 0.662538 0.064201 0.856346 0.509308
  -0.244068 0.811855 0.663658 0.076975 0.854681 0.508977
  0.224683 0.261799 0.775026 0.058711 -0.699239 0.251890
  0.000000 0.017499 0.000000 0.711724 -0.189401 -0.209593
  0.000000 0.145787 -0.000001 0.137985 -0.038551 0.200899
  -0.000000 0.112094 0.000001 -0.081272 -0.080150 0.230044
  -0.000000 0.111594 0.000000 0.012049 -0.050222 0.225804
  0.365935 0.793585 0.683418 0.046999 0.705543 -0.046999
  0.000000 0.011232 -0.000000 0.125930 0.784488 0.580790
  -0.000000 0.112704 0.000001 0.249011 -0.023436 0.387486
  0.360328 0.777493 0.684140 0.046999 0.705543 -0.046999
  0.000000 0.010075 -0.000000 -0.099298 0.457445 0.813064
  -0.000000 0.108887 -0.000001 -0.431278 0.352682 0.307497
  -0.136625 0.803881 0.692454 0.046999 0.705543 -0.046999
  0.000000 0.011231 0.000000 -0.015358 0.728762 0.661784
  -0.000000 0.131865 -0.000001 0.053036 -0.099407 0.378009
  -0.136810 0.780376 0.690929 0.046999 0.705543 -0.046999
  0.000000 0.010076 -0.000000 0.055747 0.625758 0.753487
  -0.000000 0.128464 0.000001 -0.221337 -0.093594 0.357714
  -0.002195 0.809023 0.000794 0.040325 0.000217 -0.001349
  -0.014832 1.825301 -0.071422 0.467192 -0.533469 -0.463268
  -0.000001 1.493901 -0.000002 0.107092 0.627565 -0.688647
  0.000001 2.103014 -0.000000 -0.799288 0.033561 0.388036
  -0.000001 1.823368 0.000000 0.206241 0.456248 -0.232840
  0.288929 0.945606 -0.016980 -0.051822 -0.682660 -0.029446
  0.000000 0.310931 0.000000 0.000222 -0.001468 -0.002344
  0.000000 0.255058 0.000000 -0.029937 -0.071881 -0.099357
  0.182658 0.102358 0.122067 -0.147937 0.530678 0.238763
  -0.000000 0.450618 0.000000 -0.220583 -0.001969 -0.022254
  -0.000000 0.295730 0.000001 0.098713 0.156070 -0.150720
  0.586578 1.443575 0.291630 0.494772 0.504178 0.517254
  0.081678 0.956433 -0.018380 -0.233387 -0.644846 -0.350980
  0.000000 0.323706 -0.000002 0.060352 -0.029323 -0.532333
  0.000000 0.229678 -0.000000 0.030213 0.093406 -0.398840
  -0.151892 0.951490 -0.015788 -0.308168 -0.644022 -0.377224
  -0.000000 0.298948 0.000001 0.096325 -0.030559 -0.429150
  0.000000 0.222754 -0.000001 0.006321 0.070113 -0.362213
  -0.332550 0.872254 0.059175 -0.391585 -0.056814 -0.073500
  -0.000000 0.247823 0.000000 -0.417711 0.003177 -0.041786
  0.000000 0.155400 -0.000000 -0.503771 -0.045888 -0.036075
  0.531378 1.351308 -0.004340 0.015904 0.004080 0.999865
  0.002183 1.423120 -0.451181 0.675237 0.001866 -0.002772
  0.014634 1.825496 -0.071451 0.396761 0.535836 0.585465
  -0.000000 1.493901 0.000001 0.506189 0.355773 0.430630
  0.000000 2.103016 -0.000000 0.061877 0.496633 0.517869
  0.093227 1.351307 0.523154 0.654640 0.002699 0.755930
  -0.000001 1.823367 -0.000000 -0.055103 0.482556 -0.351513
  0.286577 1.006395 -0.107110 0.024619 0.598349 -0.059030
  -0.000001 0.249956 -0.000001 -0.029491 -0.012157 -0.324509
  -0.000001 0.254362 0.000000 -0.075972 0.172990 -0.419716
  0.120542 0.102358 -0.183670 0.007119 -0.621634 0.355169
  -0.000001 0.445150 0.000000 0.210016 -0.024499 0.024222
  -0.000000 0.302324 0.000001 -0.250045 0.522637 0.319507
  0.073565 1.013167 -0.024134 0.021273 -0.812615 0.006527
  -0.000001 0.266205 -0.000000 0.056301 0.004780 0.582646
  -0.000000 0.229739 -0.000000 -0.022561 0.184705 0.188309
  -0.127264 1.003841 0.060603 0.076612 -0.797048 0.046933
  0.000001 0.246799 -0.000001 -0.008466 -0.002391 0.639343
  0.000000 0.222125 -0.000000 -0.019118 0.249609 0.025114
  -0.358085 0.893698 0.063865 0.165934 -0.779852 0.118890
  -0.000001 0.221430 -0.000000 -0.065168 0.003525 0.301814
  -0.000001 0.154459 0.000000 0.132105 0.263757 0.315004
  -0.810392 0.550812 -0.372493 -0.914451 0.141005 -0.143060
  -0.000000 3.626384 0.000000 -0.602333 0.001984 0.020114
  0.782400 0.551416 -0.372917 -0.869943 -0.112258 0.033679
  0.000000 3.626384 -0.000000 -0.554846 -0.015083 -0.017395
  -1.151699 1.540840 1.217114 -0.375156 0.242958 -0.890840
  -0.090614 0.138320 1.006144 0.796388 0.014078 0.050724
  -0.090614 0.138320 1.006144 -0.829559 0.060548 -0.046306
  2.134139 1.521900 -1.441497 0.694786 -0.161279 -0.675469
  -0.005721 0.138320 -1.010200 -0.028408 -0.578660 0.814668
  -0.005721 0.138320 -1.010200 -0.797658 0.000466 0.000474
}

frame 4 {
  -0.000000 0.000000 -0.001428 -0.707107 -0.000000 -0.000000
  0.309122 6.369435 -0.106869 -0.076027 -0.540775 0.050012
  -0.000000 1.240111 0.000000 0.022909 0.000810 -0.042299
  -0.000000 1.426178 -0.000000 -0.173420 -0.009169 0.017212
  -0.000000 1.821084 0.000000 -0.067045 -0.199700 -0.069631
  0.000000 0.808122 -0.000000 0.001844 -0.515148 -0.857099
  -0.044148 0.766294 0.024775 0.038989 0.017268 0.049719
  -0.003138 0.224356 0.163702 -0.582226 0.395844 0.586146
  -0.259542 0.557511 -0.217254 0.922207 -0.357053 0.095175
  -0.000000 0.017501 -0.000000 0.786354 -0.161318 -0.230674
  -0.000000 0.135389 0.000000 0.074871 -0.102353 0.224607
  -0.000000 0.113741 -0.000000 -0.181830 -0.052116 0.157544
  -0.000000 0.113741 0.000001 -0.047954 -0.019324 0.227464
  0.262165 0.811894 0.662538 0.064635 0.859740 0.503459
  -0.244069 0.811856 0.663658 0.077451 0.858046 0.503155
  0.224683 0.261799 0.775026 0.056435 -0.694004 0.262127
  0.000000 0.017499 -0.000000 0.718069 -0.189294 -0.214206
  0.000000 0.145787 -0.000000 0.137363 -0.042257 0.200591
  0.000000 0.112093 -0.000000 -0.083065 -0.085226 0.228760
  -0.000000 0.111594 -0.000001 0.007360 -0.053143 0.226411
  0.365934 0.793584 0.683418 0.046999 0.705543 -0.046999
  0.000000 0.011230 0.000000 0.125932 0.784487 0.580791
  0.000000 0.112704 -0.000001 0.249006 -0.023433 0.387489
  0.360328 0.777493 0.684140 0.046999 0.705543 -0.046999
  -0.000000 0.010076 0.000000 -0.099298 0.457445 0.813064
  0.000000 0.108887 0.000001 -0.431280 0.352682 0.307497
  -0.136625 0.803881 0.692454 0.046999 0.705543 -0.046999
  -0.000000 0.011230 -0.000000 -0.017829 0.728103 0.661722
  0.000000 0.131865 -0.000000 0.047539 -0.105899 0.378737
  -0.136810 0.780376 0.690930 0.046999 0.705543 -0.046999
  0.000000 0.010075 -0.000000 0.053521 0.625182 0.753648
  0.000000 0.128464 -0.000000 -0.225757 -0.099442 0.354944
  -0.002195 0.809023 0.000794 0.040325 0.000217 -0.001349
  -0.014833 1.825301 -0.071422 0.467192 -0.533469 -0.463268
  0.000000 1.493901 -0.000000 0.123844 0.626494 -0.691398
  -0.000002 2.103017 0.000001 -0.793682 0.034428 0.385315
  -0.000001 1.823368 0.000000 0.197740 0.462819 -0.243087
  0.288927 0.945607 -0.016980 -0.051830 -0.682661 -0.029438
  0.000000 0.310931 -0.000002 0.000221 -0.001469 -0.002344
  0.000000 0.255058 0.000000 -0.029926 -0.071880 -0.099355
  0.182658 0.102358 0.122067 -0.147992 0.530698 0.238708
  0.000000 0.450618 -0.000002 -0.220358 -0.001967 -0.022230
  -0.000000 0.295730 -0.000001 0.098565 0.156097 -0.150706
  0.586577 1.443575 0.291630 0.494772 0.504178 0.517254
  0.081676 0.956433 -0.018380 -0.233387 -0.644858 -0.350958
  0.000000 0.323706 0.000001 0.060341 -0.029327 -0.532295
  -0.000000 0.229678 -0.000001 0.030225 0.093383 -0.398899
  -0.151893 0.951491 -0.015788 -0.308167 -0.644033 -0.377205
  -0.000000 0.298947 0.000001 0.096309 -0.030561 -0.429106
  0.000000 0.222753 0.000001 0.006341 0.070092 -0.362274
  -0.332552 0.872254 0.059175 -0.391591 -0.056825 -0.073482
  0.000001 0.247823 -0.000000 -0.417597 0.003175 -0.041757
  0.000002 0.155400 0.000001 -0.503872 -0.045924 -0.036107
  0.531378 1.351308 -0.004340 0.015881 0.004108 0.999865
  0.002183 1.423120 -0.451181 0.675237 0.001866 -0.002772
  0.014634 1.825496 -0.071451 0.384295 0.542601 0.596846
  -0.000001 1.493901 -0.000000 0.535267 0.370522 0.391764
  0.000001 2.103018 -0.000000 0.061660 0.497281 0.516057
  0.093227 1.351308 0.523154 0.654640 0.002704 0.755930
  -0.000001 1.823368 0.000001 -0.049201 0.462147 -0.366919
  0.286576 1.006395 -0.107109 0.024625 0.598348 -0.059043
  0.000000 0.249956 0.000001 -0.029490 -0.012157 -0.324477
  0.000002 0.254362 -0.000000 -0.075975 0.172988 -0.419732
  0.120542 0.102358 -0.183669 0.007128 -0.621639 0.355161
  -0.000001 0.445150 -0.000001 0.209989 -0.024499 0.024219
  0.000000 0.302323 0.000000 -0.250033 0.522642 0.319502
  0.073565 1.013166 -0.024132 0.021275 -0.812615 0.006527
  -0.000000 0.266205 0.000001 0.056302 0.004780 0.582635
  -0.000001 0.229741 -0.000000 -0.022560 0.184704 0.188320
  -0.127262 1.003840 0.060603 0.076613 -0.797048 0.046933
  -0.000000 0.246799 -0.000000 -0.008466 -0.002391 0.639333
  -0.000000 0.222126 0.000000 -0.019116 0.249609 0.025125
  -0.358085 0.893699 0.063867 0.165944 -0.779849 0.118902
  0.000000 0.221431 0.000001 -0.065158 0.003525 0.301767
  -0.000000 0.154458 0.000001 0.132107 0.263751 0.315036
  -0.810392 0.550813 -0.372493 -0.876200 0.160234 -0.173279
  -0.000000 3.626385 0.000000 -0.702268 0.001769 0.023451
  0.782400 0.551418 -0.372917 -0.827809 -0.119486 0.033534
  0.000000 3.626384 0.000000 -0.660509 -0.013610 -0.020708
  -0.980251 2.021786 1.155060 -0.379027 0.270868 -0.882113
  -0.090614 0.138320 1.006144 0.826184 0.011002 0.053466
  -0.090614 0.138320 1.006144 -0.811771 0.047282 -0.041392
  2.056351 2.016201 -1.367999 0.682389 -0.174580 -0.681145
  -0.005721 0.138320 -1.010200 -0.030277 -0.607436 0.793315
  -0.005721 0.138320 -1.010200 -0.827357 0.001435 -0.001572
}

frame 5 {
  -0.000000 0.000000 -0.001428 -0.707107 -0.000000 -0.000000
  0.309123 6.337190 -0.106869 -0.076338 -0.540731 0.050493
  -0.000000 1.240110 0.000000 0.020019 0.001150 -0.040790
  -0.000000 1.426178 0.000000 -0.168026 -0.010080 0.014956
  -0.000000 1.821083 -0.000000 -0.070640 -0.202683 -0.074762
  -0.000001 0.808122 0.000000 0.001844 -0.515148 -0.857099
  -0.044148 0.766293 0.024775 0.036118 0.016639 0.052578
  -0.003138 0.224356 0.163703 -0.582226 0.395844 0.586146
  -0.259541 0.557510 -0.217254 0.922704 -0.354386 0.093851
  -0.000000 0.017501 -0.000000 0.788089 -0.162221 -0.234311
  0.000000 0.135389 0.000001 0.074790 -0.104764 0.224307
  -0.000000 0.113741 -0.000000 -0.182329 -0.053397 0.156781
  -0.000000 0.113742 0.000001 -0.049848 -0.020743 0.227089
  0.262165 0.811893 0.662538 0.063169 0.861790 0.500272
  -0.244068 0.811856 0.663659 0.076010 0.860121 0.499990
  0.224683 0.261799 0.775026 0.055651 -0.690367 0.266438
  0.000000 0.017499 -0.000000 0.720390 -0.190439 -0.217621
  -0.000000 0.145788 0.000000 0.137204 -0.043884 0.200356
  0.000000 0.112094 0.000001 -0.083679 -0.087554 0.228202
  -0.000000 0.111594 -0.000000 0.005343 -0.054573 0.226660
  0.365934 0.793584 0.683419 0.046999 0.705543 -0.046999
  0.000000 0.011230 -0.000000 0.125931 0.784489 0.580789
  0.000000 0.112704 0.000001 0.249010 -0.023436 0.387487
  0.360328 0.777493 0.684141 0.046999 0.705543 -0.046999
  0.000000 0.010074 -0.000000 -0.099298 0.457444 0.813065
  -0.000000 0.108888 0.000000 -0.431279 0.352683 0.307497
  -0.136626 0.803881 0.692456 0.046999 0.705543 -0.046999
  0.000000 0.011232 0.000000 -0.018711 0.727867 0.661695
  0.000000 0.131865 -0.000000 0.045285 -0.108933 0.379015
  -0.136810 0.780377 0.690931 0.046999 0.705543 -0.046999
  0.000000 0.010075 -0.000000 0.052805 0.624995 0.753700
  0.000000 0.128464 -0.000000 -0.227505 -0.102174 0.353826
  -0.002196 0.809022 0.000795 0.040325 0.000217 -0.001349
  -0.014833 1.825301 -0.071422 0.467192 -0.533469 -0.463268
  -0.000000 1.493901 0.000000 0.129914 0.625781 -0.692430
  -0.000001 2.103018 0.000001 -0.791595 0.034745 0.384302
  -0.000000 1.823368 0.000000 0.194657 0.465332 -0.246846
  0.288927 0.945606 -0.016979 -0.051836 -0.682662 -0.029435
  -0.000000 0.310931 -0.000000 0.000221 -0.001469 -0.002343
  -0.000000 0.255058 -0.000000 -0.029920 -0.071880 -0.099353
  0.182657 0.102358 0.122067 -0.148012 0.530705 0.238688
  -0.000000 0.450618 -0.000001 -0.220274 -0.001967 -0.022220
  -0.000000 0.295730 0.000001 0.098509 0.156107 -0.150702
  0.586576 1.443575 0.291630 0.494772 0.504178 0.517254
  0.081676 0.956433 -0.018380 -0.233389 -0.644862 -0.350950
  -0.000001 0.323706 0.000000 0.060336 -0.029329 -0.532279
  -0.000000 0.229678 -0.000000 0.030230 0.093373 -0.398921
  -0.151893 0.951490 -0.015787 -0.308168 -0.644035 -0.377200
  -0.000000 0.298947 0.000000 0.096302 -0.030562 -0.429085
  0.000000 0.222753 -0.000001 0.006348 0.070085 -0.362299
  -0.332552 0.872254 0.059175 -0.391597 -0.056828 -0.073477
  -0.000002 0.247823 -0.000000 -0.417549 0.003175 -0.041746
  0.000000 0.155400 0.000000 -0.503912 -0.045935 -0.036119
  0.531378 1.351308 -0.004340 0.015879 0.004084 0.999865
  0.002183 1.423119 -0.451181 0.675237 0.001866 -0.002772
  0.014634 1.825496 -0.071452 0.379829 0.544939 0.600816
  0.000001 1.493902 -0.000002 0.543914 0.375558 0.377968
  -0.000000 2.103017 -0.000000 0.061494 0.497777 0.514662
  0.093228 1.351308 0.523154 0.654639 0.002699 0.755930
  0.000000 1.823368 0.000001 -0.046475 0.456127 -0.371677
  0.286575 1.006395 -0.107108 0.024631 0.598348 -0.059052
  0.000000 0.249956 0.000000 -0.029488 -0.012157 -0.324461
  -0.000000 0.254362 0.000000 -0.075977 0.172988 -0.419737
  0.120542 0.102358 -0.183667 0.007135 -0.621642 0.355156
  0.000001 0.445151 0.000000 0.209971 -0.024499 0.024216
  -0.000000 0.302324 -0.000000 -0.250026 0.522645 0.319498
  0.073565 1.013167 -0.024133 0.021277 -0.812615 0.006529
  -0.000001 0.266204 -0.000001 0.056301 0.004780 0.582629
  -0.000000 0.229739 -0.000000 -0.022559 0.184704 0.188323
  -0.127264 1.003840 0.060604 0.076617 -0.797048 0.046936
  -0.000000 0.246800 -0.000001 -0.008463 -0.002391 0.639325
  0.000000 0.222126 0.000000 -0.019117 0.249607 0.025131
  -0.358086 0.893699 0.063868 0.165954 -0.779846 0.118913
  -0.000001 0.221431 0.000000 -0.065151 0.003525 0.301737
  -0.000000 0.154457 -0.000000 0.132107 0.263747 0.315053
  -0.810392 0.550812 -0.372493 -0.831184 0.177924 -0.198373
  0.000000 3.626385 0.000000 -0.784876 0.001539 0.026209
  0.782400 0.551417 -0.372917 -0.776200 -0.130724 0.055473
  0.000000 3.626384 -0.000000 -0.747311 -0.012042 -0.023429
  -0.790167 2.557846 1.083673 -0.382957 0.302227 -0.871123
  -0.090614 0.138320 1.006144 0.857472 0.007460 0.056419
  -0.090614 0.138320 1.006144 -0.790317 0.032138 -0.035745
  1.968041 2.570270 -1.284694 0.667897 -0.189555 -0.687151
  -0.005721 0.138319 -1.010200 -0.032355 -0.639175 0.767814
  -0.005721 0.138319 -1.010200 -0.858570 0.002534 -0.003899
}

frame 6 {
  -0.000000 0.000000 -0.001428 -0.707107 -0.000000 -0.000000
  0.309124 6.304945 -0.106869 -0.076649 -0.540687 0.050973
  -0.000000 1.240110 0.000000 0.020388 0.001539 -0.039346
  -0.000000 1.426178 0.000000 -0.160663 -0.010111 0.015111
  0.000000 1.821083 0.000000 -0.074230 -0.205655 -0.079889
  0.000000 0.808123 -0.000000 0.001844 -0.515148 -0.857099
  -0.044148 0.766294 0.024775 0.033247 0.016010 0.055436
  -0.003138 0.224356 0.163703 -0.582226 0.395844 0.586146
  -0.259540 0.557510 -0.217254 0.922351 -0.355633 0.090804
  -0.000000 0.017501 -0.000000 0.786808 -0.164321 -0.236918
  0.000000 0.135389 -0.000000 0.075595 -0.104340 0.223902
  0.000000 0.113742 -0.000001 -0.181790 -0.053705 0.157430
  0.000000 0.113741 0.000001 -0.049149 -0.021156 0.227235
  0.262165 0.811893 0.662538 0.060035 0.862034 0.500532
  -0.244068 0.811857 0.663659 0.072881 0.860441 0.500261
  0.224683 0.261799 0.775026 0.055186 -0.688344 0.265154
  -0.000000 0.017499 0.000000 0.719148 -0.192612 -0.219715
  -0.000000 0.145787 -0.000000 0.137793 -0.043565 0.199874
  0.000000 0.112094 -0.000001 -0.082715 -0.087665 0.228355
  0.000000 0.111594 0.000001 0.005922 -0.055074 0.226678
  0.365934 0.793584 0.683419 0.046999 0.705543 -0.046999
  0.000000 0.011231 -0.000000 0.125929 0.784490 0.580788
  0.000000 0.112704 0.000002 0.249010 -0.023435 0.387487
  0.360328 0.777493 0.684141 0.046999 0.705543 -0.046999
  -0.000000 0.010075 0.000000 -0.099298 0.457442 0.813066
  0.000000 0.108887 0.000001 -0.431281 0.352683 0.307498
  -0.136626 0.803881 0.692455 0.046999 0.705543 -0.046999
  0.000000 0.011231 -0.000000 -0.017509 0.728187 0.661731
  0.000000 0.131865 -0.000000 0.046494 -0.109304 0.378869
  -0.136810 0.780376 0.690930 0.046999 0.705543 -0.046999
  -0.000000 0.010076 0.000000 0.054324 0.625390 0.753591
  -0.000000 0.128465 0.000001 -0.226259 -0.102643 0.354622
  -0.002195 0.809024 0.000794 0.040325 0.000217 -0.001349
  -0.014832 1.825302 -0.071422 0.467192 -0.533469 -0.463268
  -0.000001 1.493901 0.000001 0.125303 0.627155 -0.691023
  0.000001 2.103014 -0.000001 -0.793495 0.034459 0.385225
  -0.000001 1.823368 -0.000001 0.198093 0.462688 -0.244675
  0.288926 0.945606 -0.016979 -0.051831 -0.682661 -0.029441
  -0.000000 0.310931 -0.000000 0.000221 -0.001469 -0.002344
  0.000000 0.255058 0.000000 -0.029927 -0.071880 -0.099353
  0.182654 0.102358 0.122067 -0.147994 0.530698 0.238707
  0.000001 0.450618 -0.000002 -0.220355 -0.001968 -0.022229
  -0.000000 0.295730 -0.000000 0.098564 0.156097 -0.150708
  0.586577 1.443575 0.291631 0.494772 0.504178 0.517254
  0.081675 0.956433 -0.018380 -0.233389 -0.644856 -0.350961
  0.000000 0.323706 -0.000001 0.060340 -0.029327 -0.532288
  0.000000 0.229678 0.000000 0.030225 0.093384 -0.398903
  -0.151892 0.951490 -0.015787 -0.308170 -0.644030 -0.377210
  0.000000 0.298947 -0.000000 0.096307 -0.030562 -0.429094
  0.000000 0.222753 0.000001 0.006341 0.070094 -0.362280
  -0.332552 0.872253 0.059175 -0.391599 -0.056824 -0.073485
  -0.000000 0.247823 0.000000 -0.417581 0.003176 -0.041758
  0.000000 0.155400 0.000001 -0.503880 -0.045919 -0.036106
  0.531378 1.351308 -0.004340 0.015912 0.004090 0.999865
  0.002183 1.423120 -0.451181 0.675237 0.001866 -0.002772
  0.014634 1.825497 -0.071451 0.384295 0.542601 0.596847
  -0.000001 1.493901 0.000001 0.538835 0.370775 0.389544
  0.000000 2.103016 -0.000000 0.061349 0.498208 0.513447
  0.093227 1.351308 0.523154 0.654643 0.002699 0.755927
  -0.000000 1.823368 -0.000000 -0.047310 0.459919 -0.367563
  0.286577 1.006396 -0.107109 0.024630 0.598349 -0.059048
  0.000000 0.249956 -0.000000 -0.029487 -0.012157 -0.324462
  -0.000001 0.254363 -0.000000 -0.075980 0.172990 -0.419740
  0.120542 0.102359 -0.183668 0.007134 -0.621643 0.355154
  0.000002 0.445150 -0.000001 0.209964 -0.024499 0.024214
  0.000000 0.302324 0.000000 -0.250017 0.522649 0.319498
  0.073565 1.013167 -0.024134 0.021277 -0.812614 0.006530
  -0.000000 0.266204 0.000000 0.056297 0.004780 0.582626
  -0.000001 0.229739 0.000000 -0.022554 0.184709 0.188327
  -0.127263 1.003840 0.060602 0.076612 -0.797048 0.046933
  0.000000 0.246800 0.000001 -0.008468 -0.002391 0.639330
  -0.000001 0.222126 0.000000 -0.019112 0.249611 0.025131
  -0.358085 0.893699 0.063867 0.165942 -0.779849 0.118902
  -0.000001 0.221431 0.000000 -0.065159 0.003525 0.301766
  -0.000000 0.154458 0.000000 0.132110 0.263753 0.315039
  -0.810392 0.550812 -0.372493 -0.782686 0.189684 -0.216911
  -0.000000 3.626384 -0.000000 -0.846039 0.001324 0.028252
  0.782400 0.551416 -0.372917 -0.717625 -0.144968 0.092498
  0.000000 3.626384 0.000000 -0.811474 -0.010587 -0.025441
  -0.600083 3.093907 1.012286 -0.386390 0.333192 -0.858999
  -0.090614 0.138320 1.006144 0.885811 0.003893 0.059177
  -0.090614 0.138320 1.006144 -0.767570 0.016941 -0.030040
  1.879730 3.124339 -1.201390 0.652956 -0.204403 -0.692695
  -0.005721 0.138320 -1.010200 -0.034378 -0.669850 0.741033
  -0.005721 0.138320 -1.010200 -0.886880 0.003624 -0.006213
}

frame 7 {
  -0.000000 0.000000 -0.001428 -0.707107 -0.000000 -0.000000
  0.309124 6.276479 -0.106869 -0.076923 -0.540648 0.051397
  -0.000000 1.240110 -0.000000 0.021431 0.002021 -0.037676
  -0.000000 1.426177 -0.000000 -0.150291 -0.010063 0.015555
  0.000000 1.821084 -0.000000 -0.077397 -0.208270 -0.084411
  -0.000000 0.808122 0.000000 0.001844 -0.515148 -0.857099
  -0.044148 0.766295 0.024775 0.030712 0.015454 0.057958
  -0.003138 0.224356 0.163703 -0.582226 0.395844 0.586146
  -0.259540 0.557512 -0.217253 0.920918 -0.360594 0.086932
  -0.000000 0.017501 -0.000000 0.783349 -0.167266 -0.238654
  -0.000000 0.135388 0.000001 0.077546 -0.101853 0.223114
  -0.000000 0.113742 -0.000001 -0.180188 -0.053631 0.159431
  0.000000 0.113742 0.000000 -0.046311 -0.021266 0.227796
  0.262165 0.811895 0.662538 0.055897 0.860265 0.504408
  -0.244068 0.811858 0.663658 0.068730 0.858782 0.504135
  0.224683 0.261798 0.775027 0.053780 -0.687608 0.259599
  -0.000000 0.017499 0.000000 0.715379 -0.195339 -0.220556
  0.000000 0.145787 -0.000001 0.139291 -0.041817 0.198862
  0.000000 0.112094 0.000000 -0.080025 -0.086489 0.229035
  -0.000000 0.111594 -0.000001 0.008523 -0.055386 0.226556
  0.365934 0.793584 0.683419 0.046999 0.705543 -0.046999
  -0.000000 0.011232 -0.000001 0.125930 0.784490 0.580787
  0.000000 0.112704 -0.000002 0.249012 -0.023437 0.387488
  0.360328 0.777494 0.684141 0.046999 0.705543 -0.046999
  0.000000 0.010075 -0.000000 -0.099298 0.457443 0.813065
  0.000000 0.108888 -0.000000 -0.431282 0.352682 0.307498
  -0.136625 0.803881 0.692455 0.046999 0.705543 -0.046999
  0.000000 0.011231 0.000000 -0.014116 0.729091 0.661810
  0.000000 0.131865 -0.000000 0.050795 -0.108307 0.378315
  -0.136810 0.780376 0.690931 0.046999 0.705543 -0.046999
  0.000000 0.010076 0.000000 0.058360 0.626424 0.753291
  0.000000 0.128464 0.000001 -0.222217 -0.102056 0.357169
  -0.002195 0.809024 0.000794 0.040325 0.000217 -0.001349
  -0.014832 1.825301 -0.071422 0.467192 -0.533469 -0.463268
  -0.000000 1.493901 -0.000000 0.109995 0.632082 -0.685864
  0.000001 2.103013 -0.000001 -0.798679 0.033659 0.387742
  0.000000 1.823368 -0.000000 0.209951 0.453695 -0.237490
  0.288928 0.945606 -0.016979 -0.051823 -0.682660 -0.029446
  0.000000 0.310931 0.000002 0.000222 -0.001468 -0.002344
  0.000000 0.255058 0.000000 -0.029937 -0.071881 -0.099356
  0.182657 0.102358 0.122067 -0.147944 0.530680 0.238756
  -0.000000 0.450618 0.000001 -0.220554 -0.001969 -0.022251
  0.000000 0.295731 0.000000 0.098695 0.156073 -0.150719
  0.586578 1.443575 0.291630 0.494772 0.504178 0.517254
  0.081678 0.956432 -0.018380 -0.233388 -0.644847 -0.350978
  -0.000000 0.323706 0.000002 0.060351 -0.029323 -0.532327
  0.000000 0.229678 -0.000000 0.030214 0.093404 -0.398848
  -0.151894 0.951490 -0.015787 -0.308169 -0.644022 -0.377224
  0.000000 0.298947 -0.000001 0.096322 -0.030559 -0.429141
  0.000000 0.222753 -0.000001 0.006323 0.070111 -0.362223
  -0.332551 0.872253 0.059175 -0.391589 -0.056816 -0.073497
  -0.000001 0.247823 -0.000000 -0.417693 0.003176 -0.041781
  0.000000 0.155400 -0.000000 -0.503784 -0.045894 -0.036080
  0.531378 1.351308 -0.004341 0.015878 0.004086 0.999865
  0.002183 1.423120 -0.451181 0.675237 0.001866 -0.002772
  0.014634 1.825496 -0.071451 0.396761 0.535836 0.585465
  -0.000000 1.493901 0.000000 0.523148 0.358166 0.421916
  0.000000 2.103016 0.000001 0.060799 0.499826 0.508851
  0.093228 1.351308 0.523154 0.654640 0.002699 0.755930
  0.000000 1.823368 -0.000001 -0.048885 0.470842 -0.355967
  0.286576 1.006396 -0.107108 0.024639 0.598348 -0.059063
  0.000002 0.249956 -0.000000 -0.029483 -0.012157 -0.324424
  -0.000001 0.254363 0.000000 -0.075986 0.172991 -0.419761
  0.120542 0.102359 -0.183667 0.007143 -0.621647 0.355146
  -0.000001 0.445151 -0.000001 0.209931 -0.024500 0.024208
  -0.000001 0.302323 0.000000 -0.249998 0.522658 0.319492
  0.073564 1.013167 -0.024133 0.021278 -0.812614 0.006530
  -0.000000 0.266205 -0.000000 0.056297 0.004780 0.582614
  0.000000 0.229740 0.000000 -0.022551 0.184709 0.188341
  -0.127263 1.003841 0.060604 0.076610 -0.797048 0.046932
  -0.000001 0.246800 0.000000 -0.008469 -0.002391 0.639320
  -0.000000 0.222126 0.000000 -0.019107 0.249615 0.025145
  -0.358086 0.893699 0.063868 0.165949 -0.779846 0.118913
  -0.000000 0.221430 0.000000 -0.065153 0.003526 0.301721
  -0.000000 0.154458 -0.000000 0.132116 0.263751 0.315071
  -0.810392 0.550812 -0.372493 -0.734549 0.193343 -0.230017
  -0.000000 3.626385 -0.000001 -0.886967 0.001146 0.029618
  0.782400 0.551416 -0.372918 -0.658393 -0.157976 0.129479
  0.000000 3.626384 -0.000000 -0.854873 -0.009396 -0.026802
  -0.428634 3.574853 0.950232 -0.388995 0.360104 -0.847395
  -0.090614 0.138320 1.006144 0.908172 0.000752 0.061430
  -0.090614 0.138320 1.006144 -0.746508 0.003542 -0.024977
  1.801942 3.618640 -1.127892 0.639417 -0.217379 -0.697195
  -0.005721 0.138320 -1.010200 -0.036111 -0.695928 0.716438
  -0.005721 0.138320 -1.010200 -0.909255 0.004571 -0.008226
}

frame 8 {
  -0.000000 0.000000 -0.001428 -0.707107 -0.000000 -0.000000
  0.309124 6.254713 -0.106869 -0.077133 -0.540618 0.051722
  0.000000 1.240110 -0.000000 0.022771 0.002486 -0.036132
  0.000000 1.426178 -0.000000 -0.139563 -0.009966 0.016127
  -0.000000 1.821083 -0.000001 -0.079815 -0.210263 -0.087865
  0.000001 0.808122 -0.000000 0.001844 -0.515148 -0.857099
  -0.044148 0.766294 0.024775 0.028774 0.015029 0.059886
  -0.003138 0.224356 0.163703 -0.582226 0.395844 0.586146
  -0.259542 0.557510 -0.217253 0.918973 -0.367156 0.083079
  -0.000000 0.017501 -0.000000 0.778988 -0.170314 -0.239527
  -0.000000 0.135389 -0.000000 0.079902 -0.098444 0.222194
  0.000000 0.113742 -0.000000 -0.178145 -0.053264 0.161956
  0.000000 0.113741 -0.000001 -0.042508 -0.021140 0.228487
  0.262165 0.811893 0.662538 0.051756 0.857428 0.509987
  -0.244069 0.811856 0.663659 0.064563 0.856058 0.509709
  0.224683 0.261799 0.775026 0.052005 -0.687757 0.252128
  -0.000000 0.017499 0.000000 0.710525 -0.198012 -0.220437
  0.000000 0.145787 -0.000000 0.141124 -0.039442 0.197664
  -0.000000 0.112094 -0.000000 -0.076657 -0.084625 0.229917
  -0.000000 0.111594 -0.000000 0.012042 -0.055489 0.226312
  0.365934 0.793585 0.683418 0.046999 0.705543 -0.046999
  0.000000 0.011229 -0.000000 0.125932 0.784486 0.580792
  0.000000 0.112704 -0.000000 0.249004 -0.023432 0.387490
  0.360328 0.777494 0.684141 0.046999 0.705543 -0.046999
  -0.000000 0.010076 0.000000 -0.099298 0.457442 0.813066
  0.000000 0.108887 -0.000001 -0.431280 0.352684 0.307497
  -0.136626 0.803881 0.692455 0.046999 0.705543 -0.046999
  -0.000000 0.011230 -0.000000 -0.009860 0.730195 0.661887
  0.000000 0.131865 0.000003 0.056397 -0.106530 0.377522
  -0.136810 0.780377 0.690930 0.046999 0.705543 -0.046999
  0.000000 0.010076 -0.000000 0.063322 0.627674 0.752889
  -0.000000 0.128464 -0.000001 -0.216983 -0.100794 0.360371
  -0.002195 0.809023 0.000794 0.040325 0.000217 -0.001349
  -0.014833 1.825301 -0.071423 0.467192 -0.533469 -0.463268
  0.000000 1.493901 0.000001 0.086314 0.639913 -0.676833
  -0.000001 2.103019 0.000000 -0.804982 0.032650 0.390802
  0.000000 1.823368 -0.000000 0.229122 0.439493 -0.226341
  0.288928 0.945606 -0.016979 -0.051809 -0.682660 -0.029450
  0.000000 0.310930 0.000002 0.000222 -0.001468 -0.002344
  -0.000000 0.255058 0.000000 -0.029949 -0.071881 -0.099365
  0.182656 0.102358 0.122067 -0.147877 0.530657 0.238817
  0.000000 0.450617 0.000000 -0.220814 -0.001970 -0.022280
  0.000001 0.295730 0.000000 0.098865 0.156045 -0.150728
  0.586577 1.443575 0.291630 0.494772 0.504178 0.517254
  0.081678 0.956433 -0.018380 -0.233379 -0.644837 -0.350995
  0.000000 0.323706 0.000000 0.060366 -0.029318 -0.532388
  0.000000 0.229678 -0.000000 0.030201 0.093430 -0.398775
  -0.151894 0.951490 -0.015787 -0.308160 -0.644016 -0.377234
  0.000000 0.298947 0.000001 0.096346 -0.030556 -0.429216
  -0.000000 0.222753 -0.000000 0.006299 0.070137 -0.362143
  -0.332550 0.872253 0.059175 -0.391565 -0.056804 -0.073515
  -0.000000 0.247823 0.000001 -0.417851 0.003177 -0.041815
  -0.000000 0.155400 -0.000000 -0.503660 -0.045858 -0.036043
  0.531378 1.351308 -0.004341 0.015875 0.004072 0.999865
  0.002183 1.423120 -0.451181 0.675237 0.001866 -0.002772
  0.014634 1.825497 -0.071452 0.412498 0.526770 0.570432
  -0.000000 1.493901 -0.000001 0.498633 0.342649 0.463174
  0.000000 2.103015 0.000001 0.059799 0.502722 0.500479
  0.093228 1.351307 0.523154 0.654642 0.002699 0.755928
  -0.000000 1.823367 0.000000 -0.048784 0.487542 -0.339993
  0.286576 1.006395 -0.107108 0.024657 0.598348 -0.059090
  0.000000 0.249956 0.000001 -0.029474 -0.012157 -0.324349
  0.000000 0.254363 -0.000000 -0.076002 0.172994 -0.419802
  0.120542 0.102358 -0.183668 0.007170 -0.621662 0.355121
  0.000001 0.445150 0.000000 0.209828 -0.024500 0.024192
  0.000000 0.302324 -0.000000 -0.249937 0.522684 0.319470
  0.073565 1.013167 -0.024132 0.021279 -0.812613 0.006533
  -0.000000 0.266205 0.000000 0.056291 0.004781 0.582586
  0.000000 0.229739 0.000001 -0.022536 0.184718 0.188371
  -0.127263 1.003840 0.060605 0.076606 -0.797047 0.046931
  -0.000001 0.246800 -0.000000 -0.008475 -0.002391 0.639304
  0.000000 0.222126 -0.000000 -0.019094 0.249623 0.025169
  -0.358085 0.893699 0.063868 0.165957 -0.779842 0.118930
  -0.000001 0.221431 0.000000 -0.065146 0.003526 0.301655
  0.000000 0.154459 -0.000000 0.132131 0.263751 0.315119
  -0.810392 0.550812 -0.372493 -0.691797 0.190398 -0.239195
  0.000000 3.626384 -0.000000 -0.911781 0.001018 0.030447
  0.782400 0.551417 -0.372918 -0.608152 -0.166567 0.154360
  0.000000 3.626384 -0.000000 -0.881444 -0.008550 -0.027635
  -0.292475 3.953318 0.904131 -0.390717 0.380364 -0.837979
  -0.090614 0.138319 1.006144 0.923513 -0.001629 0.063028
  -0.090614 0.138319 1.006144 -0.729842 -0.006659 -0.021102
  1.742736 4.003634 -1.071762 0.628859 -0.227206 -0.700384
  -0.005721 0.138319 -1.010200 -0.037399 -0.715175 0.697097
  -0.005721 0.138319 -1.010200 -0.924633 0.005280 -0.009736
}

frame 9 {
  -0.000000 0.000000 -0.001428 -0.707107 -0.000000 -0.000000
  0.309123 6.241325 -0.106869 -0.077262 -0.540600 0.051921
  0.000000 1.240110 0.000000 0.023815 0.002801 -0.035117
  0.000000 1.426178 0.000000 -0.132012 -0.009879 0.016572
  0.000000 1.821083 -0.000000 -0.081302 -0.211487 -0.089989
  -0.000000 0.808121 0.000000 0.001844 -0.515148 -0.857099
  -0.044148 0.766294 0.024775 0.027581 0.014768 0.061072
  -0.003138 0.224357 0.163703 -0.582226 0.395844 0.586146
  -0.259540 0.557511 -0.217253 0.917451 -0.372145 0.080378
  0.000000 0.017501 -0.000000 0.775681 -0.172470 -0.239880
  0.000000 0.135388 -0.000000 0.081642 -0.095835 0.221513
  0.000000 0.113741 0.000000 -0.176582 -0.052902 0.163840
  0.000000 0.113741 -0.000001 -0.039604 -0.020982 0.228970
  0.262165 0.811896 0.662538 0.048879 0.855136 0.514318
  -0.244069 0.811857 0.663659 0.061665 0.853845 0.514037
  0.224683 0.261800 0.775027 0.050673 -0.688063 0.246398
  -0.000000 0.017499 0.000000 0.706829 -0.199860 -0.220082
  -0.000000 0.145788 -0.000001 0.142484 -0.037634 0.196775
  0.000000 0.112094 0.000000 -0.074122 -0.083123 0.230565
  -0.000000 0.111594 0.000002 0.014731 -0.055490 0.226080
  0.365934 0.793586 0.683419 0.046999 0.705543 -0.046999
  0.000000 0.011231 0.000000 0.125929 0.784490 0.580787
  -0.000000 0.112704 0.000000 0.249009 -0.023435 0.387487
  0.360328 0.777495 0.684141 0.046999 0.705543 -0.046999
  0.000000 0.010074 0.000000 -0.099297 0.457445 0.813064
  0.000001 0.108887 -0.000000 -0.431276 0.352682 0.307498
  -0.136625 0.803882 0.692455 0.046999 0.705543 -0.046999
  0.000000 0.011231 0.000000 -0.006676 0.730999 0.661928
  -0.000000 0.131865 -0.000000 0.060624 -0.105054 0.376864
  -0.136810 0.780378 0.690931 0.046999 0.705543 -0.046999
  0.000000 0.010075 0.000000 0.066992 0.628582 0.752570
  0.000000 0.128464 0.000000 -0.213019 -0.099688 0.362733
  -0.002195 0.809024 0.000794 0.040325 0.000217 -0.001349
  -0.014833 1.825300 -0.071422 0.467192 -0.533469 -0.463268
  0.000000 1.493901 0.000001 0.063871 0.647553 -0.667102
  -0.000001 2.103014 0.000000 -0.809621 0.031883 0.393054
  0.000000 1.823368 -0.000000 0.247991 0.425664 -0.215569
  0.288929 0.945606 -0.016979 -0.051797 -0.682659 -0.029453
  0.000000 0.310931 -0.000002 0.000222 -0.001467 -0.002344
  0.000000 0.255058 0.000000 -0.029960 -0.071882 -0.099374
  0.182658 0.102358 0.122067 -0.147823 0.530639 0.238863
  0.000000 0.450618 0.000001 -0.221014 -0.001971 -0.022303
  0.000000 0.295730 -0.000000 0.098996 0.156024 -0.150732
  0.586578 1.443574 0.291630 0.494772 0.504178 0.517254
  0.081679 0.956432 -0.018380 -0.233370 -0.644831 -0.351004
  -0.000000 0.323706 -0.000002 0.060378 -0.029314 -0.532438
  -0.000000 0.229678 -0.000001 0.030191 0.093451 -0.398721
  -0.151892 0.951490 -0.015787 -0.308151 -0.644014 -0.377238
  -0.000000 0.298947 0.000002 0.096366 -0.030553 -0.429280
  0.000000 0.222753 -0.000001 0.006280 0.070156 -0.362081
  -0.332550 0.872253 0.059175 -0.391540 -0.056796 -0.073527
  0.000001 0.247823 0.000000 -0.417978 0.003178 -0.041841
  0.000000 0.155400 0.000000 -0.503566 -0.045832 -0.036017
  0.531378 1.351308 -0.004341 0.015897 0.004092 0.999865
  0.002183 1.423119 -0.451181 0.675237 0.001866 -0.002772
  0.014634 1.825495 -0.071451 0.424524 0.519424 0.558419
  0.000000 1.493901 0.000001 0.475551 0.330824 0.494969
  -0.000001 2.103017 -0.000000 0.058797 0.505561 0.492086
  0.093228 1.351308 0.523154 0.654641 0.002690 0.755929
  0.000001 1.823368 -0.000000 -0.046849 0.503324 -0.326405
  0.286576 1.006395 -0.107106 0.024663 0.598348 -0.059096
  -0.000000 0.249956 -0.000000 -0.029469 -0.012157 -0.324318
  -0.000000 0.254364 -0.000000 -0.076013 0.172998 -0.419824
  0.120542 0.102358 -0.183666 0.007186 -0.621671 0.355105
  -0.000001 0.445150 0.000000 0.209764 -0.024501 0.024181
  0.000001 0.302323 -0.000000 -0.249897 0.522701 0.319456
  0.073565 1.013167 -0.024132 0.021278 -0.812612 0.006535
  0.000000 0.266205 -0.000000 0.056285 0.004781 0.582575
  -0.000000 0.229740 0.000001 -0.022526 0.184726 0.188384
  -0.127263 1.003840 0.060604 0.076602 -0.797046 0.046931
  0.000000 0.246800 0.000001 -0.008483 -0.002390 0.639296
  -0.000000 0.222126 0.000000 -0.019082 0.249633 0.025181
  -0.358085 0.893698 0.063867 0.165956 -0.779840 0.118936
  0.000000 0.221431 0.000000 -0.065148 0.003526 0.301633
  -0.000001 0.154457 0.000000 0.132142 0.263757 0.315137
  -0.810392 0.550812 -0.372493 -0.661462 0.185290 -0.245041
  0.000000 3.626385 -0.000000 -0.924635 0.000944 0.030876
  0.782400 0.551417 -0.372918 -0.574847 -0.170887 0.166091
  -0.000000 3.626384 -0.000000 -0.895505 -0.008055 -0.028075
  -0.204726 4.194569 0.876844 -0.391657 0.392672 -0.831966
  -0.090614 0.138319 1.006144 0.932179 -0.003080 0.063956
  -0.090614 0.138319 1.006144 -0.719370 -0.012904 -0.018721
  1.706569 4.245831 -1.037302 0.622282 -0.233205 -0.702236
  -0.005721 0.138319 -1.010200 -0.038174 -0.726699 0.684995
  -0.005721 0.138319 -1.010200 -0.933333 0.005709 -0.010650
}

frame 10 {
  -0.000000 0.000000 -0.001428 -0.707107 -0.000000 -0.000000
  0.309123 6.236876 -0.106869 -0.077304 -0.540594 0.051988
  -0.000000 1.240110 -0.000000 0.024186 0.002904 -0.034789
  -0.000000 1.426177 -0.000000 -0.129468 -0.009846 0.016730
  0.000000 1.821084 0.000000 -0.081795 -0.211893 -0.090694
  0.000000 0.808123 -0.000000 0.001844 -0.515148 -0.857099
  -0.044148 0.766294 0.024775 0.027185 0.014681 0.061466
  -0.003138 0.224357 0.163703 -0.582226 0.395844 0.586146
  -0.259540 0.557511 -0.217253 0.916923 -0.373847 0.079459
  0.000000 0.017501 -0.000000 0.774550 -0.173201 -0.239986
  -0.000000 0.135389 -0.000002 0.082233 -0.094948 0.221280
  0.000000 0.113742 -0.000001 -0.176053 -0.052768 0.164477
  -0.000000 0.113742 -0.000001 -0.038605 -0.020923 0.229127
  0.262165 0.811892 0.662538 0.047908 0.854341 0.515798
  -0.244068 0.811855 0.663659 0.060687 0.853076 0.515517
  0.224683 0.261799 0.775027 0.050217 -0.688166 0.244436
  -0.000000 0.017499 0.000000 0.705562 -0.200485 -0.219948
  -0.000000 0.145787 -0.000000 0.142950 -0.037020 0.196471
  0.000000 0.112094 0.000001 -0.073264 -0.082605 0.230780
  -0.000000 0.111594 0.000001 0.015656 -0.055485 0.225992
  0.365935 0.793586 0.683419 0.046999 0.705543 -0.046999
  0.000000 0.011231 0.000000 0.125929 0.784490 0.580788
  0.000000 0.112704 0.000000 0.249010 -0.023435 0.387488
  0.360328 0.777495 0.684141 0.046999 0.705543 -0.046999
  -0.000000 0.010076 -0.000000 -0.099297 0.457443 0.813065
  -0.000000 0.108887 0.000002 -0.431278 0.352683 0.307499
  -0.136625 0.803881 0.692456 0.046999 0.705543 -0.046999
  0.000000 0.011230 -0.000000 -0.005591 0.731270 0.661937
  -0.000000 0.131865 -0.000001 0.062069 -0.104541 0.376629
  -0.136810 0.780377 0.690930 0.046999 0.705543 -0.046999
  -0.000000 0.010075 -0.000000 0.068236 0.628882 0.752462
  -0.000000 0.128464 0.000000 -0.211667 -0.099299 0.363525
  -0.002195 0.809024 0.000794 0.040325 0.000217 -0.001349
  -0.014832 1.825302 -0.071422 0.467192 -0.533469 -0.463268
  0.000001 1.493901 -0.000000 0.054748 0.650737 -0.662811
  -0.000001 2.103016 0.000000 -0.811212 0.031615 0.393827
  -0.000000 1.823368 0.000001 0.255820 0.419920 -0.211100
  0.288929 0.945606 -0.016980 -0.051795 -0.682659 -0.029456
  -0.000000 0.310930 0.000000 0.000222 -0.001467 -0.002344
  -0.000000 0.255058 0.000001 -0.029964 -0.071882 -0.099375
  0.182660 0.102358 0.122066 -0.147803 0.530632 0.238881
  0.000000 0.450618 -0.000001 -0.221088 -0.001971 -0.022311
  0.000000 0.295730 -0.000001 0.099042 0.156015 -0.150734
  0.586578 1.443575 0.291630 0.494772 0.504178 0.517254
  0.081678 0.956433 -0.018381 -0.233370 -0.644829 -0.351009
  -0.000000 0.323705 0.000000 0.060381 -0.029313 -0.532453
  -0.000000 0.229678 0.000000 0.030189 0.093456 -0.398703
  -0.151891 0.951490 -0.015788 -0.308151 -0.644013 -0.377241
  -0.000000 0.298947 -0.000000 0.096371 -0.030553 -0.429299
  0.000000 0.222754 0.000000 0.006275 0.070160 -0.362061
  -0.332550 0.872254 0.059175 -0.391536 -0.056793 -0.073532
  -0.000001 0.247823 -0.000000 -0.418017 0.003179 -0.041850
  0.000001 0.155400 -0.000000 -0.503535 -0.045821 -0.036007
  0.531378 1.351308 -0.004340 0.015907 0.004102 0.999865
  0.002183 1.423121 -0.451180 0.675237 0.001866 -0.002772
  0.014634 1.825496 -0.071451 0.428741 0.516759 0.554093
  -0.000000 1.493901 -0.000001 0.466396 0.326633 0.506164
  -0.000001 2.103015 0.000001 0.058394 0.506682 0.488722
  0.093228 1.351308 0.523154 0.654640 0.002695 0.755930
  0.000001 1.823368 -0.000002 -0.045735 0.509631 -0.321284
  0.286576 1.006395 -0.107108 0.024678 0.598348 -0.059120
  0.000000 0.249956 -0.000001 -0.029463 -0.012157 -0.324261
  0.000000 0.254363 0.000001 -0.076023 0.172999 -0.419853
  0.120541 0.102358 -0.183668 0.007204 -0.621681 0.355088
  -0.000001 0.445151 -0.000001 0.209695 -0.024501 0.024170
  0.000000 0.302324 -0.000000 -0.249857 0.522718 0.319443
  0.073564 1.013167 -0.024133 0.021280 -0.812611 0.006537
  -0.000001 0.266205 0.000000 0.056281 0.004781 0.582555
  -0.000000 0.229740 0.000000 -0.022517 0.184730 0.188405
  -0.127264 1.003841 0.060605 0.076601 -0.797046 0.046931
  -0.000000 0.246800 -0.000000 -0.008485 -0.002390 0.639280
  0.000000 0.222125 0.000000 -0.019075 0.249637 0.025201
  -0.358086 0.893698 0.063869 0.165966 -0.779837 0.118950
  0.000001 0.221431 0.000000 -0.065139 0.003526 0.301575
  -0.000001 0.154457 0.000000 0.132149 0.263753 0.315179
  -0.810392 0.550811 -0.372493 -0.650327 0.182901 -0.247116
  0.000000 3.626384 -0.000000 -0.928574 0.000920 0.031008
  0.782400 0.551416 -0.372917 -0.563289 -0.172149 0.169173
  0.000000 3.626384 -0.000001 -0.899839 -0.007894 -0.028211
  -0.174225 4.277575 0.868138 -0.391951 0.396733 -0.829931
  -0.090614 0.138319 1.006144 0.934929 -0.003559 0.064254
  -0.090614 0.138319 1.006144 -0.715854 -0.014973 -0.017931
  1.694646 4.328063 -1.025876 0.620083 -0.235191 -0.702833
  -0.005721 0.138319 -1.010200 -0.038428 -0.730474 0.680940
  -0.005721 0.138319 -1.010200 -0.936095 0.005850 -0.010951
}

