MD5Version 10
commandline ""

numFrames 31
numJoints 46
frameRate 60
numAnimatedComponents 276

hierarchy {
	"origin"	-1 63 0	//
	"chest"	0 63 6	// origin
	"tail"	1 63 12	// chest
	"leg0_upper"	1 63 18	// chest
	"leg0_lower"	3 63 24	// leg0_upper
	"leg5_upper"	1 63 30	// chest
	"leg5_lower"	5 63 36	// leg5_upper
	"leg4_upper"	1 63 42	// chest
	"leg4_lower"	7 63 48	// leg4_upper
	"leg1_upper"	1 63 54	// chest
	"leg1_lower"	9 63 60	// leg1_upper
	"leg3_upper"	1 63 66	// chest
	"leg3_lower"	11 63 72	// leg3_upper
	"leg2_upper"	1 63 78	// chest
	"leg2_lower"	13 63 84	// leg2_upper
	"antenna_upper_left0"	1 63 90	// chest
	"antenna_upper_left1"	15 63 96	// antenna_upper_left0
	"antenna_upper_right0"	1 63 102	// chest
	"antenna_upper_right1"	17 63 108	// antenna_upper_right0
	"antenna_right0"	1 63 114	// chest
	"antenna_right1"	19 63 120	// antenna_right0
	"antenna_left0"	1 63 126	// chest
	"antenna_left1"	21 63 132	// antenna_left0
	"antenna_lower_left0"	1 63 138	// chest
	"antenna_lower_left1"	23 63 144	// antenna_lower_left0
	"antenna_lower_right0"	1 63 150	// chest
	"antenna_lower_right1"	25 63 156	// antenna_lower_right0
	"IKantenna_right"	1 63 162	// chest
	"IKantenna_left"	1 63 168	// chest
	"IKantenna_upper_left"	1 63 174	// chest
	"IKantenna_upper_right"	1 63 180	// chest
	"IKantenna_lower_left"	1 63 186	// chest
	"IKantenna_lower_right"	1 63 192	// chest
	"IKleg0"	0 63 198	// origin
	"IKleg0_upper"	0 63 204	// origin
	"IKleg1"	0 63 210	// origin
	"IKleg1_upper"	0 63 216	// origin
	"IKleg5"	0 63 222	// origin
	"IKleg5_upper"	0 63 228	// origin
	"IKleg4"	0 63 234	// origin
	"IKleg4_upper"	0 63 240	// origin
	"IKleg3"	0 63 246	// origin
	"IKleg3_upper"	0 63 252	// origin
	"IKleg2"	0 63 258	// origin
	"IKIKleg2_upper"	0 63 264	// origin
	"IKtail"	0 63 270	// origin
}

bounds {
	( 0.000000 0.000000 0.000000 ) ( 0.000000 0.000000 0.000000 )
	( 0.000000 0.000000 0.000000 ) ( 0.000000 0.000000 0.000000 )
	( 0.000000 0.000000 0.000000 ) ( 0.000000 0.000000 0.000000 )
	( 0.000000 0.000000 0.000000 ) ( 0.000000 0.000000 0.000000 )
	( 0.000000 0.000000 0.000000 ) ( 0.000000 0.000000 0.000000 )
	( 0.000000 0.000000 0.000000 ) ( 0.000000 0.000000 0.000000 )
	( 0.000000 0.000000 0.000000 ) ( 0.000000 0.000000 0.000000 )
	( 0.000000 0.000000 0.000000 ) ( 0.000000 0.000000 0.000000 )
	( 0.000000 0.000000 0.000000 ) ( 0.000000 0.000000 0.000000 )
	( 0.000000 0.000000 0.000000 ) ( 0.000000 0.000000 0.000000 )
	( 0.000000 0.000000 0.000000 ) ( 0.000000 0.000000 0.000000 )
	( 0.000000 0.000000 0.000000 ) ( 0.000000 0.000000 0.000000 )
	( 0.000000 0.000000 0.000000 ) ( 0.000000 0.000000 0.000000 )
	( 0.000000 0.000000 0.000000 ) ( 0.000000 0.000000 0.000000 )
	( 0.000000 0.000000 0.000000 ) ( 0.000000 0.000000 0.000000 )
	( 0.000000 0.000000 0.000000 ) ( 0.000000 0.000000 0.000000 )
	( 0.000000 0.000000 0.000000 ) ( 0.000000 0.000000 0.000000 )
	( 0.000000 0.000000 0.000000 ) ( 0.000000 0.000000 0.000000 )
	( 0.000000 0.000000 0.000000 ) ( 0.000000 0.000000 0.000000 )
	( 0.000000 0.000000 0.000000 ) ( 0.000000 0.000000 0.000000 )
	( 0.000000 0.000000 0.000000 ) ( 0.000000 0.000000 0.000000 )
	( 0.000000 0.000000 0.000000 ) ( 0.000000 0.000000 0.000000 )
	( 0.000000 0.000000 0.000000 ) ( 0.000000 0.000000 0.000000 )
	( 0.000000 0.000000 0.000000 ) ( 0.000000 0.000000 0.000000 )
	( 0.000000 0.000000 0.000000 ) ( 0.000000 0.000000 0.000000 )
	( 0.000000 0.000000 0.000000 ) ( 0.000000 0.000000 0.000000 )
	( 0.000000 0.000000 0.000000 ) ( 0.000000 0.000000 0.000000 )
	( 0.000000 0.000000 0.000000 ) ( 0.000000 0.000000 0.000000 )
	( 0.000000 0.000000 0.000000 ) ( 0.000000 0.000000 0.000000 )
	( 0.000000 0.000000 0.000000 ) ( 0.000000 0.000000 0.000000 )
	( 0.000000 0.000000 0.000000 ) ( 0.000000 0.000000 0.000000 )
}

baseframe {
	( -0.018897 0.000000 0.100036 ) ( -0.707107 -0.000000 0.000000 )
	( 0.312367 -0.360185 -0.004892 ) ( 0.496413 -0.503564 0.496625 )
	( -0.000000 0.520055 0.000000 ) ( 0.178497 -0.000622 -0.003720 )
	( -0.136732 0.038257 0.004402 ) ( 0.147673 0.125439 0.674731 )
	( 0.000000 0.447469 -0.000000 ) ( -0.288153 -0.339784 0.838878 )
	( 0.151140 0.042027 0.014281 ) ( 0.136578 -0.118766 -0.681613 )
	( 0.000000 0.437615 -0.000000 ) ( -0.289056 0.349836 -0.831773 )
	( 0.162623 0.221463 -0.011451 ) ( 0.117944 -0.043029 -0.407657 )
	( 0.000000 0.501200 -0.000000 ) ( -0.519802 -0.014924 0.052609 )
	( -0.162016 0.218096 -0.011498 ) ( 0.116163 0.038814 0.404078 )
	( 0.000000 0.492872 0.000000 ) ( -0.515809 0.011248 -0.048502 )
	( 0.142976 0.370391 -0.009384 ) ( -0.001600 0.000475 -0.113450 )
	( -0.000000 0.422763 -0.000000 ) ( -0.443406 0.047551 -0.096794 )
	( -0.137594 0.373323 -0.014729 ) ( -0.001093 -0.003333 0.114207 )
	( 0.000000 0.421663 -0.000000 ) ( -0.449049 -0.045680 0.088258 )
	( 0.035670 -0.040818 0.060014 ) ( -0.018181 0.047886 -0.998486 )
	( 0.000000 0.026025 0.000000 ) ( -0.002853 0.033945 -0.001202 )
	( -0.027674 -0.041720 0.059816 ) ( -0.052107 -0.046785 0.997231 )
	( 0.000000 0.025637 0.000000 ) ( -0.001972 -0.121503 0.002943 )
	( -0.050906 -0.034136 0.024111 ) ( -0.058393 -0.145779 0.987384 )
	( 0.000000 0.049218 0.000000 ) ( -0.001273 -0.130147 0.004151 )
	( 0.059788 -0.034178 0.023788 ) ( -0.058967 0.144900 -0.987571 )
	( -0.000000 0.049218 -0.000000 ) ( -0.001261 0.129525 -0.004153 )
	( 0.032298 -0.054366 -0.002832 ) ( -0.005735 0.051282 0.998667 )
	( 0.000000 0.018246 -0.000000 ) ( -0.000223 -0.105798 -0.003347 )
	( -0.026453 -0.054341 -0.002832 ) ( -0.011413 -0.051461 -0.998493 )
	( 0.000000 0.018247 -0.000000 ) ( -0.000219 0.104659 0.003397 )
	( -0.053205 -0.156103 -0.013104 ) ( 0.083867 -0.236072 -0.951085 )
	( 0.060800 -0.156152 -0.013104 ) ( 0.083973 0.236037 0.951008 )
	( 0.038704 -0.122207 0.051886 ) ( -0.000097 -0.468376 0.883529 )
	( -0.031079 -0.122177 0.051886 ) ( -0.000097 -0.468376 0.883529 )
	( 0.031859 -0.116268 0.003550 ) ( 0.080502 0.440954 0.880320 )
	( -0.024230 -0.116244 0.003550 ) ( 0.080308 -0.440987 -0.880387 )
	( 0.474768 0.072944 -0.404259 ) ( 0.000374 0.707079 0.000000 )
	( 0.252528 -0.529487 -0.555359 ) ( -0.000000 -0.250468 0.968125 )
	( -0.581522 0.073430 -0.831409 ) ( 0.000374 0.707079 0.000000 )
	( -0.213911 -0.457952 -0.518543 ) ( 0.339129 -0.234470 0.906822 )
	( 0.474768 0.072944 0.404512 ) ( 0.000374 0.707079 0.000000 )
	( 0.252528 -0.529487 0.555269 ) ( 0.968125 -0.000000 0.000000 )
	( -0.581523 0.067522 0.830352 ) ( 0.000374 0.707107 0.000000 )
	( -0.223781 -0.456157 0.514222 ) ( 0.906822 -0.087686 0.339129 )
	( -0.740141 0.073430 0.364709 ) ( 0.000374 0.707079 0.000000 )
	( -0.450942 -0.330299 0.228546 ) ( 0.878231 -0.076169 0.447886 )
	( -0.740141 0.082596 -0.360528 ) ( 0.000374 0.707079 0.000000 )
	( -0.450942 -0.330299 -0.236787 ) ( -0.865705 0.166269 -0.471641 )
	( -0.768131 -0.554428 -0.001125 ) ( 0.576453 -0.409514 0.576453 )
}

frame 0 {
	-0.018897 0.000000 0.100036 0.707107 0.000000 -0.000000
	0.312367 -0.360185 -0.004892 -0.496413 0.503564 -0.496625
	-0.000000 0.520055 0.000000 -0.178497 0.000622 0.003720
	-0.136732 0.038257 0.004402 -0.147673 -0.125439 -0.674731
	0.000000 0.447469 -0.000000 0.288153 0.339784 -0.838878
	0.151140 0.042027 0.014281 -0.136578 0.118766 0.681613
	0.000000 0.437615 -0.000000 0.289056 -0.349836 0.831773
	0.162623 0.221463 -0.011451 -0.117944 0.043029 0.407657
	0.000000 0.501200 -0.000000 0.519802 0.014924 -0.052609
	-0.162016 0.218096 -0.011498 -0.116163 -0.038814 -0.404078
	0.000000 0.492872 0.000000 0.515809 -0.011248 0.048502
	0.142976 0.370391 -0.009384 0.001600 -0.000475 0.113450
	-0.000000 0.422763 -0.000000 0.443406 -0.047551 0.096794
	-0.137594 0.373323 -0.014729 0.001093 0.003333 -0.114207
	0.000000 0.421663 -0.000000 0.449049 0.045680 -0.088258
	0.035670 -0.040818 0.060014 0.018181 -0.047886 0.998486
	0.000000 0.026025 0.000000 0.002853 -0.033945 0.001202
	-0.027674 -0.041720 0.059816 0.052107 0.046785 -0.997231
	0.000000 0.025637 0.000000 0.001972 0.121503 -0.002943
	-0.050906 -0.034136 0.024111 0.058393 0.145779 -0.987384
	0.000000 0.049218 0.000000 0.001273 0.130147 -0.004151
	0.059788 -0.034178 0.023788 0.058967 -0.144900 0.987571
	-0.000000 0.049218 -0.000000 0.001261 -0.129525 0.004153
	0.032298 -0.054366 -0.002832 0.005735 -0.051282 -0.998667
	0.000000 0.018246 -0.000000 0.000223 0.105798 0.003347
	-0.026453 -0.054341 -0.002832 0.011413 0.051461 0.998493
	0.000000 0.018247 -0.000000 0.000219 -0.104659 -0.003397
	-0.053205 -0.156103 -0.013104 -0.083867 0.236072 0.951085
	0.060800 -0.156152 -0.013104 -0.083973 -0.236037 -0.951008
	0.038704 -0.122207 0.051886 -0.000097 -0.468376 0.883529
	-0.031079 -0.122177 0.051886 -0.000097 -0.468376 0.883529
	0.031859 -0.116268 0.003550 -0.080502 -0.440954 -0.880320
	-0.024230 -0.116244 0.003550 -0.080308 0.440987 0.880387
	0.474768 0.072944 -0.404259 -0.000374 -0.707079 -0.000000
	0.252528 -0.529487 -0.555359 0.000000 0.250468 -0.968125
	-0.581522 0.073430 -0.831409 -0.000374 -0.707079 -0.000000
	-0.213911 -0.457952 -0.518543 -0.339129 0.234470 -0.906822
	0.474768 0.072944 0.404512 -0.000374 -0.707079 -0.000000
	0.252528 -0.529487 0.555269 -0.968125 0.000000 -0.000000
	-0.581523 0.067522 0.830352 -0.000374 -0.707107 -0.000000
	-0.223781 -0.456157 0.514222 -0.906822 0.087686 -0.339129
	-0.740141 0.073430 0.364709 -0.000374 -0.707079 -0.000000
	-0.450942 -0.330299 0.228546 -0.878231 0.076169 -0.447886
	-0.740141 0.082596 -0.360528 -0.000374 -0.707079 -0.000000
	-0.450942 -0.330299 -0.236787 0.865705 -0.166269 0.471641
	-0.768131 -0.554428 -0.001125 -0.576453 0.409514 -0.576453
}

frame 1 {
	-0.018897 0.000000 0.100036 0.707107 0.000000 -0.000000
	0.312367 -0.360185 -0.004892 -0.496413 0.503564 -0.496625
	-0.000000 0.520055 0.000000 -0.178655 0.000845 0.002490
	-0.136732 0.038257 0.004402 -0.147673 -0.125439 -0.674731
	0.000000 0.447469 -0.000000 0.288153 0.339784 -0.838878
	0.151140 0.042027 0.014281 -0.136578 0.118766 0.681613
	0.000000 0.437615 -0.000000 0.289056 -0.349836 0.831773
	0.162623 0.221463 -0.011451 -0.117944 0.043029 0.407657
	0.000000 0.501200 -0.000000 0.519802 0.014924 -0.052609
	-0.162016 0.218096 -0.011498 -0.156216 -0.057305 -0.405954
	-0.000000 0.492872 -0.000000 0.567436 -0.011208 0.052082
	0.142976 0.370391 -0.009384 0.001600 -0.000475 0.113450
	-0.000000 0.422763 -0.000000 0.443406 -0.047551 0.096794
	-0.137594 0.373323 -0.014729 0.001093 0.003333 -0.114207
	0.000000 0.421663 -0.000000 0.449049 0.045680 -0.088258
	0.035670 -0.040818 0.060014 0.018181 -0.047886 0.998486
	0.000000 0.026025 0.000000 0.002853 -0.033945 0.001202
	-0.027674 -0.041720 0.059816 0.052107 0.046785 -0.997231
	0.000000 0.025637 0.000000 0.001972 0.121503 -0.002943
	-0.050906 -0.034136 0.024111 0.058393 0.145779 -0.987384
	0.000000 0.049218 0.000000 0.001273 0.130147 -0.004151
	0.059788 -0.034178 0.023788 0.058967 -0.144900 0.987571
	-0.000000 0.049218 -0.000000 0.001261 -0.129525 0.004153
	0.032298 -0.054366 -0.002832 0.005735 -0.051282 -0.998667
	0.000000 0.018246 -0.000000 0.000223 0.105798 0.003347
	-0.026453 -0.054341 -0.002832 0.011413 0.051461 0.998493
	0.000000 0.018247 -0.000000 0.000219 -0.104659 -0.003397
	-0.053205 -0.156103 -0.013104 -0.083867 0.236072 0.951085
	0.060800 -0.156152 -0.013104 -0.083973 -0.236037 -0.951008
	0.038704 -0.122207 0.051886 -0.000097 -0.468376 0.883529
	-0.031079 -0.122177 0.051886 -0.000097 -0.468376 0.883529
	0.031859 -0.116268 0.003550 -0.080502 -0.440954 -0.880320
	-0.024230 -0.116244 0.003550 -0.080308 0.440987 0.880387
	0.474768 0.072944 -0.404259 -0.000374 -0.707079 -0.000000
	0.252528 -0.529487 -0.555359 0.000000 0.250468 -0.968125
	-0.555644 0.046803 -0.813830 -0.000374 -0.707079 -0.000000
	-0.213911 -0.457952 -0.518543 -0.339129 0.234470 -0.906822
	0.474768 0.072944 0.404512 -0.000374 -0.707079 -0.000000
	0.252528 -0.529487 0.555269 -0.968125 0.000000 -0.000000
	-0.581523 0.067522 0.830352 -0.000374 -0.707107 -0.000000
	-0.223781 -0.456157 0.514222 -0.906822 0.087686 -0.339129
	-0.740141 0.073430 0.364709 -0.000374 -0.706219 -0.000000
	-0.450942 -0.330299 0.228546 -0.878231 0.076169 -0.447886
	-0.740141 0.082596 -0.360528 -0.000374 -0.705113 -0.000001
	-0.450942 -0.330299 -0.236787 0.865705 -0.166269 0.471641
	-0.767548 -0.554428 -0.002679 -0.576453 0.409514 -0.576453
}

frame 2 {
	-0.018897 0.000000 0.100036 0.707107 0.000000 -0.000000
	0.312367 -0.360185 -0.004892 -0.496413 0.503564 -0.496625
	-0.000000 0.520055 0.000000 -0.179155 0.001554 -0.001406
	-0.136732 0.038257 0.004402 -0.147673 -0.125439 -0.674731
	0.000000 0.447469 -0.000000 0.288153 0.339784 -0.838878
	0.151140 0.042027 0.014281 -0.136578 0.118766 0.681613
	0.000000 0.437615 -0.000000 0.289056 -0.349836 0.831773
	0.162623 0.221463 -0.011451 -0.117944 0.043029 0.407657
	0.000000 0.501200 -0.000000 0.519802 0.014924 -0.052609
	-0.162016 0.218096 -0.011498 -0.219095 -0.088313 -0.409475
	0.000000 0.492872 -0.000000 0.658922 -0.012050 0.056611
	0.142976 0.370391 -0.009384 0.001600 -0.000475 0.113450
	-0.000000 0.422763 -0.000000 0.443406 -0.047551 0.096794
	-0.137594 0.373323 -0.014729 0.001093 0.003333 -0.114207
	0.000000 0.421663 -0.000000 0.449049 0.045680 -0.088258
	0.035670 -0.040818 0.060014 0.018181 -0.047886 0.998486
	0.000000 0.026025 0.000000 0.002853 -0.033945 0.001202
	-0.027674 -0.041720 0.059816 0.052107 0.046785 -0.997231
	0.000000 0.025637 0.000000 0.001972 0.121503 -0.002943
	-0.050906 -0.034136 0.024111 0.058393 0.145779 -0.987384
	0.000000 0.049218 0.000000 0.001273 0.130147 -0.004151
	0.059788 -0.034178 0.023788 0.058967 -0.144900 0.987571
	-0.000000 0.049218 -0.000000 0.001261 -0.129525 0.004153
	0.032298 -0.054366 -0.002832 0.005735 -0.051282 -0.998667
	0.000000 0.018246 -0.000000 0.000223 0.105798 0.003347
	-0.026453 -0.054341 -0.002832 0.011413 0.051461 0.998493
	0.000000 0.018247 -0.000000 0.000219 -0.104659 -0.003397
	-0.053205 -0.156103 -0.013104 -0.083867 0.236072 0.951085
	0.060800 -0.156152 -0.013104 -0.083973 -0.236037 -0.951008
	0.038704 -0.122207 0.051886 -0.000097 -0.468376 0.883529
	-0.031079 -0.122177 0.051886 -0.000097 -0.468376 0.883529
	0.031859 -0.116268 0.003550 -0.080502 -0.440954 -0.880320
	-0.024230 -0.116244 0.003550 -0.080308 0.440987 0.880387
	0.474768 0.072944 -0.404259 -0.000374 -0.707079 -0.000000
	0.252528 -0.529487 -0.555359 0.000000 0.250468 -0.968125
	-0.489490 0.020147 -0.768803 -0.000374 -0.707079 -0.000000
	-0.213911 -0.457952 -0.518543 -0.339129 0.234470 -0.906822
	0.474768 0.072944 0.404512 -0.000374 -0.707079 -0.000000
	0.252528 -0.529487 0.555269 -0.968125 0.000000 -0.000000
	-0.581523 0.067522 0.830352 -0.000374 -0.707107 -0.000000
	-0.223781 -0.456157 0.514222 -0.906822 0.087686 -0.339129
	-0.740141 0.073430 0.364709 -0.000374 -0.703775 -0.000002
	-0.450942 -0.330299 0.228546 -0.878231 0.076169 -0.447886
	-0.740141 0.082596 -0.360528 -0.000374 -0.699585 -0.000004
	-0.450942 -0.330299 -0.236787 0.865705 -0.166269 0.471641
	-0.765787 -0.554428 -0.007376 -0.576453 0.409514 -0.576453
}

frame 3 {
	-0.018897 0.000000 0.100036 0.707107 0.000000 -0.000000
	0.312367 -0.360185 -0.004892 -0.496413 0.503564 -0.496625
	-0.000000 0.520055 0.000000 -0.179982 0.002735 -0.007901
	-0.136732 0.038257 0.004402 -0.147673 -0.125439 -0.674731
	0.000000 0.447469 -0.000000 0.288153 0.339784 -0.838878
	0.151140 0.042027 0.014281 -0.136578 0.118766 0.681613
	0.000000 0.437615 -0.000000 0.289056 -0.349836 0.831773
	0.162623 0.221463 -0.011451 -0.117944 0.043029 0.407657
	0.000000 0.501200 -0.000000 0.519802 0.014924 -0.052609
	-0.162016 0.218096 -0.011498 -0.222408 -0.097832 -0.416163
	0.000000 0.492872 -0.000000 0.725187 -0.014878 0.054027
	0.142976 0.370391 -0.009384 0.001600 -0.000475 0.113450
	-0.000000 0.422763 -0.000000 0.443406 -0.047551 0.096794
	-0.137594 0.373323 -0.014729 0.001093 0.003333 -0.114207
	0.000000 0.421663 -0.000000 0.449049 0.045680 -0.088258
	0.035670 -0.040818 0.060014 0.018181 -0.047886 0.998486
	0.000000 0.026025 0.000000 0.002853 -0.033945 0.001202
	-0.027674 -0.041720 0.059816 0.052107 0.046785 -0.997231
	0.000000 0.025637 0.000000 0.001972 0.121503 -0.002943
	-0.050906 -0.034136 0.024111 0.058393 0.145779 -0.987384
	0.000000 0.049218 0.000000 0.001273 0.130147 -0.004151
	0.059788 -0.034178 0.023788 0.058967 -0.144900 0.987571
	-0.000000 0.049218 -0.000000 0.001261 -0.129525 0.004153
	0.032298 -0.054366 -0.002832 0.005735 -0.051282 -0.998667
	0.000000 0.018246 -0.000000 0.000223 0.105798 0.003347
	-0.026453 -0.054341 -0.002832 0.011413 0.051461 0.998493
	0.000000 0.018247 -0.000000 0.000219 -0.104659 -0.003397
	-0.053205 -0.156103 -0.013104 -0.083867 0.236072 0.951085
	0.060800 -0.156152 -0.013104 -0.083973 -0.236037 -0.951008
	0.038704 -0.122207 0.051886 -0.000097 -0.468376 0.883529
	-0.031079 -0.122177 0.051886 -0.000097 -0.468376 0.883529
	0.031859 -0.116268 0.003550 -0.080502 -0.440954 -0.880320
	-0.024230 -0.116244 0.003550 -0.080308 0.440987 0.880387
	0.474768 0.072944 -0.404259 -0.000374 -0.707079 -0.000000
	0.252528 -0.529487 -0.555359 0.000000 0.250468 -0.968125
	-0.397756 0.073430 -0.706292 -0.000374 -0.707079 -0.000000
	-0.213911 -0.457952 -0.518543 -0.339129 0.234470 -0.906822
	0.474768 0.072944 0.404512 -0.000374 -0.707079 -0.000000
	0.252528 -0.529487 0.555269 -0.968125 0.000000 -0.000000
	-0.581523 0.067522 0.830352 -0.000374 -0.707107 -0.000000
	-0.223781 -0.456157 0.514222 -0.906822 0.087686 -0.339129
	-0.740141 0.073430 0.364709 -0.000374 -0.699909 -0.000004
	-0.450942 -0.330299 0.228546 -0.878231 0.076169 -0.447886
	-0.740141 0.082596 -0.360528 -0.000374 -0.690912 -0.000008
	-0.450942 -0.330299 -0.236787 0.865705 -0.166269 0.471641
	-0.762839 -0.554428 -0.015238 -0.576453 0.409514 -0.576453
}

frame 4 {
	-0.018897 0.000000 0.100036 0.707107 0.000000 -0.000000
	0.312367 -0.360185 -0.004892 -0.496413 0.503564 -0.496625
	-0.000000 0.520055 0.000000 -0.181157 0.004434 -0.017239
	-0.136732 0.038257 0.004402 -0.147673 -0.125439 -0.674731
	0.000000 0.447469 -0.000000 0.288153 0.339784 -0.838878
	0.151140 0.042027 0.014281 -0.136578 0.118766 0.681613
	0.000000 0.437615 -0.000000 0.289056 -0.349836 0.831773
	0.162623 0.221463 -0.011451 -0.117944 0.043029 0.407657
	0.000000 0.501200 -0.000000 0.519802 0.014924 -0.052609
	-0.162016 0.218096 -0.011498 -0.222408 -0.097832 -0.416163
	0.000000 0.492872 -0.000000 0.725187 -0.014878 0.054027
	0.142976 0.370391 -0.009384 0.001600 -0.000475 0.113450
	-0.000000 0.422763 -0.000000 0.443406 -0.047551 0.096794
	-0.137594 0.373323 -0.014729 0.001093 0.003333 -0.114207
	0.000000 0.421663 -0.000000 0.449049 0.045680 -0.088258
	0.035670 -0.040818 0.060014 0.018181 -0.047886 0.998486
	0.000000 0.026025 0.000000 0.002853 -0.033945 0.001202
	-0.027674 -0.041720 0.059816 0.052107 0.046785 -0.997231
	0.000000 0.025637 0.000000 0.001972 0.121503 -0.002943
	-0.050906 -0.034136 0.024111 0.058393 0.145779 -0.987384
	0.000000 0.049218 0.000000 0.001273 0.130147 -0.004151
	0.059788 -0.034178 0.023788 0.058967 -0.144900 0.987571
	-0.000000 0.049218 -0.000000 0.001261 -0.129525 0.004153
	0.032298 -0.054366 -0.002832 0.005735 -0.051282 -0.998667
	0.000000 0.018246 -0.000000 0.000223 0.105798 0.003347
	-0.026453 -0.054341 -0.002832 0.011413 0.051461 0.998493
	0.000000 0.018247 -0.000000 0.000219 -0.104659 -0.003397
	-0.053205 -0.156103 -0.013104 -0.083867 0.236072 0.951085
	0.060800 -0.156152 -0.013104 -0.083973 -0.236037 -0.951008
	0.038704 -0.122207 0.051886 -0.000097 -0.468376 0.883529
	-0.031079 -0.122177 0.051886 -0.000097 -0.468376 0.883529
	0.031859 -0.116268 0.003550 -0.080502 -0.440954 -0.880320
	-0.024230 -0.116244 0.003550 -0.080308 0.440987 0.880387
	0.474768 0.072944 -0.404259 -0.000374 -0.707079 -0.000000
	0.252528 -0.529487 -0.555359 0.000000 0.250468 -0.968125
	-0.397756 0.073430 -0.706292 -0.000374 -0.707079 -0.000000
	-0.213911 -0.457952 -0.518543 -0.339129 0.234470 -0.906822
	0.474768 0.072944 0.404512 -0.000374 -0.707079 -0.000000
	0.252528 -0.529487 0.555269 -0.968125 0.000000 -0.000000
	-0.581523 0.067522 0.830352 -0.000374 -0.707107 -0.000000
	-0.223781 -0.456157 0.514222 -0.906822 0.087686 -0.339129
	-0.740141 0.073430 0.364709 -0.000374 -0.694747 -0.000006
	-0.450942 -0.330299 0.228546 -0.878231 0.076169 -0.447886
	-0.740141 0.082596 -0.360528 -0.000374 -0.679372 -0.000014
	-0.450942 -0.330299 -0.236787 0.865705 -0.166269 0.471641
	-0.758711 -0.554428 -0.026247 -0.576453 0.409514 -0.576453
}

frame 5 {
	-0.018897 0.000000 0.100036 0.707107 0.000000 -0.000000
	0.312367 -0.360185 -0.004892 -0.496413 0.503564 -0.496625
	-0.000000 0.520055 0.000000 -0.182643 0.006615 -0.029235
	-0.136732 0.038257 0.004402 -0.147673 -0.125439 -0.674731
	0.000000 0.447469 -0.000000 0.288153 0.339784 -0.838878
	0.151140 0.042027 0.014281 -0.136578 0.118766 0.681613
	0.000000 0.437615 -0.000000 0.289056 -0.349836 0.831773
	0.162623 0.221463 -0.011451 -0.117944 0.043029 0.407657
	0.000000 0.501200 -0.000000 0.519802 0.014924 -0.052609
	-0.162016 0.218096 -0.011498 -0.222408 -0.097832 -0.416163
	0.000000 0.492872 -0.000000 0.725187 -0.014878 0.054027
	0.142976 0.370391 -0.009384 0.001600 -0.000475 0.113450
	-0.000000 0.422763 -0.000000 0.443406 -0.047551 0.096794
	-0.137594 0.373323 -0.014729 0.001093 0.003333 -0.114207
	0.000000 0.421663 -0.000000 0.449049 0.045680 -0.088258
	0.035670 -0.040818 0.060014 0.018181 -0.047886 0.998486
	0.000000 0.026025 0.000000 0.002853 -0.033945 0.001202
	-0.027674 -0.041720 0.059816 0.052107 0.046785 -0.997231
	0.000000 0.025637 0.000000 0.001972 0.121503 -0.002943
	-0.050906 -0.034136 0.024111 0.058393 0.145779 -0.987384
	0.000000 0.049218 0.000000 0.001273 0.130147 -0.004151
	0.059788 -0.034178 0.023788 0.058967 -0.144900 0.987571
	-0.000000 0.049218 -0.000000 0.001261 -0.129525 0.004153
	0.032298 -0.054366 -0.002832 0.005735 -0.051282 -0.998667
	0.000000 0.018246 -0.000000 0.000223 0.105798 0.003347
	-0.026453 -0.054341 -0.002832 0.011413 0.051461 0.998493
	0.000000 0.018247 -0.000000 0.000219 -0.104659 -0.003397
	-0.053205 -0.156103 -0.013104 -0.083867 0.236072 0.951085
	0.060800 -0.156152 -0.013104 -0.083973 -0.236037 -0.951008
	0.038704 -0.122207 0.051886 -0.000097 -0.468376 0.883529
	-0.031079 -0.122177 0.051886 -0.000097 -0.468376 0.883529
	0.031859 -0.116268 0.003550 -0.080502 -0.440954 -0.880320
	-0.024230 -0.116244 0.003550 -0.080308 0.440987 0.880387
	0.474768 0.072944 -0.404259 -0.000374 -0.707079 -0.000000
	0.252528 -0.529487 -0.555359 0.000000 0.250468 -0.968125
	-0.397756 0.073430 -0.706292 -0.000374 -0.707079 -0.000000
	-0.213911 -0.457952 -0.518543 -0.339129 0.234470 -0.906822
	0.474768 0.072944 0.404512 -0.000374 -0.707079 -0.000000
	0.252528 -0.529487 0.555269 -0.968125 0.000000 -0.000000
	-0.581523 0.067522 0.830352 -0.000374 -0.707107 -0.000000
	-0.223781 -0.456157 0.514222 -0.906822 0.087686 -0.339129
	-0.740141 0.073430 0.364709 -0.000374 -0.688380 -0.000010
	-0.450942 -0.330299 0.228546 -0.878231 0.076169 -0.447886
	-0.740141 0.082596 -0.360528 -0.000373 -0.665161 -0.000022
	-0.450942 -0.330299 -0.236787 0.865705 -0.166269 0.471641
	-0.753430 -0.554428 -0.040332 -0.576453 0.409514 -0.576453
}

frame 6 {
	-0.018897 0.000000 0.100036 0.707107 0.000000 -0.000000
	0.312367 -0.360185 -0.004892 -0.496413 0.503564 -0.496625
	-0.000000 0.520055 0.000000 -0.184429 0.009291 -0.043949
	-0.136732 0.038257 0.004402 -0.147673 -0.125439 -0.674731
	0.000000 0.447469 -0.000000 0.288153 0.339784 -0.838878
	0.151140 0.042027 0.014281 -0.136578 0.118766 0.681613
	0.000000 0.437615 -0.000000 0.289056 -0.349836 0.831773
	0.162623 0.221463 -0.011451 -0.117944 0.043029 0.407657
	0.000000 0.501200 -0.000000 0.519802 0.014924 -0.052609
	-0.162016 0.218096 -0.011498 -0.222408 -0.097832 -0.416163
	0.000000 0.492872 -0.000000 0.725187 -0.014878 0.054027
	0.142976 0.370391 -0.009384 0.001600 -0.000475 0.113450
	-0.000000 0.422763 -0.000000 0.443406 -0.047551 0.096794
	-0.137594 0.373323 -0.014729 0.001093 0.003333 -0.114207
	0.000000 0.421663 -0.000000 0.449049 0.045680 -0.088258
	0.035670 -0.040818 0.060014 0.018181 -0.047886 0.998486
	0.000000 0.026025 0.000000 0.002853 -0.033945 0.001202
	-0.027674 -0.041720 0.059816 0.052107 0.046785 -0.997231
	0.000000 0.025637 0.000000 0.001972 0.121503 -0.002943
	-0.050906 -0.034136 0.024111 0.058393 0.145779 -0.987384
	0.000000 0.049218 0.000000 0.001273 0.130147 -0.004151
	0.059788 -0.034178 0.023788 0.058967 -0.144900 0.987571
	-0.000000 0.049218 -0.000000 0.001261 -0.129525 0.004153
	0.032298 -0.054366 -0.002832 0.005735 -0.051282 -0.998667
	0.000000 0.018246 -0.000000 0.000223 0.105798 0.003347
	-0.026453 -0.054341 -0.002832 0.011413 0.051461 0.998493
	0.000000 0.018247 -0.000000 0.000219 -0.104659 -0.003397
	-0.053205 -0.156103 -0.013104 -0.083867 0.236072 0.951085
	0.060800 -0.156152 -0.013104 -0.083973 -0.236037 -0.951008
	0.038704 -0.122207 0.051886 -0.000097 -0.468376 0.883529
	-0.031079 -0.122177 0.051886 -0.000097 -0.468376 0.883529
	0.031859 -0.116268 0.003550 -0.080502 -0.440954 -0.880320
	-0.024230 -0.116244 0.003550 -0.080308 0.440987 0.880387
	0.474768 0.072944 -0.404259 -0.000374 -0.707079 -0.000000
	0.252528 -0.529487 -0.555359 0.000000 0.250468 -0.968125
	-0.397756 0.073430 -0.706292 -0.000374 -0.707079 -0.000000
	-0.213911 -0.457952 -0.518543 -0.339129 0.234470 -0.906822
	0.474768 0.072944 0.404512 -0.000374 -0.707079 -0.000000
	0.252528 -0.529487 0.555269 -0.968125 0.000000 -0.000000
	-0.581523 0.067522 0.830352 -0.000374 -0.707107 -0.000000
	-0.223781 -0.456157 0.514222 -0.906822 0.087686 -0.339129
	-0.740141 0.073430 0.364709 -0.000374 -0.680882 -0.000014
	-0.450942 -0.330299 0.228546 -0.878231 0.076169 -0.447886
	-0.740141 0.082596 -0.360528 -0.000373 -0.648426 -0.000030
	-0.450942 -0.330299 -0.236787 0.865705 -0.166269 0.471641
	-0.747044 -0.554428 -0.057361 -0.576453 0.409514 -0.576453
}

frame 7 {
	-0.018897 0.000000 0.100036 0.707107 0.000000 -0.000000
	0.312367 -0.360185 -0.004892 -0.496413 0.503564 -0.496625
	-0.000000 0.520055 0.000000 -0.186498 0.012469 -0.061432
	-0.136732 0.038257 0.004402 -0.147673 -0.125439 -0.674731
	0.000000 0.447469 -0.000000 0.288153 0.339784 -0.838878
	0.151140 0.042027 0.014281 -0.136578 0.118766 0.681613
	0.000000 0.437615 -0.000000 0.289056 -0.349836 0.831773
	0.162623 0.221463 -0.011451 -0.117944 0.043029 0.407657
	0.000000 0.501200 -0.000000 0.519802 0.014924 -0.052609
	-0.162016 0.218096 -0.011498 -0.222408 -0.097832 -0.416163
	0.000000 0.492872 -0.000000 0.725187 -0.014878 0.054027
	0.142976 0.370391 -0.009384 0.001600 -0.000475 0.113450
	-0.000000 0.422763 -0.000000 0.443406 -0.047551 0.096794
	-0.137594 0.373323 -0.014729 0.001093 0.003333 -0.114207
	0.000000 0.421663 -0.000000 0.449049 0.045680 -0.088258
	0.035670 -0.040818 0.060014 0.018181 -0.047886 0.998486
	0.000000 0.026025 0.000000 0.002853 -0.033945 0.001202
	-0.027674 -0.041720 0.059816 0.052107 0.046785 -0.997231
	0.000000 0.025637 0.000000 0.001972 0.121503 -0.002943
	-0.050906 -0.034136 0.024111 0.058393 0.145779 -0.987384
	0.000000 0.049218 0.000000 0.001273 0.130147 -0.004151
	0.059788 -0.034178 0.023788 0.058967 -0.144900 0.987571
	-0.000000 0.049218 -0.000000 0.001261 -0.129525 0.004153
	0.032298 -0.054366 -0.002832 0.005735 -0.051282 -0.998667
	0.000000 0.018246 -0.000000 0.000223 0.105798 0.003347
	-0.026453 -0.054341 -0.002832 0.011413 0.051461 0.998493
	0.000000 0.018247 -0.000000 0.000219 -0.104659 -0.003397
	-0.053205 -0.156103 -0.013104 -0.083867 0.236072 0.951085
	0.060800 -0.156152 -0.013104 -0.083973 -0.236037 -0.951008
	0.038704 -0.122207 0.051886 -0.000097 -0.468376 0.883529
	-0.031079 -0.122177 0.051886 -0.000097 -0.468376 0.883529
	0.031859 -0.116268 0.003550 -0.080502 -0.440954 -0.880320
	-0.024230 -0.116244 0.003550 -0.080308 0.440987 0.880387
	0.474768 0.072944 -0.404259 -0.000374 -0.707079 -0.000000
	0.252528 -0.529487 -0.555359 0.000000 0.250468 -0.968125
	-0.397756 0.073430 -0.706292 -0.000374 -0.707079 -0.000000
	-0.213911 -0.457952 -0.518543 -0.339129 0.234470 -0.906822
	0.474768 0.072944 0.404512 -0.000374 -0.707079 -0.000000
	0.252528 -0.529487 0.555269 -0.968125 0.000000 -0.000000
	-0.581523 0.067522 0.830352 -0.000374 -0.707107 -0.000000
	-0.223781 -0.456157 0.514222 -0.906822 0.087686 -0.339129
	-0.740141 0.073430 0.364709 -0.000374 -0.672309 -0.000018
	-0.450942 -0.330299 0.228546 -0.878231 0.076169 -0.447886
	-0.740141 0.082596 -0.360528 -0.000372 -0.629287 -0.000039
	-0.450942 -0.330299 -0.236787 0.865705 -0.166269 0.471641
	-0.739631 -0.554428 -0.077129 -0.576453 0.409514 -0.576453
}

frame 8 {
	-0.018897 0.000000 0.100036 0.707107 0.000000 -0.000000
	0.312367 -0.360185 -0.004892 -0.496413 0.503564 -0.496625
	-0.000000 0.520055 0.000000 -0.188776 0.016076 -0.081273
	-0.136732 0.038257 0.004402 -0.147673 -0.125439 -0.674731
	0.000000 0.447469 -0.000000 0.288153 0.339784 -0.838878
	0.151140 0.042027 0.014281 -0.136578 0.118766 0.681613
	0.000000 0.437615 -0.000000 0.289056 -0.349836 0.831773
	0.162623 0.221463 -0.011451 -0.117944 0.043029 0.407657
	0.000000 0.501200 -0.000000 0.519802 0.014924 -0.052609
	-0.162016 0.218096 -0.011498 -0.222408 -0.097832 -0.416163
	0.000000 0.492872 -0.000000 0.725187 -0.014878 0.054027
	0.142976 0.370391 -0.009384 0.001600 -0.000475 0.113450
	-0.000000 0.422763 -0.000000 0.443406 -0.047551 0.096794
	-0.137594 0.373323 -0.014729 0.001093 0.003333 -0.114207
	0.000000 0.421663 -0.000000 0.449049 0.045680 -0.088258
	0.035670 -0.040818 0.060014 0.018181 -0.047886 0.998486
	0.000000 0.026025 0.000000 0.002853 -0.033945 0.001202
	-0.027674 -0.041720 0.059816 0.052107 0.046785 -0.997231
	0.000000 0.025637 0.000000 0.001972 0.121503 -0.002943
	-0.050906 -0.034136 0.024111 0.058393 0.145779 -0.987384
	0.000000 0.049218 0.000000 0.001273 0.130147 -0.004151
	0.059788 -0.034178 0.023788 0.058967 -0.144900 0.987571
	-0.000000 0.049218 -0.000000 0.001261 -0.129525 0.004153
	0.032298 -0.054366 -0.002832 0.005735 -0.051282 -0.998667
	0.000000 0.018246 -0.000000 0.000223 0.105798 0.003347
	-0.026453 -0.054341 -0.002832 0.011413 0.051461 0.998493
	0.000000 0.018247 -0.000000 0.000219 -0.104659 -0.003397
	-0.053205 -0.156103 -0.013104 -0.083867 0.236072 0.951085
	0.060800 -0.156152 -0.013104 -0.083973 -0.236037 -0.951008
	0.038704 -0.122207 0.051886 -0.000097 -0.468376 0.883529
	-0.031079 -0.122177 0.051886 -0.000097 -0.468376 0.883529
	0.031859 -0.116268 0.003550 -0.080502 -0.440954 -0.880320
	-0.024230 -0.116244 0.003550 -0.080308 0.440987 0.880387
	0.474768 0.072944 -0.404259 -0.000374 -0.707079 -0.000000
	0.252528 -0.529487 -0.555359 0.000000 0.250468 -0.968125
	-0.397756 0.073430 -0.706292 -0.000374 -0.707079 -0.000000
	-0.213911 -0.457952 -0.518543 -0.339129 0.234470 -0.906822
	0.474768 0.072944 0.404512 -0.000374 -0.707079 -0.000000
	0.252528 -0.529487 0.555269 -0.968125 0.000000 -0.000000
	-0.581523 0.067522 0.830352 -0.000374 -0.707107 -0.000000
	-0.223781 -0.456157 0.514222 -0.906822 0.087686 -0.339129
	-0.740141 0.073430 0.364709 -0.000373 -0.662706 -0.000023
	-0.450942 -0.330299 0.228546 -0.878231 0.076169 -0.447886
	-0.740141 0.082596 -0.360528 -0.000371 -0.607865 -0.000049
	-0.450942 -0.330299 -0.236787 0.865705 -0.166269 0.471641
	-0.731297 -0.554428 -0.099353 -0.576453 0.409514 -0.576453
}

frame 9 {
	-0.018897 0.000000 0.100036 0.707107 0.000000 -0.000000
	0.305576 -0.360185 0.011948 -0.487730 0.512213 -0.505155
	-0.000000 0.520055 0.000000 -0.192404 0.017229 -0.087559
	-0.136733 0.038257 0.004402 -0.149589 -0.128386 -0.661488
	-0.000000 0.447469 0.000000 0.287994 0.347801 -0.834265
	0.151140 0.042027 0.014281 -0.134166 0.116169 0.706828
	-0.000000 0.437615 0.000000 0.285997 -0.343296 0.834187
	0.162623 0.221462 -0.011451 -0.128201 0.045810 0.426620
	0.000000 0.501200 -0.000000 0.538612 0.015046 -0.053902
	-0.162016 0.218096 -0.011498 -0.220788 -0.095286 -0.406024
	0.000000 0.492872 -0.000000 0.720549 -0.014107 0.055497
	0.142976 0.370391 -0.009384 -0.007921 0.001259 0.127674
	-0.000000 0.422763 -0.000000 0.464576 -0.046849 0.101529
	-0.137594 0.373323 -0.014729 0.000451 0.004146 -0.101157
	-0.000000 0.421663 -0.000000 0.450039 0.046038 -0.087663
	0.035670 -0.040818 0.060015 0.018183 -0.047886 0.998486
	0.000000 0.026025 0.000000 0.002853 -0.033945 0.001202
	-0.027674 -0.041720 0.059816 0.052107 0.046785 -0.997231
	-0.000000 0.025637 0.000000 0.001972 0.121503 -0.002943
	-0.050906 -0.034136 0.024111 0.058391 0.145779 -0.987384
	0.000000 0.049218 -0.000000 0.001273 0.130147 -0.004151
	0.059788 -0.034178 0.023788 0.058968 -0.144899 0.987571
	-0.000000 0.049218 -0.000000 0.001262 -0.129525 0.004153
	0.032298 -0.054366 -0.002832 0.005709 -0.051282 -0.998667
	0.000000 0.018246 -0.000000 0.000223 0.105798 0.003347
	-0.026453 -0.054341 -0.002832 0.011411 0.051461 0.998493
	0.000000 0.018247 -0.000000 0.000219 -0.104659 -0.003397
	-0.053205 -0.156103 -0.013104 -0.083867 0.236072 0.951085
	0.060800 -0.156152 -0.013104 -0.083973 -0.236037 -0.951008
	0.038704 -0.122207 0.051886 -0.000097 -0.468376 0.883529
	-0.031079 -0.122177 0.051886 -0.000097 -0.468376 0.883529
	0.031859 -0.116268 0.003550 -0.080502 -0.440954 -0.880320
	-0.024230 -0.116244 0.003550 -0.080308 0.440987 0.880387
	0.474768 0.072944 -0.404259 -0.000374 -0.707079 -0.000000
	0.252528 -0.529487 -0.555359 0.000000 0.250468 -0.968125
	-0.397756 0.073430 -0.706292 -0.000374 -0.707079 -0.000000
	-0.213911 -0.457952 -0.518543 -0.339129 0.234470 -0.906822
	0.474768 0.072944 0.404512 -0.000374 -0.707079 -0.000000
	0.252528 -0.529487 0.555269 -0.968125 0.000000 -0.000000
	-0.581523 0.067522 0.830352 -0.000374 -0.707107 -0.000000
	-0.223781 -0.456157 0.514222 -0.906822 0.087686 -0.339129
	-0.740141 0.073430 0.364709 -0.000373 -0.652111 -0.000028
	-0.450942 -0.330299 0.228546 -0.878231 0.076169 -0.447886
	-0.740141 0.082596 -0.360528 -0.000369 -0.584293 -0.000060
	-0.450942 -0.330299 -0.236787 0.865705 -0.166269 0.471641
	-0.722179 -0.554428 -0.123669 -0.576453 0.409514 -0.576453
}

frame 10 {
	-0.018897 0.000000 0.100036 0.707107 0.000000 -0.000000
	0.285486 -0.360185 0.061741 -0.460894 0.537156 -0.529754
	-0.000000 0.520055 -0.000000 -0.197519 0.013073 -0.064542
	-0.136732 0.038257 0.004402 -0.154098 -0.134115 -0.620740
	0.000000 0.447469 -0.000000 0.286932 0.372847 -0.819054
	0.151140 0.042027 0.014281 -0.131170 0.108258 0.779617
	0.000000 0.437615 -0.000000 0.274922 -0.324589 0.839415
	0.162623 0.221463 -0.011451 -0.154777 0.053774 0.482671
	0.000000 0.501200 0.000000 0.587134 0.015562 -0.056801
	-0.162016 0.218096 -0.011498 -0.214652 -0.087632 -0.373675
	0.000000 0.492872 -0.000000 0.704682 -0.011930 0.059369
	0.142975 0.370391 -0.009384 -0.029928 0.007213 0.171164
	-0.000000 0.422763 0.000000 0.516138 -0.045013 0.113079
	-0.137594 0.373323 -0.014729 0.001244 0.006656 -0.062103
	0.000000 0.421663 -0.000000 0.447508 0.047143 -0.085007
	0.035670 -0.040818 0.060014 0.018181 -0.047885 0.998486
	0.000000 0.026025 0.000000 0.002853 -0.033945 0.001202
	-0.027674 -0.041720 0.059816 0.052107 0.046785 -0.997231
	0.000000 0.025637 0.000000 0.001972 0.121503 -0.002943
	-0.050906 -0.034136 0.024111 0.058393 0.145779 -0.987384
	0.000000 0.049218 0.000000 0.001273 0.130147 -0.004151
	0.059788 -0.034178 0.023788 0.058968 -0.144900 0.987571
	-0.000000 0.049218 -0.000000 0.001262 -0.129525 0.004153
	0.032298 -0.054366 -0.002833 0.005776 -0.051287 -0.998666
	0.000000 0.018247 0.000000 0.000223 0.105798 0.003347
	-0.026453 -0.054341 -0.002832 0.011411 0.051461 0.998493
	-0.000000 0.018247 0.000000 0.000219 -0.104659 -0.003397
	-0.053205 -0.156103 -0.013104 -0.083867 0.236072 0.951085
	0.060800 -0.156152 -0.013104 -0.083973 -0.236037 -0.951008
	0.038704 -0.122207 0.051886 -0.000097 -0.468376 0.883529
	-0.031079 -0.122177 0.051886 -0.000097 -0.468376 0.883529
	0.031859 -0.116268 0.003550 -0.080501 -0.440954 -0.880320
	-0.024230 -0.116245 0.003550 -0.080308 0.440987 0.880387
	0.474768 0.072944 -0.404259 -0.000374 -0.707079 -0.000000
	0.252528 -0.529487 -0.555359 0.000000 0.250468 -0.968125
	-0.397756 0.073430 -0.706292 -0.000374 -0.707079 -0.000000
	-0.213911 -0.457952 -0.518543 -0.339129 0.234470 -0.906822
	0.474768 0.072944 0.404512 -0.000374 -0.707079 -0.000000
	0.252528 -0.529487 0.555269 -0.968125 0.000000 -0.000000
	-0.581523 0.067522 0.830352 -0.000374 -0.707107 -0.000000
	-0.223781 -0.456157 0.514222 -0.906822 0.087686 -0.339129
	-0.740141 0.073430 0.364709 -0.000373 -0.640555 -0.000034
	-0.450942 -0.330299 0.228546 -0.878231 0.076169 -0.447886
	-0.740141 0.082596 -0.360528 -0.000367 -0.558738 -0.000072
	-0.450942 -0.330299 -0.236787 0.865705 -0.166269 0.471641
	-0.712441 -0.554428 -0.149635 -0.576453 0.409514 -0.576453
}

frame 11 {
	-0.018897 0.000000 0.100036 0.707107 0.000000 -0.000000
	0.254880 -0.360185 0.137578 -0.416970 0.572872 -0.564977
	0.000000 0.520055 0.000000 -0.201387 0.004388 -0.016580
	-0.136732 0.038257 0.004402 -0.156038 -0.136028 -0.554841
	-0.000000 0.447469 -0.000000 0.282745 0.415125 -0.790464
	0.151140 0.042027 0.014281 -0.146982 0.103207 0.877017
	-0.000000 0.437616 0.000000 0.253290 -0.294871 0.842069
	0.162623 0.221463 -0.011451 -0.187312 0.065444 0.565568
	0.000000 0.501200 0.000000 0.645383 0.017162 -0.057981
	-0.162016 0.218096 -0.011497 -0.201082 -0.076241 -0.317952
	0.000000 0.492872 -0.000000 0.673695 -0.009032 0.063495
	0.142976 0.370391 -0.009384 -0.050656 0.017903 0.239099
	0.000000 0.422763 -0.000000 0.571895 -0.042687 0.125880
	-0.137594 0.373323 -0.014729 0.010595 0.010426 -0.002662
	0.000000 0.421663 -0.000000 0.427508 0.049222 -0.077755
	0.035670 -0.040818 0.060014 0.018183 -0.047887 0.998486
	0.000000 0.026025 0.000000 0.002853 -0.033945 0.001202
	-0.027674 -0.041720 0.059816 0.052106 0.046785 -0.997231
	-0.000000 0.025637 0.000000 0.001972 0.121503 -0.002943
	-0.050906 -0.034136 0.024111 0.058393 0.145779 -0.987384
	-0.000000 0.049218 -0.000000 0.001273 0.130147 -0.004151
	0.059788 -0.034178 0.023788 0.058969 -0.144900 0.987571
	0.000000 0.049218 -0.000000 0.001261 -0.129525 0.004153
	0.032298 -0.054366 -0.002832 0.005792 -0.051286 -0.998666
	0.000000 0.018246 0.000000 0.000223 0.105798 0.003347
	-0.026453 -0.054341 -0.002832 0.011414 0.051461 0.998493
	0.000000 0.018246 0.000000 0.000219 -0.104659 -0.003397
	-0.053205 -0.156103 -0.013104 -0.083867 0.236072 0.951085
	0.060800 -0.156152 -0.013104 -0.083973 -0.236037 -0.951008
	0.038704 -0.122207 0.051886 -0.000097 -0.468376 0.883529
	-0.031079 -0.122177 0.051886 -0.000097 -0.468376 0.883529
	0.031859 -0.116268 0.003550 -0.080502 -0.440954 -0.880320
	-0.024230 -0.116244 0.003550 -0.080308 0.440987 0.880387
	0.474768 0.072944 -0.404259 -0.000374 -0.707079 -0.000000
	0.252528 -0.529487 -0.555359 0.000000 0.250468 -0.968125
	-0.397756 0.073430 -0.706292 -0.000374 -0.707079 -0.000000
	-0.213911 -0.457952 -0.518543 -0.339129 0.234470 -0.906822
	0.474768 0.072944 0.404512 -0.000374 -0.707079 -0.000000
	0.252528 -0.529487 0.555269 -0.968125 0.000000 -0.000000
	-0.581523 0.067522 0.830352 -0.000374 -0.707107 -0.000000
	-0.223781 -0.456157 0.514222 -0.906822 0.087686 -0.339129
	-0.740141 0.073430 0.364709 -0.000372 -0.628069 -0.000040
	-0.450942 -0.330299 0.228546 -0.878231 0.076169 -0.447886
	-0.740141 0.082596 -0.360528 -0.000365 -0.531420 -0.000083
	-0.450942 -0.330299 -0.236787 0.865705 -0.166269 0.471641
	-0.702274 -0.554428 -0.176744 -0.576453 0.409514 -0.576453
}

frame 12 {
	-0.018897 0.000000 0.100036 0.707107 0.000000 -0.000000
	0.220163 -0.360185 0.223611 -0.363511 0.609164 -0.600768
	0.000000 0.520055 0.000000 -0.201510 -0.006098 0.041224
	-0.136732 0.038257 0.004402 -0.149367 -0.131624 -0.477644
	-0.000000 0.447469 -0.000000 0.273282 0.468765 -0.748402
	0.151140 0.042027 0.014281 -0.202248 0.129562 0.943847
	-0.000000 0.437615 0.000000 0.223532 -0.251345 0.837879
	0.162623 0.221463 -0.011451 -0.217541 0.077459 0.652011
	0.000000 0.501200 0.000000 0.695767 0.020667 -0.054064
	-0.162016 0.218096 -0.011498 -0.177750 -0.064447 -0.247601
	-0.000000 0.492872 -0.000000 0.625775 -0.006323 0.065186
	0.142976 0.370391 -0.009384 -0.061235 0.030799 0.313714
	0.000000 0.422763 0.000000 0.612383 -0.040425 0.136189
	-0.137594 0.373323 -0.014729 0.036248 0.012710 0.062169
	-0.000000 0.421663 0.000000 0.375249 0.052259 -0.063693
	0.035670 -0.040818 0.060014 0.018183 -0.047887 0.998486
	0.000000 0.026025 -0.000000 0.002853 -0.033945 0.001202
	-0.027674 -0.041720 0.059816 0.052108 0.046784 -0.997231
	-0.000000 0.025637 0.000000 0.001972 0.121503 -0.002943
	-0.050906 -0.034136 0.024111 0.058392 0.145779 -0.987384
	0.000000 0.049218 0.000000 0.001273 0.130147 -0.004151
	0.059788 -0.034178 0.023788 0.058969 -0.144900 0.987571
	0.000000 0.049218 -0.000000 0.001261 -0.129525 0.004153
	0.032298 -0.054366 -0.002832 0.005734 -0.051273 -0.998667
	0.000000 0.018247 0.000000 0.000223 0.105798 0.003347
	-0.026453 -0.054341 -0.002832 0.011412 0.051461 0.998493
	0.000000 0.018246 -0.000000 0.000219 -0.104659 -0.003397
	-0.053205 -0.156103 -0.013104 -0.083867 0.236072 0.951085
	0.060800 -0.156152 -0.013104 -0.083973 -0.236037 -0.951008
	0.038704 -0.122207 0.051886 -0.000097 -0.468376 0.883529
	-0.031079 -0.122177 0.051886 -0.000097 -0.468376 0.883529
	0.031859 -0.116268 0.003550 -0.080501 -0.440954 -0.880320
	-0.024230 -0.116245 0.003550 -0.080308 0.440987 0.880387
	0.474768 0.072944 -0.404259 -0.000374 -0.707079 -0.000000
	0.252528 -0.529487 -0.555359 0.000000 0.250468 -0.968125
	-0.397756 0.073430 -0.706292 -0.000374 -0.707079 -0.000000
	-0.213911 -0.457952 -0.518543 -0.339129 0.234470 -0.906822
	0.474768 0.072944 0.404512 -0.000374 -0.707079 -0.000000
	0.252528 -0.529487 0.555269 -0.968125 0.000000 -0.000000
	-0.581523 0.067522 0.830352 -0.000374 -0.707107 -0.000000
	-0.223781 -0.456157 0.514222 -0.906822 0.087686 -0.339129
	-0.740141 0.073430 0.364709 -0.000371 -0.614680 -0.000046
	-0.450942 -0.330299 0.228546 -0.878231 0.076169 -0.447886
	-0.740141 0.082596 -0.360528 -0.000362 -0.502644 -0.000096
	-0.450942 -0.330299 -0.236787 0.865705 -0.166269 0.471641
	-0.691889 -0.554428 -0.204437 -0.576453 0.409514 -0.576453
}

frame 13 {
	-0.018897 0.000000 0.100036 0.707107 0.000000 -0.000000
	0.189551 -0.360185 0.299516 -0.314162 0.636761 -0.627984
	0.000000 0.520055 0.000000 -0.197461 -0.014627 0.088142
	-0.136732 0.038257 0.004402 -0.135047 -0.124137 -0.411540
	-0.000000 0.447469 0.000000 0.260108 0.520694 -0.700177
	0.151140 0.042027 0.014281 -0.277988 0.202725 0.938771
	0.000000 0.437615 -0.000000 0.196950 -0.195261 0.827766
	0.162623 0.221463 -0.011451 -0.242016 0.086948 0.717125
	0.000000 0.501200 -0.000000 0.730804 0.026618 -0.044995
	-0.162016 0.218096 -0.011498 -0.148128 -0.056015 -0.181814
	0.000000 0.492872 0.000000 0.568545 -0.004466 0.063722
	0.142976 0.370391 -0.009384 -0.062524 0.041992 0.371909
	-0.000000 0.422763 0.000000 0.634083 -0.038198 0.144225
	-0.137594 0.373323 -0.014729 0.079174 0.009306 0.115404
	0.000000 0.421663 0.000000 0.289157 0.055617 -0.045723
	0.035670 -0.040818 0.060014 0.018181 -0.047885 0.998486
	0.000000 0.026025 0.000000 0.002853 -0.033945 0.001202
	-0.027674 -0.041720 0.059816 0.052105 0.046785 -0.997231
	-0.000000 0.025637 -0.000000 0.001972 0.121503 -0.002943
	-0.050906 -0.034136 0.024111 0.058393 0.145779 -0.987384
	0.000000 0.049218 -0.000000 0.001273 0.130147 -0.004151
	0.059788 -0.034178 0.023788 0.058968 -0.144900 0.987571
	0.000000 0.049218 -0.000000 0.001262 -0.129525 0.004153
	0.032298 -0.054366 -0.002832 0.005731 -0.051300 -0.998666
	0.000000 0.018246 0.000000 0.000223 0.105798 0.003347
	-0.026453 -0.054341 -0.002832 0.011410 0.051460 0.998493
	-0.000000 0.018246 -0.000000 0.000219 -0.104659 -0.003397
	-0.053205 -0.156103 -0.013104 -0.083867 0.236072 0.951085
	0.060800 -0.156152 -0.013104 -0.083973 -0.236037 -0.951008
	0.038704 -0.122207 0.051886 -0.000097 -0.468376 0.883529
	-0.031079 -0.122177 0.051886 -0.000097 -0.468376 0.883529
	0.031859 -0.116268 0.003549 -0.080502 -0.440954 -0.880320
	-0.024230 -0.116244 0.003550 -0.080308 0.440987 0.880387
	0.474768 0.072944 -0.404259 -0.000374 -0.707079 -0.000000
	0.252528 -0.529487 -0.555359 0.000000 0.250468 -0.968125
	-0.397756 0.073430 -0.706292 -0.000374 -0.707079 -0.000000
	-0.213911 -0.457952 -0.518543 -0.339129 0.234470 -0.906822
	0.474768 0.072944 0.404512 -0.000374 -0.707079 -0.000000
	0.252528 -0.529487 0.555269 -0.968125 0.000000 -0.000000
	-0.581523 0.067522 0.830352 -0.000374 -0.707107 -0.000000
	-0.223781 -0.456157 0.514222 -0.906822 0.087686 -0.339129
	-0.740141 0.073430 0.364709 -0.000370 -0.600417 -0.000053
	-0.450942 -0.330299 0.228546 -0.878231 0.076169 -0.447886
	-0.740141 0.082596 -0.360528 -0.000358 -0.472857 -0.000108
	-0.450942 -0.330299 -0.236787 0.865705 -0.166269 0.471641
	-0.681503 -0.554428 -0.232129 -0.576453 0.409514 -0.576453
}

frame 14 {
	-0.018897 0.000000 0.100036 0.707107 0.000000 -0.000000
	0.169457 -0.360185 0.349386 -0.281139 0.652437 -0.643446
	0.000000 0.520055 -0.000000 -0.192107 -0.018581 0.109822
	-0.136732 0.038257 0.004402 -0.119945 -0.118643 -0.369855
	0.000000 0.447469 0.000000 0.248173 0.557137 -0.661201
	0.151140 0.042027 0.014281 0.330308 -0.279959 -0.894731
	-0.000000 0.437615 0.000000 0.179183 -0.148068 0.818403
	0.162623 0.221462 -0.011451 -0.258373 0.092762 0.752516
	-0.000000 0.501200 0.000000 0.750457 0.032567 -0.035468
	-0.162016 0.218096 -0.011498 -0.122528 -0.051686 -0.138358
	0.000000 0.492872 -0.000000 0.520496 -0.003655 0.061493
	0.142976 0.370391 -0.009384 -0.060247 0.048870 0.404393
	0.000000 0.422763 0.000000 0.642885 -0.036422 0.149793
	-0.137594 0.373323 -0.014729 0.130029 0.000546 0.147137
	-0.000000 0.421663 -0.000000 0.188078 0.058215 -0.028554
	0.035670 -0.040818 0.060014 0.018180 -0.047887 0.998486
	-0.000000 0.026025 0.000000 0.002853 -0.033945 0.001202
	-0.027674 -0.041720 0.059816 0.052105 0.046785 -0.997231
	0.000000 0.025637 0.000000 0.001972 0.121503 -0.002943
	-0.050906 -0.034136 0.024111 0.058392 0.145779 -0.987384
	0.000000 0.049218 0.000000 0.001273 0.130147 -0.004151
	0.059788 -0.034178 0.023788 0.058966 -0.144899 0.987571
	0.000000 0.049218 -0.000000 0.001261 -0.129525 0.004153
	0.032298 -0.054366 -0.002832 0.005797 -0.051271 -0.998667
	-0.000000 0.018247 -0.000000 0.000223 0.105798 0.003347
	-0.026453 -0.054341 -0.002832 0.011412 0.051463 0.998493
	0.000000 0.018247 0.000000 0.000219 -0.104659 -0.003397
	-0.053205 -0.156103 -0.013104 -0.083867 0.236072 0.951085
	0.060800 -0.156152 -0.013104 -0.083973 -0.236037 -0.951008
	0.038704 -0.122207 0.051886 -0.000097 -0.468376 0.883529
	-0.031079 -0.122177 0.051886 -0.000097 -0.468376 0.883529
	0.031859 -0.116268 0.003549 -0.080502 -0.440954 -0.880320
	-0.024230 -0.116245 0.003550 -0.080308 0.440987 0.880387
	0.474768 0.072944 -0.404259 -0.000374 -0.707079 -0.000000
	0.252528 -0.529487 -0.555359 0.000000 0.250468 -0.968125
	-0.397756 0.073430 -0.706292 -0.000374 -0.707079 -0.000000
	-0.213911 -0.457952 -0.518543 -0.339129 0.234470 -0.906822
	0.474768 0.072944 0.404512 -0.000374 -0.707079 -0.000000
	0.252528 -0.529487 0.555269 -0.968125 0.000000 -0.000000
	-0.581523 0.067522 0.830352 -0.000374 -0.707107 -0.000000
	-0.223781 -0.456157 0.514222 -0.906822 0.087686 -0.339129
	-0.740141 0.073430 0.364709 -0.000369 -0.585310 -0.000060
	-0.450942 -0.330299 0.228546 -0.878231 0.076169 -0.447886
	-0.740141 0.082596 -0.360528 -0.000354 -0.442783 -0.000120
	-0.450942 -0.330299 -0.236787 0.865705 -0.166269 0.471641
	-0.671337 -0.554428 -0.259238 -0.576453 0.409514 -0.576453
}

frame 15 {
	-0.018897 0.000000 0.100036 0.707107 0.000000 -0.000000
	0.162663 -0.360185 0.366259 -0.269923 0.657289 -0.648232
	0.000000 0.520055 0.000000 -0.188051 -0.017210 0.102189
	-0.136732 0.038257 0.004402 -0.113663 -0.116853 -0.356113
	-0.000000 0.447469 0.000000 0.243456 0.569788 -0.646480
	0.151140 0.042027 0.014281 -0.297046 0.154784 0.938196
	-0.000000 0.437615 0.000000 0.209890 -0.152367 0.853392
	0.162623 0.221462 -0.011451 -0.264080 0.094705 0.762966
	-0.000000 0.501200 -0.000000 0.756622 0.035030 -0.031474
	-0.162016 0.218096 -0.011498 -0.112508 -0.050478 -0.123746
	-0.000000 0.492872 -0.000000 0.501846 -0.003442 0.060502
	0.142975 0.370391 -0.009384 -0.058999 0.051090 0.414157
	0.000000 0.422763 -0.000000 0.645038 -0.035733 0.151836
	-0.137594 0.373323 -0.014729 0.048313 0.019680 0.123941
	-0.000000 0.421663 0.000000 0.319205 0.058834 -0.043292
	0.035670 -0.040818 0.060014 0.018182 -0.047885 0.998486
	-0.000000 0.026025 0.000000 0.002853 -0.033945 0.001202
	-0.027674 -0.041720 0.059816 0.052107 0.046785 -0.997231
	-0.000000 0.025637 0.000000 0.001972 0.121503 -0.002943
	-0.050906 -0.034136 0.024111 0.058392 0.145778 -0.987384
	0.000000 0.049218 0.000000 0.001273 0.130147 -0.004151
	0.059788 -0.034178 0.023788 0.058968 -0.144900 0.987571
	-0.000000 0.049218 -0.000000 0.001262 -0.129525 0.004153
	0.032298 -0.054366 -0.002832 0.005697 -0.051288 -0.998667
	0.000000 0.018247 -0.000000 0.000223 0.105798 0.003347
	-0.026453 -0.054341 -0.002832 0.011411 0.051462 0.998493
	-0.000000 0.018247 -0.000000 0.000219 -0.104659 -0.003397
	-0.053205 -0.156103 -0.013104 -0.083867 0.236072 0.951085
	0.060800 -0.156152 -0.013104 -0.083973 -0.236037 -0.951008
	0.038704 -0.122207 0.051886 -0.000097 -0.468376 0.883529
	-0.031079 -0.122177 0.051886 -0.000097 -0.468376 0.883529
	0.031859 -0.116268 0.003549 -0.080502 -0.440954 -0.880320
	-0.024230 -0.116245 0.003550 -0.080308 0.440987 0.880387
	0.474768 0.072944 -0.404259 -0.000374 -0.707079 -0.000000
	0.252528 -0.529487 -0.555359 0.000000 0.250468 -0.968125
	-0.397756 0.073430 -0.706292 -0.000374 -0.707079 -0.000000
	-0.213911 -0.457952 -0.518543 -0.339129 0.234470 -0.906822
	0.357395 0.072944 0.493198 -0.000372 -0.637966 -0.000035
	0.125023 -0.529485 0.595514 -0.963899 0.023356 -0.090364
	-0.581523 0.067522 0.830352 -0.000374 -0.707107 -0.000000
	-0.223781 -0.456157 0.514222 -0.906822 0.087686 -0.339129
	-0.740141 0.073430 0.364709 -0.000368 -0.569394 -0.000067
	-0.450942 -0.330299 0.228546 -0.878231 0.076169 -0.447886
	-0.683072 0.055202 -0.397985 -0.000350 -0.413873 -0.000131
	-0.394175 -0.330302 -0.260740 0.817896 -0.163535 0.550398
	-0.661599 -0.554428 -0.285204 -0.576453 0.409514 -0.576453
}

frame 16 {
	-0.018897 0.000000 0.100036 0.707107 0.000000 -0.000000
	0.162663 -0.360185 0.366259 -0.269923 0.657289 -0.648232
	0.000000 0.520055 0.000000 -0.185255 -0.013349 0.080856
	-0.136732 0.038257 0.004402 -0.113663 -0.116853 -0.356113
	-0.000000 0.447469 0.000000 0.243456 0.569788 -0.646480
	0.151140 0.042027 0.014281 -0.126752 0.086377 0.771356
	-0.000000 0.437615 0.000000 0.286537 -0.303198 0.855741
	0.162623 0.221462 -0.011451 -0.264080 0.094705 0.762966
	-0.000000 0.501200 -0.000000 0.756622 0.035030 -0.031474
	-0.162016 0.218096 -0.011498 -0.112508 -0.050478 -0.123746
	-0.000000 0.492872 -0.000000 0.501846 -0.003442 0.060502
	0.142975 0.370391 -0.009384 -0.058999 0.051090 0.414157
	0.000000 0.422763 -0.000000 0.645038 -0.035733 0.151836
	-0.137594 0.373323 -0.014729 -0.050531 0.030014 0.015538
	-0.000000 0.421663 0.000000 0.478089 0.060493 -0.062373
	0.035670 -0.040818 0.060014 0.018182 -0.047885 0.998486
	-0.000000 0.026025 0.000000 0.002853 -0.033945 0.001202
	-0.027674 -0.041720 0.059816 0.052107 0.046785 -0.997231
	-0.000000 0.025637 0.000000 0.001972 0.121503 -0.002943
	-0.050906 -0.034136 0.024111 0.058392 0.145778 -0.987384
	0.000000 0.049218 0.000000 0.001273 0.130147 -0.004151
	0.059788 -0.034178 0.023788 0.058968 -0.144900 0.987571
	-0.000000 0.049218 -0.000000 0.001262 -0.129525 0.004153
	0.032298 -0.054366 -0.002832 0.005697 -0.051288 -0.998667
	0.000000 0.018247 -0.000000 0.000223 0.105798 0.003347
	-0.026453 -0.054341 -0.002832 0.011411 0.051462 0.998493
	-0.000000 0.018247 -0.000000 0.000219 -0.104659 -0.003397
	-0.053205 -0.156103 -0.013104 -0.083867 0.236072 0.951085
	0.060800 -0.156152 -0.013104 -0.083973 -0.236037 -0.951008
	0.038704 -0.122207 0.051886 -0.000097 -0.468376 0.883529
	-0.031079 -0.122177 0.051886 -0.000097 -0.468376 0.883529
	0.031859 -0.116268 0.003549 -0.080502 -0.440954 -0.880320
	-0.024230 -0.116245 0.003550 -0.080308 0.440987 0.880387
	0.474768 0.072944 -0.404259 -0.000374 -0.707079 -0.000000
	0.252528 -0.529487 -0.555359 0.000000 0.250468 -0.968125
	-0.397756 0.073430 -0.706292 -0.000374 -0.707079 -0.000000
	-0.213911 -0.457952 -0.518543 -0.339129 0.234470 -0.906822
	0.107058 0.072944 0.682620 -0.000358 -0.469069 -0.000110
	-0.146765 -0.529488 0.681612 -0.925695 0.073359 -0.283463
	-0.581523 0.067522 0.830352 -0.000374 -0.707107 -0.000000
	-0.223781 -0.456157 0.514222 -0.906822 0.087686 -0.339129
	-0.740141 0.073430 0.364709 -0.000367 -0.552710 -0.000074
	-0.450942 -0.330299 0.228546 -0.878231 0.076169 -0.447886
	-0.537186 0.027792 -0.493961 -0.000347 -0.391000 -0.000140
	-0.272791 -0.330296 -0.311937 0.689680 -0.152678 0.704437
	-0.652480 -0.554428 -0.309520 -0.576453 0.409514 -0.576453
}

frame 17 {
	-0.018897 0.000000 0.100036 0.707107 0.000000 -0.000000
	0.162663 -0.360185 0.366259 -0.269923 0.657289 -0.648232
	0.000000 0.520055 0.000000 -0.182668 -0.009865 0.061602
	-0.136732 0.038257 0.004402 -0.113663 -0.116853 -0.356113
	-0.000000 0.447469 0.000000 0.243456 0.569788 -0.646480
	0.151140 0.042027 0.014281 -0.136578 0.118766 0.681613
	0.000000 0.437616 0.000000 0.289056 -0.349836 0.831773
	0.162623 0.221462 -0.011451 -0.264080 0.094705 0.762966
	-0.000000 0.501200 -0.000000 0.756622 0.035030 -0.031474
	-0.162016 0.218096 -0.011498 -0.112508 -0.050478 -0.123746
	-0.000000 0.492872 -0.000000 0.501846 -0.003442 0.060502
	0.142975 0.370391 -0.009384 -0.058999 0.051090 0.414157
	0.000000 0.422763 -0.000000 0.645038 -0.035733 0.151836
	-0.137594 0.373323 -0.014729 0.001093 0.003333 -0.114207
	0.000000 0.421663 0.000000 0.449049 0.045680 -0.088258
	0.035670 -0.040818 0.060014 0.018182 -0.047885 0.998486
	-0.000000 0.026025 0.000000 0.002853 -0.033945 0.001202
	-0.027674 -0.041720 0.059816 0.052107 0.046785 -0.997231
	-0.000000 0.025637 0.000000 0.001972 0.121503 -0.002943
	-0.050906 -0.034136 0.024111 0.058392 0.145778 -0.987384
	0.000000 0.049218 0.000000 0.001273 0.130147 -0.004151
	0.059788 -0.034178 0.023788 0.058968 -0.144900 0.987571
	-0.000000 0.049218 -0.000000 0.001262 -0.129525 0.004153
	0.032298 -0.054366 -0.002832 0.005697 -0.051288 -0.998667
	0.000000 0.018247 -0.000000 0.000223 0.105798 0.003347
	-0.026453 -0.054341 -0.002832 0.011411 0.051462 0.998493
	-0.000000 0.018247 -0.000000 0.000219 -0.104659 -0.003397
	-0.053205 -0.156103 -0.013104 -0.083867 0.236072 0.951085
	0.060800 -0.156152 -0.013104 -0.083973 -0.236037 -0.951008
	0.038704 -0.122207 0.051886 -0.000097 -0.468376 0.883529
	-0.031079 -0.122177 0.051886 -0.000097 -0.468376 0.883529
	0.031859 -0.116268 0.003549 -0.080502 -0.440954 -0.880320
	-0.024230 -0.116245 0.003550 -0.080308 0.440987 0.880387
	0.474768 0.072944 -0.404259 -0.000374 -0.707079 -0.000000
	0.252528 -0.529487 -0.555359 0.000000 0.250468 -0.968125
	-0.397756 0.073430 -0.706292 -0.000374 -0.707079 -0.000000
	-0.213911 -0.457952 -0.518543 -0.339129 0.234470 -0.906822
	-0.010314 0.072944 0.771307 -0.000346 -0.384565 -0.000142
	-0.274270 -0.529486 0.721857 -0.895198 0.095369 -0.368627
	-0.581523 0.067522 0.830352 -0.000374 -0.707107 -0.000000
	-0.223781 -0.456157 0.514222 -0.906822 0.087686 -0.339129
	-0.740141 0.073430 0.364709 -0.000365 -0.535304 -0.000082
	-0.450942 -0.330299 0.228546 -0.878231 0.076169 -0.447886
	-0.334232 0.082596 -0.627395 -0.000346 -0.384565 -0.000142
	-0.216024 -0.330299 -0.335890 0.620910 -0.145548 0.765743
	-0.644146 -0.554428 -0.331744 -0.576453 0.409514 -0.576453
}

frame 18 {
	-0.018897 0.000000 0.100036 0.707107 0.000000 -0.000000
	0.162663 -0.360185 0.366259 -0.269923 0.657289 -0.648232
	0.000000 0.520055 0.000000 -0.180367 -0.006846 0.044921
	-0.136732 0.038257 0.004402 -0.113663 -0.116853 -0.356113
	-0.000000 0.447469 0.000000 0.243456 0.569788 -0.646480
	0.151140 0.042027 0.014281 -0.136578 0.118766 0.681613
	0.000000 0.437616 0.000000 0.289056 -0.349836 0.831773
	0.162623 0.221462 -0.011451 -0.264080 0.094705 0.762966
	-0.000000 0.501200 -0.000000 0.756622 0.035030 -0.031474
	-0.162016 0.218096 -0.011498 -0.173516 -0.056992 -0.168476
	-0.000000 0.492872 0.000000 0.556510 -0.001562 0.067905
	0.142975 0.370391 -0.009384 -0.058999 0.051090 0.414157
	0.000000 0.422763 -0.000000 0.645038 -0.035733 0.151836
	-0.137594 0.373323 -0.014729 0.001093 0.003333 -0.114207
	0.000000 0.421663 0.000000 0.449049 0.045680 -0.088258
	0.035670 -0.040818 0.060014 0.018182 -0.047885 0.998486
	-0.000000 0.026025 0.000000 0.002853 -0.033945 0.001202
	-0.027674 -0.041720 0.059816 0.052107 0.046785 -0.997231
	-0.000000 0.025637 0.000000 0.001972 0.121503 -0.002943
	-0.050906 -0.034136 0.024111 0.058392 0.145778 -0.987384
	0.000000 0.049218 0.000000 0.001273 0.130147 -0.004151
	0.059788 -0.034178 0.023788 0.058968 -0.144900 0.987571
	-0.000000 0.049218 -0.000000 0.001262 -0.129525 0.004153
	0.032298 -0.054366 -0.002832 0.005697 -0.051288 -0.998667
	0.000000 0.018247 -0.000000 0.000223 0.105798 0.003347
	-0.026453 -0.054341 -0.002832 0.011411 0.051462 0.998493
	-0.000000 0.018247 -0.000000 0.000219 -0.104659 -0.003397
	-0.053205 -0.156103 -0.013104 -0.083867 0.236072 0.951085
	0.060800 -0.156152 -0.013104 -0.083973 -0.236037 -0.951008
	0.038704 -0.122207 0.051886 -0.000097 -0.468376 0.883529
	-0.031079 -0.122177 0.051886 -0.000097 -0.468376 0.883529
	0.031859 -0.116268 0.003549 -0.080502 -0.440954 -0.880320
	-0.024230 -0.116245 0.003550 -0.080308 0.440987 0.880387
	0.474768 0.072944 -0.404259 -0.000374 -0.707079 -0.000000
	0.252528 -0.529487 -0.555359 0.000000 0.250468 -0.968125
	-0.326260 0.014079 -0.726448 -0.000374 -0.667858 -0.000020
	-0.125758 -0.457952 -0.482424 -0.253007 0.241623 -0.934518
	-0.010314 0.072944 0.771307 -0.000346 -0.384565 -0.000142
	-0.274270 -0.529486 0.721857 -0.895198 0.095369 -0.368627
	-0.581523 0.067522 0.830352 -0.000374 -0.707107 -0.000000
	-0.223781 -0.456157 0.514222 -0.906822 0.087686 -0.339129
	-0.740141 0.073430 0.364709 -0.000363 -0.517235 -0.000090
	-0.450942 -0.330299 0.228546 -0.878231 0.076169 -0.447886
	-0.334232 0.082596 -0.627395 -0.000346 -0.384565 -0.000142
	-0.216024 -0.330299 -0.335890 0.620910 -0.145548 0.765743
	-0.636733 -0.554428 -0.351512 -0.576453 0.409514 -0.576453
}

frame 19 {
	-0.018897 0.000000 0.100036 0.707107 0.000000 -0.000000
	0.162663 -0.360185 0.366259 -0.269923 0.657289 -0.648232
	0.000000 0.520055 0.000000 -0.178384 -0.004294 0.030815
	-0.136732 0.038257 0.004402 -0.113663 -0.116853 -0.356113
	-0.000000 0.447469 0.000000 0.243456 0.569788 -0.646480
	0.151140 0.042027 0.014281 -0.136578 0.118766 0.681613
	0.000000 0.437616 0.000000 0.289056 -0.349836 0.831773
	0.162623 0.221462 -0.011451 -0.264080 0.094705 0.762966
	-0.000000 0.501200 -0.000000 0.756622 0.035030 -0.031474
	-0.162016 0.218096 -0.011498 -0.230310 -0.061984 -0.292358
	-0.000000 0.492872 -0.000000 0.604358 0.004733 0.084390
	0.142975 0.370391 -0.009384 -0.058999 0.051090 0.414157
	0.000000 0.422763 -0.000000 0.645038 -0.035733 0.151836
	-0.137594 0.373323 -0.014729 0.001093 0.003333 -0.114207
	0.000000 0.421663 0.000000 0.449049 0.045680 -0.088258
	0.035670 -0.040818 0.060014 0.018182 -0.047885 0.998486
	-0.000000 0.026025 0.000000 0.002853 -0.033945 0.001202
	-0.027674 -0.041720 0.059816 0.052107 0.046785 -0.997231
	-0.000000 0.025637 0.000000 0.001972 0.121503 -0.002943
	-0.050906 -0.034136 0.024111 0.058392 0.145778 -0.987384
	0.000000 0.049218 0.000000 0.001273 0.130147 -0.004151
	0.059788 -0.034178 0.023788 0.058968 -0.144900 0.987571
	-0.000000 0.049218 -0.000000 0.001262 -0.129525 0.004153
	0.032298 -0.054366 -0.002832 0.005697 -0.051288 -0.998667
	0.000000 0.018247 -0.000000 0.000223 0.105798 0.003347
	-0.026453 -0.054341 -0.002832 0.011411 0.051462 0.998493
	-0.000000 0.018247 -0.000000 0.000219 -0.104659 -0.003397
	-0.053205 -0.156103 -0.013104 -0.083867 0.236072 0.951085
	0.060800 -0.156152 -0.013104 -0.083973 -0.236037 -0.951008
	0.038704 -0.122207 0.051886 -0.000097 -0.468376 0.883529
	-0.031079 -0.122177 0.051886 -0.000097 -0.468376 0.883529
	0.031859 -0.116268 0.003549 -0.080502 -0.440954 -0.880320
	-0.024230 -0.116245 0.003550 -0.080308 0.440987 0.880387
	0.474768 0.072944 -0.404259 -0.000374 -0.707079 -0.000000
	0.252528 -0.529487 -0.555359 0.000000 0.250468 -0.968125
	-0.143892 -0.045313 -0.778168 -0.000367 -0.556401 -0.000073
	0.062528 -0.457952 -0.405158 -0.058754 0.249877 -0.966374
	-0.010314 0.072944 0.771307 -0.000346 -0.384565 -0.000142
	-0.274270 -0.529486 0.721857 -0.895198 0.095369 -0.368627
	-0.581523 0.067522 0.830352 -0.000374 -0.707107 -0.000000
	-0.223781 -0.456157 0.514222 -0.906822 0.087686 -0.339129
	-0.740141 0.073430 0.364709 -0.000361 -0.498573 -0.000097
	-0.450942 -0.330299 0.228546 -0.878231 0.076169 -0.447886
	-0.334232 0.082596 -0.627395 -0.000346 -0.384565 -0.000142
	-0.216024 -0.330299 -0.335890 0.620910 -0.145548 0.765743
	-0.630347 -0.554428 -0.368541 -0.576453 0.409514 -0.576453
}

frame 20 {
	-0.018897 0.000000 0.100036 0.707107 0.000000 -0.000000
	0.162663 -0.360185 0.366259 -0.269923 0.657289 -0.648232
	0.000000 0.520055 0.000000 -0.176756 -0.002204 0.019260
	-0.136732 0.038257 0.004402 -0.113663 -0.116853 -0.356113
	-0.000000 0.447469 0.000000 0.243456 0.569788 -0.646480
	0.151140 0.042027 0.014281 -0.136578 0.118766 0.681613
	0.000000 0.437616 0.000000 0.289056 -0.349836 0.831773
	0.162623 0.221462 -0.011451 -0.264080 0.094705 0.762966
	-0.000000 0.501200 -0.000000 0.756622 0.035030 -0.031474
	-0.162016 0.218096 -0.011498 -0.116163 -0.038814 -0.404079
	-0.000000 0.492872 0.000000 0.515809 -0.011248 0.048502
	0.142975 0.370391 -0.009384 -0.058999 0.051090 0.414157
	0.000000 0.422763 -0.000000 0.645038 -0.035733 0.151836
	-0.137594 0.373323 -0.014729 0.001093 0.003333 -0.114207
	0.000000 0.421663 0.000000 0.449049 0.045680 -0.088258
	0.035670 -0.040818 0.060014 0.018182 -0.047885 0.998486
	-0.000000 0.026025 0.000000 0.002853 -0.033945 0.001202
	-0.027674 -0.041720 0.059816 0.052107 0.046785 -0.997231
	-0.000000 0.025637 0.000000 0.001972 0.121503 -0.002943
	-0.050906 -0.034136 0.024111 0.058392 0.145778 -0.987384
	0.000000 0.049218 0.000000 0.001273 0.130147 -0.004151
	0.059788 -0.034178 0.023788 0.058968 -0.144900 0.987571
	-0.000000 0.049218 -0.000000 0.001262 -0.129525 0.004153
	0.032298 -0.054366 -0.002832 0.005697 -0.051288 -0.998667
	0.000000 0.018247 -0.000000 0.000223 0.105798 0.003347
	-0.026453 -0.054341 -0.002832 0.011411 0.051462 0.998493
	-0.000000 0.018247 -0.000000 0.000219 -0.104659 -0.003397
	-0.053205 -0.156103 -0.013104 -0.083867 0.236072 0.951085
	0.060800 -0.156152 -0.013104 -0.083973 -0.236037 -0.951008
	0.038704 -0.122207 0.051886 -0.000097 -0.468376 0.883529
	-0.031079 -0.122177 0.051886 -0.000097 -0.468376 0.883529
	0.031859 -0.116268 0.003549 -0.080502 -0.440954 -0.880320
	-0.024230 -0.116245 0.003550 -0.080308 0.440987 0.880387
	0.474768 0.072944 -0.404259 -0.000374 -0.707079 -0.000000
	0.252528 -0.529487 -0.555359 0.000000 0.250468 -0.968125
	0.109971 0.073430 -0.850044 -0.000346 -0.384565 -0.000142
	0.150681 -0.457952 -0.369039 -0.031702 -0.250193 0.967642
	-0.010314 0.072944 0.771307 -0.000346 -0.384565 -0.000142
	-0.274270 -0.529486 0.721857 -0.895198 0.095369 -0.368627
	-0.581523 0.067522 0.830352 -0.000374 -0.707107 -0.000000
	-0.223781 -0.456157 0.514222 -0.906822 0.087686 -0.339129
	-0.740141 0.073430 0.364709 -0.000359 -0.479411 -0.000105
	-0.450942 -0.330299 0.228546 -0.878231 0.076169 -0.447886
	-0.334232 0.082596 -0.627395 -0.000346 -0.384565 -0.000142
	-0.216024 -0.330299 -0.335890 0.620910 -0.145548 0.765743
	-0.625066 -0.554428 -0.382626 -0.576453 0.409514 -0.576453
}

frame 21 {
	-0.018897 0.000000 0.100036 0.707107 0.000000 -0.000000
	0.162663 -0.360185 0.366259 -0.269923 0.657289 -0.648232
	0.000000 0.520055 0.000000 -0.175485 -0.000616 0.010484
	-0.136732 0.038257 0.004402 -0.194680 -0.156917 -0.360450
	-0.000000 0.447469 -0.000000 0.271834 0.500427 -0.726108
	0.151140 0.042027 0.014281 -0.136578 0.118766 0.681613
	0.000000 0.437616 0.000000 0.289056 -0.349836 0.831773
	0.162623 0.221462 -0.011451 -0.264080 0.094705 0.762966
	-0.000000 0.501200 -0.000000 0.756622 0.035030 -0.031474
	-0.162016 0.218096 -0.011498 -0.116163 -0.038814 -0.404079
	-0.000000 0.492872 0.000000 0.515809 -0.011248 0.048502
	0.142975 0.370391 -0.009384 -0.058999 0.051090 0.414157
	0.000000 0.422763 -0.000000 0.645038 -0.035733 0.151836
	-0.137594 0.373323 -0.014729 0.001093 0.003333 -0.114207
	0.000000 0.421663 0.000000 0.449049 0.045680 -0.088258
	0.035670 -0.040818 0.060014 0.018182 -0.047885 0.998486
	-0.000000 0.026025 0.000000 0.002853 -0.033945 0.001202
	-0.027674 -0.041720 0.059816 0.052107 0.046785 -0.997231
	-0.000000 0.025637 0.000000 0.001972 0.121503 -0.002943
	-0.050906 -0.034136 0.024111 0.058392 0.145778 -0.987384
	0.000000 0.049218 0.000000 0.001273 0.130147 -0.004151
	0.059788 -0.034178 0.023788 0.058968 -0.144900 0.987571
	-0.000000 0.049218 -0.000000 0.001262 -0.129525 0.004153
	0.032298 -0.054366 -0.002832 0.005697 -0.051288 -0.998667
	0.000000 0.018247 -0.000000 0.000223 0.105798 0.003347
	-0.026453 -0.054341 -0.002832 0.011411 0.051462 0.998493
	-0.000000 0.018247 -0.000000 0.000219 -0.104659 -0.003397
	-0.053205 -0.156103 -0.013104 -0.083867 0.236072 0.951085
	0.060800 -0.156152 -0.013104 -0.083973 -0.236037 -0.951008
	0.038704 -0.122207 0.051886 -0.000097 -0.468376 0.883529
	-0.031079 -0.122177 0.051886 -0.000097 -0.468376 0.883529
	0.031859 -0.116268 0.003549 -0.080502 -0.440954 -0.880320
	-0.024230 -0.116245 0.003550 -0.080308 0.440987 0.880387
	0.486610 0.010647 -0.319441 -0.000374 -0.667857 -0.000020
	0.314217 -0.529532 -0.437199 -0.090363 -0.249375 0.963899
	0.109971 0.073430 -0.850044 -0.000346 -0.384565 -0.000142
	0.150681 -0.457952 -0.369039 -0.031702 -0.250193 0.967642
	-0.010314 0.072944 0.771307 -0.000346 -0.384565 -0.000142
	-0.274270 -0.529486 0.721857 -0.895198 0.095369 -0.368627
	-0.581523 0.067522 0.830352 -0.000374 -0.707107 -0.000000
	-0.223781 -0.456157 0.514222 -0.906822 0.087686 -0.339129
	-0.740141 0.073430 0.364709 -0.000357 -0.459875 -0.000113
	-0.450942 -0.330299 0.228546 -0.878231 0.076169 -0.447886
	-0.334232 0.082596 -0.627395 -0.000346 -0.384565 -0.000142
	-0.216024 -0.330299 -0.335890 0.620910 -0.145548 0.765743
	-0.620938 -0.554428 -0.393635 -0.576453 0.409514 -0.576453
}

frame 22 {
	-0.018897 0.000000 0.100036 0.707107 0.000000 -0.000000
	0.162663 -0.360185 0.366259 -0.269923 0.657289 -0.648232
	0.000000 0.520055 0.000000 -0.174579 0.000505 0.004286
	-0.136732 0.038257 0.004402 -0.307781 -0.228253 -0.460824
	0.000000 0.447469 0.000000 0.313087 0.371665 -0.830788
	0.151140 0.042027 0.014281 -0.136578 0.118766 0.681613
	0.000000 0.437616 0.000000 0.289056 -0.349836 0.831773
	0.162623 0.221462 -0.011451 -0.264080 0.094705 0.762966
	-0.000000 0.501200 -0.000000 0.756622 0.035030 -0.031474
	-0.162016 0.218096 -0.011498 -0.116163 -0.038814 -0.404079
	-0.000000 0.492872 0.000000 0.515809 -0.011248 0.048502
	0.142975 0.370391 -0.009384 -0.058999 0.051090 0.414157
	0.000000 0.422763 -0.000000 0.645038 -0.035733 0.151836
	-0.137594 0.373323 -0.014729 0.001093 0.003333 -0.114207
	0.000000 0.421663 0.000000 0.449049 0.045680 -0.088258
	0.035670 -0.040818 0.060014 0.018182 -0.047885 0.998486
	-0.000000 0.026025 0.000000 0.002853 -0.033945 0.001202
	-0.027674 -0.041720 0.059816 0.052107 0.046785 -0.997231
	-0.000000 0.025637 0.000000 0.001972 0.121503 -0.002943
	-0.050906 -0.034136 0.024111 0.058392 0.145778 -0.987384
	0.000000 0.049218 0.000000 0.001273 0.130147 -0.004151
	0.059788 -0.034178 0.023788 0.058968 -0.144900 0.987571
	-0.000000 0.049218 -0.000000 0.001262 -0.129525 0.004153
	0.032298 -0.054366 -0.002832 0.005697 -0.051288 -0.998667
	0.000000 0.018247 -0.000000 0.000223 0.105798 0.003347
	-0.026453 -0.054341 -0.002832 0.011411 0.051462 0.998493
	-0.000000 0.018247 -0.000000 0.000219 -0.104659 -0.003397
	-0.053205 -0.156103 -0.013104 -0.083867 0.236072 0.951085
	0.060800 -0.156152 -0.013104 -0.083973 -0.236037 -0.951008
	0.038704 -0.122207 0.051886 -0.000097 -0.468376 0.883529
	-0.031079 -0.122177 0.051886 -0.000097 -0.468376 0.883529
	0.031859 -0.116268 0.003549 -0.080502 -0.440954 -0.880320
	-0.024230 -0.116245 0.003550 -0.080308 0.440987 0.880387
	0.516980 -0.051728 -0.103605 -0.000367 -0.556400 -0.000073
	0.446104 -0.529441 -0.184891 -0.283463 -0.239491 0.925695
	0.109971 0.073430 -0.850044 -0.000346 -0.384565 -0.000142
	0.150681 -0.457952 -0.369039 -0.031702 -0.250193 0.967642
	-0.010314 0.072944 0.771307 -0.000346 -0.384565 -0.000142
	-0.274270 -0.529486 0.721857 -0.895198 0.095369 -0.368627
	-0.581523 0.067522 0.830352 -0.000374 -0.707107 -0.000000
	-0.223781 -0.456157 0.514222 -0.906822 0.087686 -0.339129
	-0.740141 0.073430 0.364709 -0.000354 -0.440152 -0.000121
	-0.450942 -0.330299 0.228546 -0.878231 0.076169 -0.447886
	-0.334232 0.082596 -0.627395 -0.000346 -0.384565 -0.000142
	-0.216024 -0.330299 -0.335890 0.620910 -0.145548 0.765743
	-0.617990 -0.554428 -0.401497 -0.576453 0.409514 -0.576453
}

frame 23 {
	-0.018897 0.000000 0.100036 0.707107 0.000000 -0.000000
	0.162663 -0.360185 0.366259 -0.269923 0.657289 -0.648232
	0.000000 0.520055 0.000000 -0.174038 0.001169 0.000611
	-0.136732 0.038257 0.004402 -0.147673 -0.125438 -0.674731
	0.000000 0.447469 -0.000000 0.288153 0.339784 -0.838878
	0.151140 0.042027 0.014281 -0.136578 0.118766 0.681613
	0.000000 0.437616 0.000000 0.289056 -0.349836 0.831773
	0.162623 0.221462 -0.011451 -0.264080 0.094705 0.762966
	-0.000000 0.501200 -0.000000 0.756622 0.035030 -0.031474
	-0.162016 0.218096 -0.011498 -0.116163 -0.038814 -0.404079
	-0.000000 0.492872 0.000000 0.515809 -0.011248 0.048502
	0.142975 0.370391 -0.009384 -0.058999 0.051090 0.414157
	0.000000 0.422763 -0.000000 0.645038 -0.035733 0.151836
	-0.137594 0.373323 -0.014729 0.001093 0.003333 -0.114207
	0.000000 0.421663 0.000000 0.449049 0.045680 -0.088258
	0.035670 -0.040818 0.060014 0.018182 -0.047885 0.998486
	-0.000000 0.026025 0.000000 0.002853 -0.033945 0.001202
	-0.027674 -0.041720 0.059816 0.052107 0.046785 -0.997231
	-0.000000 0.025637 0.000000 0.001972 0.121503 -0.002943
	-0.050906 -0.034136 0.024111 0.058392 0.145778 -0.987384
	0.000000 0.049218 0.000000 0.001273 0.130147 -0.004151
	0.059788 -0.034178 0.023788 0.058968 -0.144900 0.987571
	-0.000000 0.049218 -0.000000 0.001262 -0.129525 0.004153
	0.032298 -0.054366 -0.002832 0.005697 -0.051288 -0.998667
	0.000000 0.018247 -0.000000 0.000223 0.105798 0.003347
	-0.026453 -0.054341 -0.002832 0.011411 0.051462 0.998493
	-0.000000 0.018247 -0.000000 0.000219 -0.104659 -0.003397
	-0.053205 -0.156103 -0.013104 -0.083867 0.236072 0.951085
	0.060800 -0.156152 -0.013104 -0.083973 -0.236037 -0.951008
	0.038704 -0.122207 0.051886 -0.000097 -0.468376 0.883529
	-0.031079 -0.122177 0.051886 -0.000097 -0.468376 0.883529
	0.031859 -0.116268 0.003549 -0.080502 -0.440954 -0.880320
	-0.024230 -0.116245 0.003550 -0.080308 0.440987 0.880387
	0.559193 0.072944 0.197050 -0.000346 -0.384565 -0.000142
	0.507794 -0.529487 -0.066730 -0.368627 -0.231601 0.895198
	0.109971 0.073430 -0.850044 -0.000346 -0.384565 -0.000142
	0.150681 -0.457952 -0.369039 -0.031702 -0.250193 0.967642
	-0.010314 0.072944 0.771307 -0.000346 -0.384565 -0.000142
	-0.274270 -0.529486 0.721857 -0.895198 0.095369 -0.368627
	-0.581523 0.067522 0.830352 -0.000374 -0.707107 -0.000000
	-0.223781 -0.456157 0.514222 -0.906822 0.087686 -0.339129
	-0.740141 0.073430 0.364709 -0.000351 -0.420566 -0.000129
	-0.450942 -0.330299 0.228546 -0.878231 0.076169 -0.447886
	-0.334232 0.082596 -0.627395 -0.000346 -0.384565 -0.000142
	-0.216024 -0.330299 -0.335890 0.620910 -0.145548 0.765743
	-0.616229 -0.554428 -0.406194 -0.576453 0.409514 -0.576453
}

frame 24 {
	-0.018897 0.000000 0.100036 0.707107 0.000000 -0.000000
	0.162663 -0.360185 0.366259 -0.269923 0.657289 -0.648232
	0.000000 0.520055 0.000000 -0.173859 0.001388 -0.000600
	-0.136732 0.038257 0.004402 -0.147673 -0.125438 -0.674731
	0.000000 0.447469 -0.000000 0.288153 0.339784 -0.838878
	0.151140 0.042027 0.014281 -0.136578 0.118766 0.681613
	0.000000 0.437616 0.000000 0.289056 -0.349836 0.831773
	0.162623 0.221462 -0.011451 -0.264080 0.094705 0.762966
	-0.000000 0.501200 -0.000000 0.756622 0.035030 -0.031474
	-0.162016 0.218096 -0.011498 -0.116163 -0.038814 -0.404079
	-0.000000 0.492872 0.000000 0.515809 -0.011248 0.048502
	0.142975 0.370391 -0.009384 -0.082507 0.065340 0.330523
	0.000000 0.422763 0.000000 0.659177 -0.027012 0.177322
	-0.137594 0.373323 -0.014729 0.001093 0.003333 -0.114207
	0.000000 0.421663 0.000000 0.449049 0.045680 -0.088258
	0.035670 -0.040818 0.060014 0.018182 -0.047885 0.998486
	-0.000000 0.026025 0.000000 0.002853 -0.033945 0.001202
	-0.027674 -0.041720 0.059816 0.052107 0.046785 -0.997231
	-0.000000 0.025637 0.000000 0.001972 0.121503 -0.002943
	-0.050906 -0.034136 0.024111 0.058392 0.145778 -0.987384
	0.000000 0.049218 0.000000 0.001273 0.130147 -0.004151
	0.059788 -0.034178 0.023788 0.058968 -0.144900 0.987571
	-0.000000 0.049218 -0.000000 0.001262 -0.129525 0.004153
	0.032298 -0.054366 -0.002832 0.005697 -0.051288 -0.998667
	0.000000 0.018247 -0.000000 0.000223 0.105798 0.003347
	-0.026453 -0.054341 -0.002832 0.011411 0.051462 0.998493
	-0.000000 0.018247 -0.000000 0.000219 -0.104659 -0.003397
	-0.053205 -0.156103 -0.013104 -0.083867 0.236072 0.951085
	0.060800 -0.156152 -0.013104 -0.083973 -0.236037 -0.951008
	0.038704 -0.122207 0.051886 -0.000097 -0.468376 0.883529
	-0.031079 -0.122177 0.051886 -0.000097 -0.468376 0.883529
	0.031859 -0.116268 0.003549 -0.080502 -0.440954 -0.880320
	-0.024230 -0.116245 0.003550 -0.080308 0.440987 0.880387
	0.559193 0.072944 0.197050 -0.000346 -0.384565 -0.000142
	0.507794 -0.529487 -0.066730 -0.368627 -0.231601 0.895198
	0.109971 0.073430 -0.850044 -0.000346 -0.384565 -0.000142
	0.150681 -0.457952 -0.369039 -0.031702 -0.250193 0.967642
	-0.010314 0.072944 0.771307 -0.000346 -0.384565 -0.000142
	-0.274270 -0.529486 0.721857 -0.895198 0.095369 -0.368627
	-0.581523 0.067522 0.830352 -0.000374 -0.707107 -0.000000
	-0.223781 -0.456157 0.514222 -0.906822 0.087686 -0.339129
	-0.754831 0.045604 0.297557 -0.000349 -0.401844 -0.000136
	-0.473362 -0.330299 0.171994 -0.832584 0.089758 -0.527916
	-0.334232 0.082596 -0.627395 -0.000346 -0.384565 -0.000142
	-0.216024 -0.330299 -0.335890 0.620910 -0.145548 0.765743
	-0.615647 -0.554428 -0.407749 -0.576453 0.409514 -0.576453
}

frame 25 {
	-0.018897 0.000000 0.100036 0.707107 0.000000 -0.000000
	0.162663 -0.360185 0.366259 -0.269923 0.657289 -0.648232
	0.000000 0.520055 0.000000 -0.173859 0.001388 -0.000600
	-0.136732 0.038257 0.004402 -0.147673 -0.125438 -0.674731
	0.000000 0.447469 -0.000000 0.288153 0.339784 -0.838878
	0.151140 0.042027 0.014281 -0.136578 0.118766 0.681613
	0.000000 0.437616 0.000000 0.289056 -0.349836 0.831773
	0.162623 0.221462 -0.011451 -0.264080 0.094705 0.762966
	-0.000000 0.501200 -0.000000 0.756622 0.035030 -0.031474
	-0.162016 0.218096 -0.011498 -0.116163 -0.038814 -0.404079
	-0.000000 0.492872 0.000000 0.515809 -0.011248 0.048502
	0.142975 0.370391 -0.009384 -0.106639 0.057512 0.186177
	0.000000 0.422763 -0.000000 0.638752 -0.023380 0.184774
	-0.137594 0.373323 -0.014729 0.001093 0.003333 -0.114207
	0.000000 0.421663 0.000000 0.449049 0.045680 -0.088258
	0.035670 -0.040818 0.060014 0.018182 -0.047885 0.998486
	-0.000000 0.026025 0.000000 0.002853 -0.033945 0.001202
	-0.027674 -0.041720 0.059816 0.052107 0.046785 -0.997231
	-0.000000 0.025637 0.000000 0.001972 0.121503 -0.002943
	-0.050906 -0.034136 0.024111 0.058392 0.145778 -0.987384
	0.000000 0.049218 0.000000 0.001273 0.130147 -0.004151
	0.059788 -0.034178 0.023788 0.058968 -0.144900 0.987571
	-0.000000 0.049218 -0.000000 0.001262 -0.129525 0.004153
	0.032298 -0.054366 -0.002832 0.005697 -0.051288 -0.998667
	0.000000 0.018247 -0.000000 0.000223 0.105798 0.003347
	-0.026453 -0.054341 -0.002832 0.011411 0.051462 0.998493
	-0.000000 0.018247 -0.000000 0.000219 -0.104659 -0.003397
	-0.053205 -0.156103 -0.013104 -0.083867 0.236072 0.951085
	0.060800 -0.156152 -0.013104 -0.083973 -0.236037 -0.951008
	0.038704 -0.122207 0.051886 -0.000097 -0.468376 0.883529
	-0.031079 -0.122177 0.051886 -0.000097 -0.468376 0.883529
	0.031859 -0.116268 0.003549 -0.080502 -0.440954 -0.880320
	-0.024230 -0.116245 0.003550 -0.080308 0.440987 0.880387
	0.559193 0.072944 0.197050 -0.000346 -0.384565 -0.000142
	0.507794 -0.529487 -0.066730 -0.368627 -0.231601 0.895198
	0.109971 0.073430 -0.850044 -0.000346 -0.384565 -0.000142
	0.150681 -0.457952 -0.369039 -0.031702 -0.250193 0.967642
	-0.010314 0.072944 0.771307 -0.000346 -0.384565 -0.000142
	-0.274270 -0.529486 0.721857 -0.895198 0.095369 -0.368627
	-0.581523 0.067522 0.830352 -0.000374 -0.707107 -0.000000
	-0.223781 -0.456157 0.514222 -0.906822 0.087686 -0.339129
	-0.792529 0.017845 0.126130 -0.000346 -0.387249 -0.000141
	-0.521275 -0.330298 0.051066 -0.708611 0.116581 -0.685390
	-0.334232 0.082596 -0.627395 -0.000346 -0.384565 -0.000142
	-0.216024 -0.330299 -0.335890 0.620910 -0.145548 0.765743
	-0.615647 -0.554428 -0.407749 -0.576453 0.409514 -0.576453
}

frame 26 {
	-0.018897 0.000000 0.100036 0.707107 0.000000 -0.000000
	0.162663 -0.360185 0.366259 -0.269923 0.657289 -0.648232
	0.000000 0.520055 0.000000 -0.173859 0.001388 -0.000600
	-0.136732 0.038257 0.004402 -0.147673 -0.125438 -0.674731
	0.000000 0.447469 -0.000000 0.288153 0.339784 -0.838878
	0.151140 0.042027 0.014281 -0.136578 0.118766 0.681613
	0.000000 0.437616 0.000000 0.289056 -0.349836 0.831773
	0.162623 0.221462 -0.011451 -0.264080 0.094705 0.762966
	-0.000000 0.501200 -0.000000 0.756622 0.035030 -0.031474
	-0.162016 0.218096 -0.011498 -0.116163 -0.038814 -0.404079
	-0.000000 0.492872 0.000000 0.515809 -0.011248 0.048502
	0.142975 0.370391 -0.009384 0.001600 -0.000475 0.113450
	-0.000000 0.422763 0.000000 0.443406 -0.047551 0.096794
	-0.137594 0.373323 -0.014729 0.001093 0.003333 -0.114207
	0.000000 0.421663 0.000000 0.449049 0.045680 -0.088258
	0.035670 -0.040818 0.060014 0.018182 -0.047885 0.998486
	-0.000000 0.026025 0.000000 0.002853 -0.033945 0.001202
	-0.027674 -0.041720 0.059816 0.052107 0.046785 -0.997231
	-0.000000 0.025637 0.000000 0.001972 0.121503 -0.002943
	-0.050906 -0.034136 0.024111 0.058392 0.145778 -0.987384
	0.000000 0.049218 0.000000 0.001273 0.130147 -0.004151
	0.059788 -0.034178 0.023788 0.058968 -0.144900 0.987571
	-0.000000 0.049218 -0.000000 0.001262 -0.129525 0.004153
	0.032298 -0.054366 -0.002832 0.005697 -0.051288 -0.998667
	0.000000 0.018247 -0.000000 0.000223 0.105798 0.003347
	-0.026453 -0.054341 -0.002832 0.011411 0.051462 0.998493
	-0.000000 0.018247 -0.000000 0.000219 -0.104659 -0.003397
	-0.053205 -0.156103 -0.013104 -0.083867 0.236072 0.951085
	0.060800 -0.156152 -0.013104 -0.083973 -0.236037 -0.951008
	0.038704 -0.122207 0.051886 -0.000097 -0.468376 0.883529
	-0.031079 -0.122177 0.051886 -0.000097 -0.468376 0.883529
	0.031859 -0.116268 0.003549 -0.080502 -0.440954 -0.880320
	-0.024230 -0.116245 0.003550 -0.080308 0.440987 0.880387
	0.559193 0.072944 0.197050 -0.000346 -0.384565 -0.000142
	0.507794 -0.529487 -0.066730 -0.368627 -0.231601 0.895198
	0.109971 0.073430 -0.850044 -0.000346 -0.384565 -0.000142
	0.150681 -0.457952 -0.369039 -0.031702 -0.250193 0.967642
	-0.010314 0.072944 0.771307 -0.000346 -0.384565 -0.000142
	-0.274270 -0.529486 0.721857 -0.895198 0.095369 -0.368627
	-0.581523 0.067522 0.830352 -0.000374 -0.707107 -0.000000
	-0.223781 -0.456157 0.514222 -0.906822 0.087686 -0.339129
	-0.844917 0.073430 -0.112449 -0.000346 -0.384565 -0.000142
	-0.543694 -0.330299 -0.005486 -0.641537 0.127300 -0.748547
	-0.334232 0.082596 -0.627395 -0.000346 -0.384565 -0.000142
	-0.216024 -0.330299 -0.335890 0.620910 -0.145548 0.765743
	-0.615647 -0.554428 -0.407749 -0.576453 0.409514 -0.576453
}

frame 27 {
	-0.018897 0.000000 0.100036 0.707107 0.000000 -0.000000
	0.162663 -0.360185 0.366259 -0.269923 0.657289 -0.648232
	0.000000 0.520055 0.000000 -0.173859 0.001388 -0.000600
	-0.136732 0.038257 0.004402 -0.147673 -0.125438 -0.674731
	0.000000 0.447469 -0.000000 0.288153 0.339784 -0.838878
	0.151140 0.042027 0.014281 -0.136578 0.118766 0.681613
	0.000000 0.437616 0.000000 0.289056 -0.349836 0.831773
	0.162623 0.221462 -0.011451 -0.238977 0.124377 0.721116
	0.000000 0.501200 -0.000000 0.757275 0.046415 -0.008653
	-0.162016 0.218096 -0.011498 -0.116163 -0.038814 -0.404079
	-0.000000 0.492872 0.000000 0.515809 -0.011248 0.048502
	0.142975 0.370391 -0.009384 0.001600 -0.000475 0.113450
	-0.000000 0.422763 0.000000 0.443406 -0.047551 0.096794
	-0.137594 0.373323 -0.014729 0.001093 0.003333 -0.114207
	0.000000 0.421663 0.000000 0.449049 0.045680 -0.088258
	0.035670 -0.040818 0.060014 0.018182 -0.047885 0.998486
	-0.000000 0.026025 0.000000 0.002853 -0.033945 0.001202
	-0.027674 -0.041720 0.059816 0.052107 0.046785 -0.997231
	-0.000000 0.025637 0.000000 0.001972 0.121503 -0.002943
	-0.050906 -0.034136 0.024111 0.058392 0.145778 -0.987384
	0.000000 0.049218 0.000000 0.001273 0.130147 -0.004151
	0.059788 -0.034178 0.023788 0.058968 -0.144900 0.987571
	-0.000000 0.049218 -0.000000 0.001262 -0.129525 0.004153
	0.032298 -0.054366 -0.002832 0.005697 -0.051288 -0.998667
	0.000000 0.018247 -0.000000 0.000223 0.105798 0.003347
	-0.026453 -0.054341 -0.002832 0.011411 0.051462 0.998493
	-0.000000 0.018247 -0.000000 0.000219 -0.104659 -0.003397
	-0.053205 -0.156103 -0.013104 -0.083867 0.236072 0.951085
	0.060800 -0.156152 -0.013104 -0.083973 -0.236037 -0.951008
	0.038704 -0.122207 0.051886 -0.000097 -0.468376 0.883529
	-0.031079 -0.122177 0.051886 -0.000097 -0.468376 0.883529
	0.031859 -0.116268 0.003549 -0.080502 -0.440954 -0.880320
	-0.024230 -0.116245 0.003550 -0.080308 0.440987 0.880387
	0.559193 0.072944 0.197050 -0.000346 -0.384565 -0.000142
	0.507794 -0.529487 -0.066730 -0.368627 -0.231601 0.895198
	0.109971 0.073430 -0.850044 -0.000346 -0.384565 -0.000142
	0.150681 -0.457952 -0.369039 -0.031702 -0.250193 0.967642
	-0.010314 0.072944 0.771307 -0.000346 -0.384565 -0.000142
	-0.274270 -0.529486 0.721857 -0.895198 0.095369 -0.368627
	-0.581523 0.067522 0.830352 -0.000374 -0.707107 -0.000000
	-0.273521 -0.456157 0.492533 -0.887527 0.100021 -0.386822
	-0.844917 0.073430 -0.112449 -0.000346 -0.384565 -0.000142
	-0.543694 -0.330299 -0.005486 -0.641537 0.127300 -0.748547
	-0.334232 0.082596 -0.627395 -0.000346 -0.384565 -0.000142
	-0.216024 -0.330299 -0.335890 0.620910 -0.145548 0.765743
	-0.615647 -0.554428 -0.407749 -0.576453 0.409514 -0.576453
}

frame 28 {
	-0.018897 0.000000 0.100036 0.707107 0.000000 -0.000000
	0.162663 -0.360185 0.366259 -0.269923 0.657289 -0.648232
	0.000000 0.520055 0.000000 -0.173859 0.001388 -0.000600
	-0.136732 0.038257 0.004402 -0.147673 -0.125438 -0.674731
	0.000000 0.447469 -0.000000 0.288153 0.339784 -0.838878
	0.151140 0.042027 0.014281 -0.136578 0.118766 0.681613
	0.000000 0.437616 0.000000 0.289056 -0.349836 0.831773
	0.162623 0.221462 -0.011451 -0.226694 0.179340 0.595087
	0.000000 0.501200 0.000000 0.770547 0.056715 0.016127
	-0.162016 0.218096 -0.011498 -0.116163 -0.038814 -0.404079
	-0.000000 0.492872 0.000000 0.515809 -0.011248 0.048502
	0.142975 0.370391 -0.009384 0.001600 -0.000475 0.113450
	-0.000000 0.422763 0.000000 0.443406 -0.047551 0.096794
	-0.137594 0.373323 -0.014729 0.001093 0.003333 -0.114207
	0.000000 0.421663 0.000000 0.449049 0.045680 -0.088258
	0.035670 -0.040818 0.060014 0.018182 -0.047885 0.998486
	-0.000000 0.026025 0.000000 0.002853 -0.033945 0.001202
	-0.027674 -0.041720 0.059816 0.052107 0.046785 -0.997231
	-0.000000 0.025637 0.000000 0.001972 0.121503 -0.002943
	-0.050906 -0.034136 0.024111 0.058392 0.145778 -0.987384
	0.000000 0.049218 0.000000 0.001273 0.130147 -0.004151
	0.059788 -0.034178 0.023788 0.058968 -0.144900 0.987571
	-0.000000 0.049218 -0.000000 0.001262 -0.129525 0.004153
	0.032298 -0.054366 -0.002832 0.005697 -0.051288 -0.998667
	0.000000 0.018247 -0.000000 0.000223 0.105798 0.003347
	-0.026453 -0.054341 -0.002832 0.011411 0.051462 0.998493
	-0.000000 0.018247 -0.000000 0.000219 -0.104659 -0.003397
	-0.053205 -0.156103 -0.013104 -0.083867 0.236072 0.951085
	0.060800 -0.156152 -0.013104 -0.083973 -0.236037 -0.951008
	0.038704 -0.122207 0.051886 -0.000097 -0.468376 0.883529
	-0.031079 -0.122177 0.051886 -0.000097 -0.468376 0.883529
	0.031859 -0.116268 0.003549 -0.080502 -0.440954 -0.880320
	-0.024230 -0.116245 0.003550 -0.080308 0.440987 0.880387
	0.559193 0.072944 0.197050 -0.000346 -0.384565 -0.000142
	0.507794 -0.529487 -0.066730 -0.368627 -0.231601 0.895198
	0.109971 0.073430 -0.850044 -0.000346 -0.384565 -0.000142
	0.150681 -0.457952 -0.369039 -0.031702 -0.250193 0.967642
	-0.010314 0.072944 0.771307 -0.000346 -0.384565 -0.000142
	-0.274270 -0.529486 0.721857 -0.895198 0.095369 -0.368627
	-0.648887 0.027841 0.759892 -0.000374 -0.667887 -0.000020
	-0.403447 -0.456159 0.435955 -0.823873 0.131544 -0.508490
	-0.844917 0.073430 -0.112449 -0.000346 -0.384565 -0.000142
	-0.543694 -0.330299 -0.005486 -0.641537 0.127300 -0.748547
	-0.334232 0.082596 -0.627395 -0.000346 -0.384565 -0.000142
	-0.216024 -0.330299 -0.335890 0.620910 -0.145548 0.765743
	-0.615647 -0.554428 -0.407749 -0.576453 0.409514 -0.576453
}

frame 29 {
	-0.018897 0.000000 0.100036 0.707107 0.000000 -0.000000
	0.162663 -0.360185 0.366259 -0.269923 0.657289 -0.648232
	0.000000 0.520055 0.000000 -0.173859 0.001388 -0.000600
	-0.136732 0.038257 0.004402 -0.147673 -0.125438 -0.674731
	0.000000 0.447469 -0.000000 0.288153 0.339784 -0.838878
	0.151140 0.042027 0.014281 -0.136578 0.118766 0.681613
	0.000000 0.437616 0.000000 0.289056 -0.349836 0.831773
	0.162623 0.221462 -0.011451 -0.250796 0.165226 0.479090
	0.000000 0.501200 -0.000000 0.741068 0.040153 -0.010392
	-0.162016 0.218096 -0.011498 -0.116163 -0.038814 -0.404079
	-0.000000 0.492872 0.000000 0.515809 -0.011248 0.048502
	0.142975 0.370391 -0.009384 0.001600 -0.000475 0.113450
	-0.000000 0.422763 0.000000 0.443406 -0.047551 0.096794
	-0.137594 0.373323 -0.014729 0.001093 0.003333 -0.114207
	0.000000 0.421663 0.000000 0.449049 0.045680 -0.088258
	0.035670 -0.040818 0.060014 0.018182 -0.047885 0.998486
	-0.000000 0.026025 0.000000 0.002853 -0.033945 0.001202
	-0.027674 -0.041720 0.059816 0.052107 0.046785 -0.997231
	-0.000000 0.025637 0.000000 0.001972 0.121503 -0.002943
	-0.050906 -0.034136 0.024111 0.058392 0.145778 -0.987384
	0.000000 0.049218 0.000000 0.001273 0.130147 -0.004151
	0.059788 -0.034178 0.023788 0.058968 -0.144900 0.987571
	-0.000000 0.049218 -0.000000 0.001262 -0.129525 0.004153
	0.032298 -0.054366 -0.002832 0.005697 -0.051288 -0.998667
	0.000000 0.018247 -0.000000 0.000223 0.105798 0.003347
	-0.026453 -0.054341 -0.002832 0.011411 0.051462 0.998493
	-0.000000 0.018247 -0.000000 0.000219 -0.104659 -0.003397
	-0.053205 -0.156103 -0.013104 -0.083867 0.236072 0.951085
	0.060800 -0.156152 -0.013104 -0.083973 -0.236037 -0.951008
	0.038704 -0.122207 0.051886 -0.000097 -0.468376 0.883529
	-0.031079 -0.122177 0.051886 -0.000097 -0.468376 0.883529
	0.031859 -0.116268 0.003549 -0.080502 -0.440954 -0.880320
	-0.024230 -0.116245 0.003550 -0.080308 0.440987 0.880387
	0.559193 0.072944 0.197050 -0.000346 -0.384565 -0.000142
	0.507794 -0.529487 -0.066730 -0.368627 -0.231601 0.895198
	0.109971 0.073430 -0.850044 -0.000346 -0.384565 -0.000142
	0.150681 -0.457952 -0.369039 -0.031702 -0.250193 0.967642
	-0.010314 0.072944 0.771307 -0.000346 -0.384565 -0.000142
	-0.274270 -0.529486 0.721857 -0.895198 0.095369 -0.368627
	-0.820852 -0.011726 0.580110 -0.000367 -0.556434 -0.000073
	-0.533608 -0.456159 0.379180 -0.743502 0.160396 -0.620105
	-0.844917 0.073430 -0.112449 -0.000346 -0.384565 -0.000142
	-0.543694 -0.330299 -0.005486 -0.641537 0.127300 -0.748547
	-0.334232 0.082596 -0.627395 -0.000346 -0.384565 -0.000142
	-0.216024 -0.330299 -0.335890 0.620910 -0.145548 0.765743
	-0.615647 -0.554428 -0.407749 -0.576453 0.409514 -0.576453
}

frame 30 {
	-0.018897 0.000000 0.100036 0.707107 0.000000 -0.000000
	0.162663 -0.360185 0.366259 -0.269923 0.657289 -0.648232
	0.000000 0.520055 0.000000 -0.173859 0.001388 -0.000600
	-0.136732 0.038257 0.004402 -0.147673 -0.125438 -0.674731
	0.000000 0.447469 -0.000000 0.288153 0.339784 -0.838878
	0.151140 0.042027 0.014281 -0.136578 0.118766 0.681613
	0.000000 0.437616 0.000000 0.289056 -0.349836 0.831773
	0.162623 0.221462 -0.011451 -0.117943 0.043029 0.407657
	0.000000 0.501200 -0.000000 0.519801 0.014925 -0.052609
	-0.162016 0.218096 -0.011498 -0.116163 -0.038814 -0.404079
	-0.000000 0.492872 0.000000 0.515809 -0.011248 0.048502
	0.142975 0.370391 -0.009384 0.001600 -0.000475 0.113450
	-0.000000 0.422763 0.000000 0.443406 -0.047551 0.096794
	-0.137594 0.373323 -0.014729 0.001093 0.003333 -0.114207
	0.000000 0.421663 0.000000 0.449049 0.045680 -0.088258
	0.035670 -0.040818 0.060014 0.018182 -0.047885 0.998486
	-0.000000 0.026025 0.000000 0.002853 -0.033945 0.001202
	-0.027674 -0.041720 0.059816 0.052107 0.046785 -0.997231
	-0.000000 0.025637 0.000000 0.001972 0.121503 -0.002943
	-0.050906 -0.034136 0.024111 0.058392 0.145778 -0.987384
	0.000000 0.049218 0.000000 0.001273 0.130147 -0.004151
	0.059788 -0.034178 0.023788 0.058968 -0.144900 0.987571
	-0.000000 0.049218 -0.000000 0.001262 -0.129525 0.004153
	0.032298 -0.054366 -0.002832 0.005697 -0.051288 -0.998667
	0.000000 0.018247 -0.000000 0.000223 0.105798 0.003347
	-0.026453 -0.054341 -0.002832 0.011411 0.051462 0.998493
	-0.000000 0.018247 -0.000000 0.000219 -0.104659 -0.003397
	-0.053205 -0.156103 -0.013104 -0.083867 0.236072 0.951085
	0.060800 -0.156152 -0.013104 -0.083973 -0.236037 -0.951008
	0.038704 -0.122207 0.051886 -0.000097 -0.468376 0.883529
	-0.031079 -0.122177 0.051886 -0.000097 -0.468376 0.883529
	0.031859 -0.116268 0.003549 -0.080502 -0.440954 -0.880320
	-0.024230 -0.116245 0.003550 -0.080308 0.440987 0.880387
	0.559193 0.072944 0.197050 -0.000346 -0.384565 -0.000142
	0.507794 -0.529487 -0.066730 -0.368627 -0.231601 0.895198
	0.109971 0.073430 -0.850044 -0.000346 -0.384565 -0.000142
	0.150681 -0.457952 -0.369039 -0.031702 -0.250193 0.967642
	-0.010314 0.072944 0.771307 -0.000346 -0.384565 -0.000142
	-0.274270 -0.529486 0.721857 -0.895198 0.095369 -0.368627
	-1.060181 0.067522 0.329869 -0.000346 -0.384602 -0.000142
	-0.583563 -0.456157 0.357313 -0.709385 0.170358 -0.658869
	-0.844917 0.073430 -0.112449 -0.000346 -0.384565 -0.000142
	-0.543694 -0.330299 -0.005486 -0.641537 0.127300 -0.748547
	-0.334232 0.082596 -0.627395 -0.000346 -0.384565 -0.000142
	-0.216024 -0.330299 -0.335890 0.620910 -0.145548 0.765743
	-0.615647 -0.554428 -0.407749 -0.576453 0.409514 -0.576453
}

