MD5Version 10
commandline ""

numFrames 21
numJoints 46
frameRate 60
numAnimatedComponents 276

hierarchy {
	"origin"	-1 63 0	//
	"chest"	0 63 6	// origin
	"tail"	1 63 12	// chest
	"leg0_upper"	1 63 18	// chest
	"leg0_lower"	3 63 24	// leg0_upper
	"leg5_upper"	1 63 30	// chest
	"leg5_lower"	5 63 36	// leg5_upper
	"leg4_upper"	1 63 42	// chest
	"leg4_lower"	7 63 48	// leg4_upper
	"leg1_upper"	1 63 54	// chest
	"leg1_lower"	9 63 60	// leg1_upper
	"leg3_upper"	1 63 66	// chest
	"leg3_lower"	11 63 72	// leg3_upper
	"leg2_upper"	1 63 78	// chest
	"leg2_lower"	13 63 84	// leg2_upper
	"antenna_upper_left0"	1 63 90	// chest
	"antenna_upper_left1"	15 63 96	// antenna_upper_left0
	"antenna_upper_right0"	1 63 102	// chest
	"antenna_upper_right1"	17 63 108	// antenna_upper_right0
	"antenna_right0"	1 63 114	// chest
	"antenna_right1"	19 63 120	// antenna_right0
	"antenna_left0"	1 63 126	// chest
	"antenna_left1"	21 63 132	// antenna_left0
	"antenna_lower_left0"	1 63 138	// chest
	"antenna_lower_left1"	23 63 144	// antenna_lower_left0
	"antenna_lower_right0"	1 63 150	// chest
	"antenna_lower_right1"	25 63 156	// antenna_lower_right0
	"IKantenna_right"	1 63 162	// chest
	"IKantenna_left"	1 63 168	// chest
	"IKantenna_upper_left"	1 63 174	// chest
	"IKantenna_upper_right"	1 63 180	// chest
	"IKantenna_lower_left"	1 63 186	// chest
	"IKantenna_lower_right"	1 63 192	// chest
	"IKleg0"	0 63 198	// origin
	"IKleg0_upper"	0 63 204	// origin
	"IKleg1"	0 63 210	// origin
	"IKleg1_upper"	0 63 216	// origin
	"IKleg5"	0 63 222	// origin
	"IKleg5_upper"	0 63 228	// origin
	"IKleg4"	0 63 234	// origin
	"IKleg4_upper"	0 63 240	// origin
	"IKleg3"	0 63 246	// origin
	"IKleg3_upper"	0 63 252	// origin
	"IKleg2"	0 63 258	// origin
	"IKIKleg2_upper"	0 63 264	// origin
	"IKtail"	0 63 270	// origin
}

bounds {
	( 0.000000 0.000000 0.000000 ) ( 0.000000 0.000000 0.000000 )
	( 0.000000 0.000000 0.000000 ) ( 0.000000 0.000000 0.000000 )
	( 0.000000 0.000000 0.000000 ) ( 0.000000 0.000000 0.000000 )
	( 0.000000 0.000000 0.000000 ) ( 0.000000 0.000000 0.000000 )
	( 0.000000 0.000000 0.000000 ) ( 0.000000 0.000000 0.000000 )
	( 0.000000 0.000000 0.000000 ) ( 0.000000 0.000000 0.000000 )
	( 0.000000 0.000000 0.000000 ) ( 0.000000 0.000000 0.000000 )
	( 0.000000 0.000000 0.000000 ) ( 0.000000 0.000000 0.000000 )
	( 0.000000 0.000000 0.000000 ) ( 0.000000 0.000000 0.000000 )
	( 0.000000 0.000000 0.000000 ) ( 0.000000 0.000000 0.000000 )
	( 0.000000 0.000000 0.000000 ) ( 0.000000 0.000000 0.000000 )
	( 0.000000 0.000000 0.000000 ) ( 0.000000 0.000000 0.000000 )
	( 0.000000 0.000000 0.000000 ) ( 0.000000 0.000000 0.000000 )
	( 0.000000 0.000000 0.000000 ) ( 0.000000 0.000000 0.000000 )
	( 0.000000 0.000000 0.000000 ) ( 0.000000 0.000000 0.000000 )
	( 0.000000 0.000000 0.000000 ) ( 0.000000 0.000000 0.000000 )
	( 0.000000 0.000000 0.000000 ) ( 0.000000 0.000000 0.000000 )
	( 0.000000 0.000000 0.000000 ) ( 0.000000 0.000000 0.000000 )
	( 0.000000 0.000000 0.000000 ) ( 0.000000 0.000000 0.000000 )
	( 0.000000 0.000000 0.000000 ) ( 0.000000 0.000000 0.000000 )
	( 0.000000 0.000000 0.000000 ) ( 0.000000 0.000000 0.000000 )
}

baseframe {
	( -0.018897 0.000000 0.100036 ) ( -0.707107 -0.000000 0.000000 )
	( 0.353578 -0.360185 -0.046103 ) ( 0.496413 -0.503564 0.496625 )
	( 0.000000 0.520055 -0.000000 ) ( 0.166346 -0.002314 0.005852 )
	( -0.136732 0.038257 0.004402 ) ( 0.160742 0.134742 0.630547 )
	( 0.000000 0.447469 -0.000000 ) ( -0.274688 -0.424767 0.779002 )
	( 0.151140 0.042027 0.014281 ) ( 0.100229 -0.079016 -0.664064 )
	( -0.000000 0.437615 -0.000000 ) ( -0.216388 0.575682 -0.606866 )
	( 0.162623 0.221463 -0.011451 ) ( 0.277372 -0.123077 -0.408821 )
	( 0.000000 0.501200 0.000000 ) ( -0.899639 -0.011345 0.081833 )
	( -0.162016 0.218096 -0.011498 ) ( 0.279225 0.129143 0.465675 )
	( -0.000000 0.492872 -0.000000 ) ( -0.855578 0.012405 -0.064212 )
	( 0.142976 0.370391 -0.009384 ) ( 0.069918 -0.007996 -0.259403 )
	( 0.000000 0.422763 0.000000 ) ( -0.599142 0.050645 -0.109638 )
	( -0.137594 0.373323 -0.014729 ) ( 0.002636 -0.015118 0.405689 )
	( -0.000000 0.421663 -0.000000 ) ( -0.433926 -0.055303 0.066529 )
	( 0.035670 -0.040818 0.060014 ) ( -0.018182 0.047886 -0.998486 )
	( 0.000000 0.026025 0.000000 ) ( -0.002853 0.033945 -0.001202 )
	( -0.027674 -0.041720 0.059816 ) ( -0.052106 -0.046785 0.997231 )
	( 0.000000 0.025637 -0.000000 ) ( -0.001972 -0.121503 0.002943 )
	( -0.050906 -0.034136 0.024111 ) ( -0.058393 -0.145779 0.987384 )
	( 0.000000 0.049218 0.000000 ) ( -0.001273 -0.130147 0.004151 )
	( 0.059788 -0.034178 0.023788 ) ( -0.058968 0.144899 -0.987571 )
	( -0.000000 0.049218 -0.000000 ) ( -0.001261 0.129525 -0.004153 )
	( 0.032298 -0.054366 -0.002832 ) ( -0.005733 0.051283 0.998667 )
	( -0.000000 0.018246 0.000000 ) ( -0.000223 -0.105798 -0.003347 )
	( -0.026453 -0.054341 -0.002832 ) ( -0.011414 -0.051461 -0.998493 )
	( 0.000000 0.018246 -0.000000 ) ( -0.000219 0.104659 0.003397 )
	( -0.053205 -0.156103 -0.013104 ) ( 0.083867 -0.236072 -0.951085 )
	( 0.060800 -0.156152 -0.013104 ) ( 0.083973 0.236037 0.951008 )
	( 0.038704 -0.122207 0.051886 ) ( -0.000097 -0.468376 0.883529 )
	( -0.031079 -0.122177 0.051886 ) ( -0.000097 -0.468376 0.883529 )
	( 0.031859 -0.116268 0.003549 ) ( 0.080502 0.440954 0.880320 )
	( -0.024230 -0.116244 0.003550 ) ( 0.080308 -0.440987 -0.880387 )
	( 0.474759 0.073682 -0.638130 ) ( 0.000374 0.707079 0.000000 )
	( 0.252528 -0.529487 -0.555359 ) ( -0.000000 -0.250468 0.968125 )
	( -0.164473 0.073407 -0.598402 ) ( 0.000374 0.707079 0.000000 )
	( -0.111914 -0.462534 -0.576606 ) ( 0.339129 -0.234470 0.906822 )
	( 0.474768 0.073530 0.810022 ) ( 0.000374 0.707079 0.000000 )
	( 0.252528 -0.529487 0.555269 ) ( 0.968125 -0.000000 0.000000 )
	( -0.123056 0.073415 0.368144 ) ( 0.000374 0.707107 0.000000 )
	( -0.223781 -0.456157 0.514222 ) ( 0.906822 -0.087686 0.339129 )
	( -0.520525 0.070189 0.447998 ) ( 0.000374 0.707079 0.000000 )
	( -0.387174 -0.325887 0.349406 ) ( 0.878231 -0.076169 0.447886 )
	( -0.486663 0.073410 -0.743347 ) ( 0.000374 0.707079 0.000000 )
	( -0.281407 -0.334828 -0.515744 ) ( -0.865705 0.166269 -0.471641 )
	( -0.773749 -0.554428 -0.054496 ) ( 0.576453 -0.409514 0.576453 )
}

frame 0 {
	-0.018897 0.000000 0.100036 0.707107 0.000000 -0.000000
	0.353578 -0.360185 -0.046103 -0.496413 0.503564 -0.496625
	0.000000 0.520055 -0.000000 -0.166346 0.002314 -0.005852
	-0.136732 0.038257 0.004402 -0.160742 -0.134742 -0.630547
	0.000000 0.447469 -0.000000 0.274688 0.424767 -0.779002
	0.151140 0.042027 0.014281 -0.100229 0.079016 0.664064
	-0.000000 0.437615 -0.000000 0.216388 -0.575682 0.606866
	0.162623 0.221463 -0.011451 -0.277372 0.123077 0.408821
	0.000000 0.501200 0.000000 0.899639 0.011345 -0.081833
	-0.162016 0.218096 -0.011498 -0.279225 -0.129143 -0.465675
	-0.000000 0.492872 -0.000000 0.855578 -0.012405 0.064212
	0.142976 0.370391 -0.009384 -0.069918 0.007996 0.259403
	0.000000 0.422763 0.000000 0.599142 -0.050645 0.109638
	-0.137594 0.373323 -0.014729 -0.002636 0.015118 -0.405689
	-0.000000 0.421663 -0.000000 0.433926 0.055303 -0.066529
	0.035670 -0.040818 0.060014 0.018182 -0.047886 0.998486
	0.000000 0.026025 0.000000 0.002853 -0.033945 0.001202
	-0.027674 -0.041720 0.059816 0.052106 0.046785 -0.997231
	0.000000 0.025637 -0.000000 0.001972 0.121503 -0.002943
	-0.050906 -0.034136 0.024111 0.058393 0.145779 -0.987384
	0.000000 0.049218 0.000000 0.001273 0.130147 -0.004151
	0.059788 -0.034178 0.023788 0.058968 -0.144899 0.987571
	-0.000000 0.049218 -0.000000 0.001261 -0.129525 0.004153
	0.032298 -0.054366 -0.002832 0.005733 -0.051283 -0.998667
	-0.000000 0.018246 0.000000 0.000223 0.105798 0.003347
	-0.026453 -0.054341 -0.002832 0.011414 0.051461 0.998493
	0.000000 0.018246 -0.000000 0.000219 -0.104659 -0.003397
	-0.053205 -0.156103 -0.013104 -0.083867 0.236072 0.951085
	0.060800 -0.156152 -0.013104 -0.083973 -0.236037 -0.951008
	0.038704 -0.122207 0.051886 -0.000097 -0.468376 0.883529
	-0.031079 -0.122177 0.051886 -0.000097 -0.468376 0.883529
	0.031859 -0.116268 0.003549 -0.080502 -0.440954 -0.880320
	-0.024230 -0.116244 0.003550 -0.080308 0.440987 0.880387
	0.474759 0.073682 -0.638130 -0.000374 -0.707079 -0.000000
	0.252528 -0.529487 -0.555359 0.000000 0.250468 -0.968125
	-0.164473 0.073407 -0.598402 -0.000374 -0.707079 -0.000000
	-0.111914 -0.462534 -0.576606 -0.339129 0.234470 -0.906822
	0.474768 0.073530 0.810022 -0.000374 -0.707079 -0.000000
	0.252528 -0.529487 0.555269 -0.968125 0.000000 -0.000000
	-0.123056 0.073415 0.368144 -0.000374 -0.707107 -0.000000
	-0.223781 -0.456157 0.514222 -0.906822 0.087686 -0.339129
	-0.520525 0.070189 0.447998 -0.000374 -0.707079 -0.000000
	-0.387174 -0.325887 0.349406 -0.878231 0.076169 -0.447886
	-0.486663 0.073410 -0.743347 -0.000374 -0.707079 -0.000000
	-0.281407 -0.334828 -0.515744 0.865705 -0.166269 0.471641
	-0.773749 -0.554428 -0.054496 -0.576453 0.409514 -0.576453
}

frame 1 {
	-0.018897 0.000000 0.100036 0.707107 0.000000 -0.000000
	0.353580 -0.374225 -0.028213 -0.503299 0.510357 -0.489642
	0.000000 0.520055 0.000000 -0.155927 0.003164 -0.010753
	-0.136732 0.038256 0.004402 -0.157684 -0.132626 -0.631670
	-0.000000 0.447469 -0.000000 0.265858 0.451183 -0.754830
	0.151140 0.042027 0.014281 -0.084781 0.063223 0.665276
	-0.000000 0.437615 0.000000 0.220132 -0.571277 0.615028
	0.162623 0.221462 -0.011451 -0.246239 0.119159 0.407633
	-0.000000 0.501200 -0.000000 0.891203 0.015640 -0.072335
	-0.162016 0.218096 -0.011498 -0.270637 -0.134668 -0.480206
	-0.000000 0.492872 -0.000000 0.835221 -0.016564 0.053804
	0.142976 0.370391 -0.009384 -0.053178 0.001949 0.238958
	-0.000000 0.422763 -0.000000 0.602888 -0.051968 0.106485
	-0.137594 0.373323 -0.014729 0.057368 0.031983 -0.432519
	-0.000000 0.421663 0.000000 0.298635 0.054397 -0.048747
	0.035670 -0.040818 0.060015 0.019080 -0.050133 0.998405
	-0.000000 0.026025 0.000000 0.002881 -0.033714 0.001234
	-0.027674 -0.041720 0.059816 0.053100 0.050814 -0.997031
	-0.000000 0.025637 -0.000000 0.001996 0.121462 -0.002951
	-0.050906 -0.034136 0.024111 0.058955 0.145585 -0.987450
	-0.000000 0.049218 0.000000 0.001266 0.129760 -0.004152
	0.059788 -0.034178 0.023788 0.059275 -0.145033 0.987561
	0.000000 0.049218 -0.000000 0.001259 -0.129378 0.004153
	0.032298 -0.054366 -0.002832 0.006442 -0.056518 -0.998373
	-0.000000 0.018246 -0.000000 0.000002 0.105764 0.003103
	-0.026453 -0.054341 -0.002832 0.012274 0.056817 0.998137
	-0.000000 0.018246 0.000000 0.000024 -0.104581 -0.003147
	-0.052223 -0.155462 -0.012791 -0.083867 0.236072 0.951085
	0.060290 -0.155516 -0.012914 -0.083973 -0.236037 -0.951008
	0.038287 -0.122338 0.051506 -0.000097 -0.468376 0.883529
	-0.030710 -0.122479 0.051213 -0.000097 -0.468376 0.883529
	0.031536 -0.115986 0.004185 -0.080502 -0.440954 -0.880320
	-0.023832 -0.116001 0.004201 -0.080308 0.440987 0.880387
	0.474760 0.073694 -0.662951 -0.000374 -0.707079 -0.000000
	0.252070 -0.529487 -0.555359 0.000000 0.250468 -0.968125
	-0.164998 0.073424 -0.629988 -0.000374 -0.707079 -0.000000
	-0.110950 -0.462570 -0.577037 -0.339129 0.234470 -0.906822
	0.474765 0.073533 0.805859 -0.000374 -0.707079 -0.000000
	0.256444 -0.529493 0.530701 -0.968125 0.000000 -0.000000
	-0.111903 0.073379 0.411524 -0.000374 -0.707107 -0.000000
	-0.222391 -0.456157 0.514067 -0.906822 0.087686 -0.339129
	-0.520527 0.066503 0.443587 -0.000374 -0.707079 -0.000000
	-0.386271 -0.325899 0.351773 -0.878231 0.076169 -0.447886
	-0.486636 0.073430 -0.791023 -0.000374 -0.707079 -0.000000
	-0.292328 -0.323233 -0.529572 0.865705 -0.166269 0.471641
	-0.774856 -0.554150 -0.047871 -0.576453 0.409514 -0.576453
}

frame 2 {
	-0.018897 0.000000 0.100036 0.707107 0.000000 -0.000000
	0.353578 -0.388263 -0.001455 -0.510089 0.517052 -0.482567
	0.000000 0.520055 -0.000000 -0.144678 0.003601 -0.013388
	-0.136732 0.038257 0.004402 -0.148318 -0.125002 -0.636454
	0.000000 0.447469 0.000000 0.249838 0.493226 -0.711059
	0.151140 0.042027 0.014281 -0.076568 0.050061 0.668658
	0.000000 0.437616 0.000000 0.229312 -0.560072 0.634600
	0.162623 0.221462 -0.011451 -0.216967 0.104901 0.396442
	-0.000000 0.501200 -0.000000 0.887684 0.015440 -0.072792
	-0.162016 0.218096 -0.011498 -0.258964 -0.137078 -0.500815
	0.000000 0.492872 -0.000000 0.805219 -0.020435 0.043608
	0.142976 0.370391 -0.009384 -0.041770 -0.008313 0.209148
	-0.000000 0.422763 -0.000000 0.616122 -0.054506 0.100643
	-0.137594 0.373323 -0.014729 -0.047247 -0.021543 -0.420567
	-0.000000 0.421663 -0.000000 0.422295 0.052736 -0.070718
	0.035670 -0.040818 0.060015 0.021753 -0.056858 0.998093
	0.000000 0.026025 -0.000000 0.002959 -0.033027 0.001325
	-0.027674 -0.041720 0.059816 0.056041 0.062899 -0.996307
	0.000000 0.025637 -0.000000 0.001785 0.121356 -0.002570
	-0.050906 -0.034136 0.024111 0.060696 0.144975 -0.987560
	0.000000 0.049217 0.000000 0.001245 0.128573 -0.004156
	0.059788 -0.034178 0.023788 0.060225 -0.145441 0.987506
	0.000000 0.049218 -0.000000 0.001251 -0.128925 0.004155
	0.032298 -0.054366 -0.002832 0.008373 -0.072447 -0.997270
	0.000000 0.018247 0.000000 -0.000582 0.105666 0.003399
	-0.026453 -0.054341 -0.002832 0.014847 0.073113 0.996820
	0.000000 0.018247 0.000000 -0.000463 -0.104351 -0.003310
	-0.049268 -0.153531 -0.011851 -0.083867 0.236072 0.951085
	0.058754 -0.153600 -0.012344 -0.083973 -0.236037 -0.951008
	0.037032 -0.122730 0.050363 -0.000097 -0.468376 0.883529
	-0.029600 -0.123385 0.049186 -0.000097 -0.468376 0.883529
	0.030564 -0.115135 0.006098 -0.080502 -0.440954 -0.880320
	-0.022635 -0.115267 0.006161 -0.080308 0.440987 0.880387
	0.474763 0.073711 -0.707939 -0.000374 -0.707079 -0.000000
	0.250780 -0.529487 -0.555359 0.000000 0.250468 -0.968125
	-0.164821 0.073443 -0.668464 -0.000374 -0.707079 -0.000000
	-0.108037 -0.462678 -0.578340 -0.339129 0.234470 -0.906822
	0.474763 0.073538 0.794246 -0.000374 -0.707079 -0.000000
	0.266688 -0.529495 0.466484 -0.968125 0.000000 -0.000000
	-0.105197 0.073391 0.430198 -0.000374 -0.707107 -0.000000
	-0.218189 -0.456157 0.513600 -0.906822 0.087686 -0.339129
	-0.520528 0.063680 0.428143 -0.000374 -0.707079 -0.000000
	-0.383576 -0.325934 0.358838 -0.878231 0.076169 -0.447886
	-0.486905 -0.007245 -0.743706 -0.000374 -0.707079 -0.000000
	-0.289023 -0.315990 -0.506598 0.865705 -0.166269 0.471641
	-0.778079 -0.553342 -0.028591 -0.576453 0.409514 -0.576453
}

frame 3 {
	-0.018897 0.000000 0.100036 0.707107 0.000000 -0.000000
	0.353535 -0.386488 0.012696 -0.506704 0.513717 -0.486116
	0.000000 0.520055 -0.000000 -0.143553 0.002007 -0.004625
	-0.136733 0.038256 0.004402 -0.130889 -0.108849 -0.643728
	0.000000 0.447469 0.000000 0.236055 0.525872 -0.672369
	0.151140 0.042027 0.014281 -0.102507 0.063062 0.675622
	-0.000000 0.437615 -0.000000 0.241144 -0.543494 0.660096
	0.162623 0.221462 -0.011451 -0.221740 0.121183 0.396496
	0.000000 0.501200 -0.000000 0.882763 0.021597 -0.059224
	-0.162016 0.218096 -0.011498 -0.241846 -0.131088 -0.516343
	0.000000 0.492872 -0.000000 0.779864 -0.022038 0.039118
	0.142976 0.370391 -0.009384 -0.061284 -0.014823 0.199049
	-0.000000 0.422763 -0.000000 0.641460 -0.057383 0.093928
	-0.137594 0.373323 -0.014729 -0.213732 -0.068048 -0.353647
	0.000000 0.421663 0.000000 0.663122 0.055296 -0.078390
	0.035670 -0.040818 0.060015 -0.025987 0.067774 -0.997361
	0.000000 0.026025 -0.000000 0.003072 -0.031939 0.001466
	-0.027674 -0.041720 0.059816 0.060569 0.081657 -0.994793
	0.000000 0.025637 0.000000 0.001870 0.121231 -0.002594
	-0.050906 -0.034136 0.024111 0.054871 0.120697 -0.989989
	-0.000000 0.049218 -0.000000 0.033015 0.125673 -0.113480
	0.059788 -0.034178 0.023788 0.053589 -0.124699 0.989277
	-0.000000 0.049218 -0.000000 0.030531 -0.127426 0.102528
	0.032298 -0.054366 -0.002832 0.011514 -0.099028 -0.994723
	-0.000000 0.018247 0.000000 -0.001405 0.105520 0.003666
	-0.026453 -0.054341 -0.002832 0.019008 0.100086 0.993853
	0.000000 0.018247 0.000000 -0.001184 -0.103995 -0.003676
	-0.044464 -0.150392 -0.010322 -0.083867 0.236072 0.951085
	0.056257 -0.150486 -0.011415 -0.083973 -0.236037 -0.951008
	0.034992 -0.123369 0.048504 -0.000097 -0.468376 0.883529
	-0.027796 -0.124860 0.045890 -0.000097 -0.468376 0.883529
	0.028984 -0.113751 0.009208 -0.080502 -0.440954 -0.880320
	-0.020688 -0.114075 0.009348 -0.080308 0.440987 0.880387
	0.474765 0.073712 -0.753451 -0.000374 -0.707079 -0.000000
	0.249124 -0.529487 -0.555359 0.000000 0.250468 -0.968125
	-0.163722 0.073460 -0.708323 -0.000374 -0.707079 -0.000000
	-0.103215 -0.462858 -0.580497 -0.339129 0.234470 -0.906822
	0.474762 0.073547 0.776276 -0.000374 -0.707079 -0.000000
	0.276933 -0.529488 0.402291 -0.968125 0.000000 -0.000000
	-0.102128 0.073434 0.479226 -0.000374 -0.707107 -0.000000
	-0.211178 -0.456157 0.512821 -0.906822 0.087686 -0.339129
	-0.520527 0.062167 0.401402 -0.000374 -0.707079 -0.000000
	-0.379333 -0.325989 0.369960 -0.878231 0.076169 -0.447886
	-0.487351 -0.087926 -0.561277 -0.000374 -0.707079 -0.000000
	-0.273460 -0.313300 -0.452494 0.865705 -0.166269 0.471641
	-0.782713 -0.552180 -0.000878 -0.576453 0.409514 -0.576453
}

frame 4 {
	-0.018897 0.000000 0.100036 0.707107 0.000000 -0.000000
	0.353457 -0.380070 0.023366 -0.497732 0.504873 -0.495294
	-0.000000 0.520055 -0.000000 -0.146157 0.000476 0.003867
	-0.136733 0.038257 0.004402 -0.106512 -0.085675 -0.651925
	0.000000 0.447469 0.000000 0.223722 0.553050 -0.636892
	0.151140 0.042027 0.014281 -0.138570 0.090081 0.676436
	0.000000 0.437615 0.000000 0.252078 -0.520041 0.689868
	0.162623 0.221463 -0.011451 -0.231352 0.154389 0.408072
	0.000000 0.501200 -0.000000 0.863030 0.034612 -0.029427
	-0.162016 0.218096 -0.011498 -0.216226 -0.118078 -0.531588
	0.000000 0.492872 0.000000 0.753332 -0.022461 0.037637
	0.142976 0.370391 -0.009384 -0.089360 -0.021900 0.195652
	-0.000000 0.422763 0.000000 0.669590 -0.061007 0.084503
	-0.137594 0.373323 -0.014729 -0.207528 -0.032950 -0.316665
	0.000000 0.421663 0.000000 0.719040 0.061405 -0.059947
	0.035670 -0.040818 0.060015 -0.031361 0.081851 -0.996014
	-0.000000 0.026025 0.000000 0.002752 -0.030576 0.001407
	-0.027674 -0.041720 0.059816 -0.066097 -0.104859 0.992278
	-0.000000 0.025637 -0.000000 0.001967 0.121148 -0.002623
	-0.050906 -0.034136 0.024111 0.047321 0.086427 -0.988347
	0.000000 0.049218 0.000000 0.076210 0.118705 -0.272672
	0.059788 -0.034178 0.023788 0.041650 -0.088189 0.985406
	-0.000000 0.049218 -0.000000 0.079444 -0.121933 0.270924
	0.032298 -0.054366 -0.002832 0.015650 -0.134960 -0.989867
	0.000000 0.018247 -0.000000 -0.001943 0.105362 0.003333
	-0.026453 -0.054341 -0.002832 0.024388 0.136085 0.988355
	0.000000 0.018247 -0.000000 -0.001737 -0.103576 -0.003526
	-0.038180 -0.146286 -0.008323 -0.083867 0.236072 0.951085
	0.052991 -0.146412 -0.010201 -0.083973 -0.236037 -0.951008
	0.032324 -0.124204 0.046072 -0.000097 -0.468376 0.883529
	-0.025435 -0.126788 0.041580 -0.000097 -0.468376 0.883529
	0.026917 -0.111942 0.013275 -0.080502 -0.440954 -0.880320
	-0.018141 -0.112515 0.013516 -0.080308 0.440987 0.880387
	0.474766 0.073684 -0.791111 -0.000374 -0.707079 -0.000000
	0.247835 -0.529487 -0.555359 0.000000 0.250468 -0.968125
	-0.161431 0.073472 -0.748792 -0.000374 -0.707079 -0.000000
	-0.096646 -0.463103 -0.583436 -0.339129 0.234470 -0.906822
	0.474761 0.073558 0.752820 -0.000374 -0.707079 -0.000000
	0.280849 -0.529487 0.377746 -0.968125 0.000000 -0.000000
	-0.101381 0.073470 0.581116 -0.000374 -0.707107 -0.000000
	-0.201450 -0.456157 0.511741 -0.906822 0.087686 -0.339129
	-0.520524 0.062698 0.365062 -0.000374 -0.707079 -0.000000
	-0.374164 -0.326056 0.383508 -0.878231 0.076169 -0.447886
	-0.487676 -0.048966 -0.437802 -0.000374 -0.707079 -0.000000
	-0.251910 -0.314289 -0.385687 0.865705 -0.166269 0.471641
	-0.787346 -0.551018 0.026832 -0.576453 0.409514 -0.576453
}

frame 5 {
	-0.018897 0.000000 0.100036 0.707107 0.000000 -0.000000
	0.353447 -0.368863 0.029003 -0.488601 0.495863 -0.504314
	0.000000 0.520055 0.000000 -0.153430 -0.000470 0.009229
	-0.136732 0.038256 0.004402 -0.089224 -0.068709 -0.657557
	-0.000000 0.447469 0.000000 0.216223 0.569092 -0.614660
	0.151140 0.042027 0.014281 -0.172059 0.121016 0.669917
	0.000000 0.437615 -0.000000 0.261700 -0.492091 0.719440
	0.162623 0.221462 -0.011451 -0.222042 0.178520 0.439403
	0.000000 0.501200 0.000000 0.807285 0.052248 0.007707
	-0.162016 0.218096 -0.011498 -0.193899 -0.105623 -0.544759
	-0.000000 0.492872 -0.000000 0.728724 -0.022924 0.036581
	0.142976 0.370391 -0.009384 -0.114969 -0.030785 0.194086
	0.000000 0.422763 -0.000000 0.694024 -0.066283 0.073781
	-0.137594 0.373323 -0.014729 -0.128833 0.009730 -0.294260
	0.000000 0.421663 0.000000 0.698779 0.066018 -0.053061
	0.035670 -0.040818 0.060015 -0.037181 0.097216 -0.994033
	-0.000000 0.026025 -0.000000 0.002852 -0.029120 0.001555
	-0.027674 -0.041720 0.059816 -0.071840 -0.129495 0.988834
	-0.000000 0.025637 0.000000 0.002062 0.121148 -0.002656
	-0.050906 -0.034136 0.024111 0.047114 0.067447 -0.986299
	0.000000 0.049218 -0.000000 0.098095 0.111319 -0.367870
	0.059788 -0.034178 0.023788 0.035882 -0.066075 0.979468
	0.000000 0.049218 -0.000000 0.108051 -0.115836 0.374916
	0.032298 -0.054366 -0.002832 0.020241 -0.176144 -0.982311
	-0.000000 0.018247 0.000000 -0.002567 0.105238 0.003447
	-0.026453 -0.054341 -0.002832 0.030256 0.176943 0.980000
	-0.000000 0.018247 0.000000 -0.002148 -0.103185 -0.003410
	-0.031061 -0.141635 -0.006057 -0.083867 0.236072 0.951085
	0.049292 -0.141798 -0.008826 -0.083973 -0.236037 -0.951008
	0.029301 -0.125150 0.043318 -0.000097 -0.468376 0.883529
	-0.022761 -0.128972 0.036697 -0.000097 -0.468376 0.883529
	0.024575 -0.109892 0.017883 -0.080501 -0.440954 -0.880320
	-0.015256 -0.110748 0.018238 -0.080308 0.440987 0.880387
	0.474767 0.073623 -0.816103 -0.000374 -0.707079 -0.000000
	0.247377 -0.529487 -0.555359 0.000000 0.250468 -0.968125
	-0.157793 0.073478 -0.789521 -0.000374 -0.707079 -0.000000
	-0.088650 -0.463402 -0.587012 -0.339129 0.234470 -0.906822
	0.474761 0.073571 0.724591 -0.000374 -0.707079 -0.000000
	0.279580 -0.529481 0.379352 -0.968125 0.000000 -0.000000
	-0.103911 0.073457 0.741515 -0.000374 -0.707107 -0.000000
	-0.189212 -0.456157 0.510381 -0.906822 0.087686 -0.339129
	-0.520520 0.065723 0.324596 -0.000374 -0.707079 -0.000000
	-0.368996 -0.326124 0.397056 -0.878231 0.076169 -0.447886
	-0.487963 0.034513 -0.384828 -0.000374 -0.707079 -0.000000
	-0.234636 -0.316444 -0.334483 0.865705 -0.166269 0.471641
	-0.790569 -0.550210 0.046108 -0.576453 0.409514 -0.576453
}

frame 6 {
	-0.018897 0.000000 0.100036 0.707107 0.000000 -0.000000
	0.353577 -0.354999 0.030445 -0.485074 0.492373 -0.507722
	0.000000 0.520055 0.000000 -0.163141 -0.000704 0.010716
	-0.136732 0.038257 0.004402 -0.090209 -0.068703 -0.658747
	-0.000000 0.447469 0.000000 0.215507 0.571211 -0.612001
	0.151140 0.042027 0.014281 -0.192630 0.144154 0.661102
	-0.000000 0.437615 -0.000000 0.269822 -0.464025 0.746100
	0.162623 0.221463 -0.011451 -0.211329 0.178793 0.466551
	-0.000000 0.501200 0.000000 0.758500 0.061165 0.022560
	-0.162016 0.218096 -0.011498 -0.184561 -0.099697 -0.555875
	0.000000 0.492872 0.000000 0.706729 -0.024273 0.033685
	0.142976 0.370391 -0.009384 -0.131507 -0.041067 0.191659
	-0.000000 0.422763 0.000000 0.711439 -0.071857 0.062080
	-0.137594 0.373323 -0.014729 -0.099297 0.025545 -0.285231
	-0.000000 0.421663 0.000000 0.686849 0.067787 -0.052430
	0.035670 -0.040818 0.060015 -0.042711 0.112102 -0.991616
	-0.000000 0.026025 0.000000 0.002937 -0.027760 0.001690
	-0.027674 -0.041720 0.059816 -0.077048 -0.152292 0.984942
	-0.000000 0.025637 -0.000000 0.002147 0.121226 -0.002689
	-0.050906 -0.034136 0.024111 0.048544 0.054002 -0.986045
	-0.000000 0.049218 -0.000000 0.112647 0.103807 -0.431593
	0.059788 -0.034178 0.023788 0.031781 -0.049038 0.974247
	-0.000000 0.049218 0.000000 0.129587 -0.109497 0.450289
	0.032298 -0.054366 -0.002832 0.024702 -0.217465 -0.972550
	0.000000 0.018247 -0.000000 -0.002603 0.105187 0.003017
	-0.026453 -0.054341 -0.002832 0.035767 0.216940 0.969637
	-0.000000 0.018246 -0.000000 -0.002577 -0.102903 -0.003531
	-0.023943 -0.136984 -0.003792 -0.083867 0.236072 0.951085
	0.045592 -0.137184 -0.007450 -0.083973 -0.236037 -0.951008
	0.026279 -0.126097 0.040563 -0.000097 -0.468376 0.883529
	-0.020087 -0.131156 0.031814 -0.000097 -0.468376 0.883529
	0.022233 -0.107842 0.022491 -0.080502 -0.440954 -0.880320
	-0.012371 -0.108981 0.022960 -0.080308 0.440987 0.880387
	0.474768 0.073530 -0.825059 -0.000374 -0.707079 -0.000000
	0.247377 -0.529487 -0.555359 0.000000 0.250468 -0.968125
	-0.153316 0.073477 -0.830258 -0.000374 -0.707079 -0.000000
	-0.079713 -0.463735 -0.591010 -0.339129 0.234470 -0.906822
	0.474760 0.073585 0.692189 -0.000374 -0.707079 -0.000000
	0.275772 -0.529463 0.384348 -0.968125 0.000000 -0.000000
	-0.106441 0.073430 0.842523 -0.000374 -0.707107 -0.000000
	-0.174807 -0.456157 0.508780 -0.906822 0.087686 -0.339129
	-0.520516 0.069074 0.290073 -0.000374 -0.707079 -0.000000
	-0.364753 -0.326179 0.408177 -0.878231 0.076169 -0.447886
	-0.488063 0.073545 -0.369215 -0.000374 -0.707079 -0.000000
	-0.228419 -0.317445 -0.316444 0.865705 -0.166269 0.471641
	-0.791676 -0.549932 0.052732 -0.576453 0.409514 -0.576453
}

frame 7 {
	-0.018897 0.000000 0.100036 0.707107 0.000000 -0.000000
	0.354479 -0.330279 0.016576 -0.488690 0.494495 -0.504300
	0.000000 0.520055 -0.000000 -0.180304 -0.002099 0.018756
	-0.136733 0.038257 0.004402 -0.172524 -0.161626 -0.621658
	-0.000000 0.447469 -0.000000 0.235034 0.509417 -0.684228
	0.151140 0.042027 0.014281 -0.204819 0.163247 0.648356
	0.000000 0.437615 -0.000000 0.276274 -0.439067 0.767839
	0.162623 0.221463 -0.011451 -0.232497 0.180149 0.475190
	-0.000000 0.501200 0.000000 0.767727 0.056877 0.015410
	-0.162016 0.218096 -0.011498 -0.200540 -0.107270 -0.561463
	-0.000000 0.492872 -0.000000 0.699271 -0.027018 0.028236
	0.142976 0.370391 -0.009384 -0.153571 -0.044846 0.197141
	-0.000000 0.422763 0.000000 0.725720 -0.076154 0.054309
	-0.137594 0.373323 -0.014729 -0.132802 0.020448 -0.283117
	-0.000000 0.421663 -0.000000 0.707204 0.065999 -0.058315
	0.035670 -0.040818 0.060015 -0.047355 0.124807 -0.989173
	-0.000000 0.026025 -0.000000 0.003003 -0.026641 0.001800
	-0.027674 -0.041720 0.059816 -0.081243 -0.170961 0.981249
	0.000000 0.025637 -0.000000 0.002215 0.121343 -0.002720
	-0.050906 -0.034136 0.024111 0.051578 0.045881 -0.986991
	0.000000 0.049218 0.000000 0.120920 0.097080 -0.472327
	0.059788 -0.034178 0.023788 0.029315 -0.036663 0.970379
	-0.000000 0.049218 -0.000000 0.144913 -0.103784 0.503735
	0.032298 -0.054366 -0.002832 0.028423 -0.253007 -0.962389
	0.000000 0.018246 0.000000 -0.002806 0.105213 0.002977
	-0.026453 -0.054341 -0.002832 0.040320 0.251219 0.958991
	-0.000000 0.018247 -0.000000 -0.002525 -0.102758 -0.003169
	-0.017659 -0.132878 -0.001793 -0.083867 0.236072 0.951085
	0.042327 -0.133110 -0.006236 -0.083973 -0.236037 -0.951008
	0.023610 -0.126932 0.038132 -0.000097 -0.468376 0.883529
	-0.017727 -0.133085 0.027504 -0.000097 -0.468376 0.883529
	0.020166 -0.106033 0.026558 -0.080502 -0.440954 -0.880320
	-0.009825 -0.107421 0.027129 -0.080308 0.440987 0.880387
	0.474777 -0.021852 -0.818067 -0.000374 -0.707079 -0.000000
	0.247377 -0.529487 -0.555359 0.000000 0.250468 -0.968125
	-0.149428 0.073468 -0.870707 -0.000374 -0.707079 -0.000000
	-0.070444 -0.464081 -0.595156 -0.339129 0.234470 -0.906822
	0.474761 0.073600 0.656134 -0.000374 -0.707079 -0.000000
	0.269658 -0.529436 0.392795 -0.968125 0.000000 -0.000000
	-0.107114 0.073436 0.827550 -0.000374 -0.707107 -0.000000
	-0.158717 -0.456157 0.506992 -0.906822 0.087686 -0.339129
	-0.520514 0.070208 0.273009 -0.000374 -0.707079 -0.000000
	-0.362058 -0.326214 0.415242 -0.878231 0.076169 -0.447886
	-0.488049 0.073544 -0.373360 -0.000374 -0.707079 -0.000000
	-0.226652 -0.317009 -0.321126 0.865705 -0.166269 0.471641
	-0.791500 -0.549976 0.051679 -0.576453 0.409514 -0.576453
}

frame 8 {
	-0.018897 0.000000 0.100036 0.707107 0.000000 -0.000000
	0.355884 -0.314009 -0.005331 -0.492284 0.496604 -0.500858
	0.000000 0.520055 -0.000000 -0.191106 -0.004370 0.031490
	-0.136732 0.038257 0.004402 -0.259875 -0.268011 -0.558733
	0.000000 0.447469 -0.000000 0.257725 0.418280 -0.770862
	0.151140 0.042027 0.014281 -0.206907 0.175212 0.633960
	0.000000 0.437615 0.000000 0.280111 -0.420822 0.782662
	0.162623 0.221463 -0.011451 -0.247850 0.177727 0.486524
	-0.000000 0.501200 0.000000 0.774700 0.050951 0.005629
	-0.162016 0.218096 -0.011498 -0.212164 -0.112552 -0.563674
	-0.000000 0.492872 -0.000000 0.693170 -0.029628 0.023292
	0.142976 0.370391 -0.009384 -0.195523 -0.028896 0.216024
	-0.000000 0.422763 0.000000 0.738414 -0.073173 0.057767
	-0.137594 0.373323 -0.014729 -0.156114 0.017081 -0.282277
	0.000000 0.421663 -0.000000 0.719776 0.065019 -0.061894
	0.035670 -0.040818 0.060014 -0.050755 0.134231 -0.987139
	0.000000 0.026025 -0.000000 0.003048 -0.025838 0.001879
	-0.027674 -0.041720 0.059816 -0.084211 -0.184354 0.978320
	-0.000000 0.025637 0.000000 0.002264 0.121456 -0.002744
	-0.050906 -0.034136 0.024111 0.055799 0.042684 -0.988133
	-0.000000 0.049218 -0.000000 0.123878 0.092581 -0.496321
	0.059788 -0.034178 0.023788 0.028963 -0.029612 0.967742
	0.000000 0.049218 -0.000000 0.153664 -0.099812 0.538988
	0.032298 -0.054366 -0.002832 0.031115 -0.279365 -0.953773
	0.000000 0.018246 0.000000 -0.002928 0.105280 0.002953
	-0.026453 -0.054341 -0.002832 0.043537 0.276218 0.950202
	-0.000000 0.018246 -0.000000 -0.002682 -0.102712 -0.003200
	-0.012855 -0.129739 -0.000264 -0.083867 0.236072 0.951085
	0.039830 -0.129996 -0.005308 -0.083973 -0.236037 -0.951008
	0.021570 -0.127570 0.036273 -0.000097 -0.468376 0.883529
	-0.015922 -0.134559 0.024208 -0.000097 -0.468376 0.883529
	0.018586 -0.104650 0.029668 -0.080502 -0.440954 -0.880320
	-0.007878 -0.106228 0.030315 -0.080308 0.440987 0.880387
	0.474783 -0.117096 -0.761072 -0.000374 -0.707079 -0.000000
	0.247377 -0.529487 -0.555359 0.000000 0.250468 -0.968125
	-0.147160 0.073453 -0.910272 -0.000374 -0.707079 -0.000000
	-0.061506 -0.464415 -0.599154 -0.339129 0.234470 -0.906822
	0.474761 0.073615 0.616892 -0.000374 -0.707079 -0.000000
	0.261880 -0.529401 0.404328 -0.968125 0.000000 -0.000000
	-0.108593 0.073444 0.802002 -0.000374 -0.707107 -0.000000
	-0.141556 -0.456157 0.505085 -0.906822 0.087686 -0.339129
	-0.520512 0.044602 0.293181 -0.000374 -0.707079 -0.000000
	-0.361155 -0.326226 0.417608 -0.878231 0.076169 -0.447886
	-0.488009 0.073542 -0.387567 -0.000374 -0.707079 -0.000000
	-0.221537 -0.315748 -0.335329 0.865705 -0.166269 0.471641
	-0.790968 -0.550110 0.048496 -0.576453 0.409514 -0.576453
}

frame 9 {
	-0.018897 0.000000 0.100036 0.707107 0.000000 -0.000000
	0.357206 -0.323954 -0.019399 -0.490706 0.497367 -0.502422
	-0.000000 0.520055 -0.000000 -0.184582 -0.006263 0.041789
	-0.136732 0.038257 0.004402 -0.216741 -0.207211 -0.588824
	-0.000000 0.447469 0.000000 0.302347 0.273478 -0.877839
	0.151140 0.042027 0.014281 -0.194211 0.171278 0.626702
	-0.000000 0.437615 -0.000000 0.281922 -0.408732 0.791768
	0.162623 0.221463 -0.011451 -0.249595 0.171333 0.499327
	-0.000000 0.501200 0.000000 0.778765 0.045614 -0.003899
	-0.162016 0.218096 -0.011498 -0.196299 -0.103311 -0.565148
	-0.000000 0.492872 -0.000000 0.674467 -0.030306 0.022115
	0.142975 0.370391 -0.009384 -0.236696 0.005658 0.242003
	0.000000 0.422763 -0.000000 0.736910 -0.064145 0.073706
	-0.137594 0.373323 -0.014729 -0.143408 0.021731 -0.289107
	0.000000 0.421663 -0.000000 0.711559 0.067986 -0.053880
	0.035670 -0.040818 0.060015 -0.052785 0.140126 -0.985780
	-0.000000 0.026025 -0.000000 0.002636 -0.025366 0.001651
	-0.027674 -0.041720 0.059816 -0.085940 -0.192229 0.976488
	-0.000000 0.025637 0.000000 0.002293 0.121532 -0.002759
	-0.050906 -0.034136 0.024111 0.058614 0.041349 -0.989032
	-0.000000 0.049218 0.000000 0.124971 0.089936 -0.508301
	0.059788 -0.034178 0.023788 0.029079 -0.025800 0.966391
	-0.000000 0.049218 -0.000000 0.158359 -0.097347 0.558787
	0.032298 -0.054366 -0.002832 0.032699 -0.295133 -0.948170
	-0.000000 0.018246 -0.000000 -0.002996 0.105342 0.002944
	-0.026453 -0.054341 -0.002832 0.045409 0.291063 0.944564
	-0.000000 0.018247 -0.000000 -0.002770 -0.102710 -0.003220
	-0.009900 -0.127809 0.000676 -0.083867 0.236072 0.951085
	0.038294 -0.128081 -0.004737 -0.083973 -0.236037 -0.951008
	0.020316 -0.127963 0.035130 -0.000097 -0.468376 0.883529
	-0.014812 -0.135466 0.022181 -0.000097 -0.468376 0.883529
	0.017614 -0.103799 0.031581 -0.080501 -0.440954 -0.880320
	-0.006680 -0.105495 0.032275 -0.080308 0.440987 0.880387
	0.474787 0.013540 -0.416022 -0.000374 -0.707079 -0.000000
	0.247377 -0.529487 -0.555359 0.000000 0.250468 -0.968125
	-0.146488 0.073430 -0.943581 -0.000374 -0.707079 -0.000000
	-0.053511 -0.464713 -0.602731 -0.339129 0.234470 -0.906822
	0.474762 0.073629 0.574896 -0.000374 -0.707079 -0.000000
	0.253489 -0.529363 0.418066 -0.968125 0.000000 -0.000000
	-0.110464 0.073449 0.773217 -0.000374 -0.707107 -0.000000
	-0.124027 -0.456157 0.503138 -0.906822 0.087686 -0.339129
	-0.520509 -0.010152 0.350994 -0.000374 -0.707079 -0.000000
	-0.361496 -0.326222 0.416716 -0.878231 0.076169 -0.447886
	-0.487945 0.073537 -0.406393 -0.000374 -0.707079 -0.000000
	-0.213877 -0.313865 -0.358250 0.865705 -0.166269 0.471641
	-0.790083 -0.550332 0.043200 -0.576453 0.409514 -0.576453
}

frame 10 {
	-0.018897 0.000000 0.100036 0.707107 0.000000 -0.000000
	0.358519 -0.348371 -0.030451 -0.486334 0.499947 -0.506685
	0.000000 0.520055 -0.000000 -0.168402 -0.009006 0.056579
	-0.136732 0.038257 0.004402 -0.114463 -0.090522 -0.642342
	0.000000 0.447469 -0.000000 0.306577 0.301261 -0.866119
	0.151140 0.042027 0.014281 -0.170625 0.153536 0.628404
	-0.000000 0.437615 0.000000 0.282215 -0.402828 0.795818
	0.162623 0.221462 -0.011451 -0.239972 0.160356 0.518013
	0.000000 0.501200 0.000000 0.779156 0.040244 -0.013931
	-0.162016 0.218096 -0.011498 -0.259894 -0.136041 -0.538190
	-0.000000 0.492872 0.000000 0.762339 -0.020016 0.042877
	0.142976 0.370391 -0.009384 -0.217317 0.033343 0.278246
	-0.000000 0.422763 0.000000 0.695221 -0.056518 0.092957
	-0.137594 0.373323 -0.014729 -0.112801 0.030351 -0.293885
	0.000000 0.421663 -0.000000 0.691417 0.072499 -0.041663
	0.035670 -0.040818 0.060014 -0.053448 0.141988 -0.985333
	-0.000000 0.026025 0.000000 0.002643 -0.025213 0.001664
	-0.027674 -0.041720 0.059816 -0.086500 -0.194787 0.975875
	0.000000 0.025637 0.000000 0.002303 0.121559 -0.002764
	-0.050906 -0.034136 0.024111 0.059572 0.040991 -0.989357
	0.000000 0.049218 -0.000000 0.125234 0.089071 -0.511845
	0.059788 -0.034178 0.023788 0.029147 -0.024625 0.965976
	0.000000 0.049218 -0.000000 0.159822 -0.096543 0.565034
	0.032298 -0.054366 -0.002832 0.033212 -0.300289 -0.946264
	-0.000000 0.018247 -0.000000 -0.003018 0.105366 0.002941
	-0.026453 -0.054341 -0.002832 0.046013 0.295901 0.942659
	-0.000000 0.018246 -0.000000 -0.002798 -0.102714 -0.003227
	-0.008918 -0.127167 0.000989 -0.083866 0.236072 0.951085
	0.037784 -0.127444 -0.004548 -0.083973 -0.236037 -0.951008
	0.019899 -0.128094 0.034750 -0.000097 -0.468376 0.883529
	-0.014443 -0.135767 0.021508 -0.000097 -0.468376 0.883529
	0.017291 -0.103516 0.032216 -0.080502 -0.440954 -0.880320
	-0.006282 -0.105251 0.032927 -0.080308 0.440987 0.880387
	0.474768 0.073530 -0.322903 -0.000374 -0.707079 -0.000000
	0.247377 -0.529487 -0.555359 0.000000 0.250468 -0.968125
	-0.152228 0.019175 -0.842108 -0.000374 -0.707079 -0.000000
	-0.046942 -0.464958 -0.605669 -0.339129 0.234470 -0.906822
	0.474762 0.073642 0.530568 -0.000374 -0.707079 -0.000000
	0.245711 -0.529329 0.432763 -0.968125 0.000000 -0.000000
	-0.112525 0.073451 0.742682 -0.000374 -0.707107 -0.000000
	-0.106865 -0.456156 0.501231 -0.906822 0.087686 -0.339129
	-0.520511 -0.035763 0.426807 -0.000374 -0.707079 -0.000000
	-0.362524 -0.326208 0.414019 -0.878231 0.076169 -0.447886
	-0.487859 0.073528 -0.428032 -0.000374 -0.707079 -0.000000
	-0.205288 -0.311761 -0.387233 0.865705 -0.166269 0.471641
	-0.788863 -0.550638 0.035902 -0.576453 0.409514 -0.576453
}

frame 11 {
	-0.018897 0.000000 0.100036 0.707107 0.000000 -0.000000
	0.358894 -0.368032 -0.034026 -0.481693 0.503636 -0.511070
	-0.000000 0.520055 0.000000 -0.155605 -0.010972 0.067158
	-0.136732 0.038257 0.004402 -0.095950 -0.071473 -0.636120
	-0.000000 0.447469 0.000000 0.306658 0.318350 -0.857614
	0.151140 0.042027 0.014281 -0.150806 0.135989 0.634895
	0.000000 0.437615 -0.000000 0.284077 -0.392826 0.803250
	0.162623 0.221462 -0.011451 -0.234331 0.151551 0.535218
	0.000000 0.501200 0.000000 0.785004 0.035183 -0.024070
	-0.162016 0.218096 -0.011497 -0.343951 -0.153741 -0.506305
	-0.000000 0.492872 0.000000 0.852696 -0.003952 0.084604
	0.142976 0.370391 -0.009384 -0.103648 0.026847 0.328311
	-0.000000 0.422763 0.000000 0.575599 -0.052294 0.103010
	-0.137594 0.373323 -0.014729 -0.087176 0.037945 -0.303153
	0.000000 0.421663 0.000000 0.669501 0.077095 -0.030796
	0.035670 -0.040818 0.060015 -0.052900 0.140451 -0.985703
	0.000000 0.026025 0.000000 0.002637 -0.025339 0.001653
	-0.027674 -0.041720 0.059816 -0.086039 -0.192678 0.976381
	-0.000000 0.025637 0.000000 0.002295 0.121537 -0.002760
	-0.050906 -0.034136 0.024111 0.058781 0.041283 -0.989088
	0.000000 0.049218 0.000000 0.125021 0.089785 -0.508935
	0.059788 -0.034178 0.023788 0.029089 -0.025592 0.966317
	0.000000 0.049218 -0.000000 0.158618 -0.097207 0.559887
	0.032298 -0.054366 -0.002832 0.032788 -0.296034 -0.947839
	0.000000 0.018246 -0.000000 -0.003000 0.105346 0.002943
	-0.026453 -0.054341 -0.002832 0.045515 0.291910 0.944233
	-0.000000 0.018247 0.000000 -0.002775 -0.102711 -0.003221
	-0.009729 -0.127697 0.000731 -0.083867 0.236072 0.951085
	0.038205 -0.127970 -0.004704 -0.083973 -0.236037 -0.951008
	0.020243 -0.127986 0.035063 -0.000097 -0.468377 0.883529
	-0.014748 -0.135518 0.022064 -0.000097 -0.468376 0.883529
	0.017558 -0.103749 0.031692 -0.080502 -0.440954 -0.880320
	-0.006611 -0.105452 0.032389 -0.080308 0.440987 0.880387
	0.474759 0.073578 -0.329017 -0.000374 -0.707079 -0.000000
	0.247377 -0.529487 -0.555359 0.000000 0.250468 -0.968125
	-0.163379 -0.035070 -0.672334 -0.000374 -0.707079 -0.000000
	-0.042120 -0.465138 -0.607826 -0.339129 0.234470 -0.906822
	0.474763 0.073654 0.484353 -0.000374 -0.707079 -0.000000
	0.239597 -0.529302 0.447169 -0.968125 0.000000 -0.000000
	-0.114652 0.073450 0.711017 -0.000374 -0.707107 -0.000000
	-0.090775 -0.456156 0.499443 -0.906822 0.087686 -0.339129
	-0.520510 0.017218 0.528286 -0.000374 -0.707079 -0.000000
	-0.364228 -0.326186 0.409555 -0.878231 0.076169 -0.447886
	-0.487755 0.073516 -0.451614 -0.000374 -0.707079 -0.000000
	-0.197927 -0.309972 -0.417975 0.865705 -0.166269 0.471641
	-0.787346 -0.551018 0.026831 -0.576453 0.409514 -0.576453
}

frame 12 {
	-0.018897 0.000000 0.100036 0.707107 0.000000 -0.000000
	0.356547 -0.380018 -0.020116 -0.479797 0.513598 -0.511868
	-0.000000 0.520055 0.000000 -0.149025 -0.011642 0.070718
	-0.136732 0.038256 0.004402 -0.105014 -0.079729 -0.621826
	-0.000000 0.447469 -0.000000 0.304890 0.334489 -0.848471
	0.151140 0.042027 0.014281 -0.126662 0.110628 0.651850
	-0.000000 0.437615 0.000000 0.288027 -0.376189 0.815598
	0.162623 0.221463 -0.011451 -0.228414 0.142486 0.549907
	-0.000000 0.501200 0.000000 0.800981 0.030002 -0.035585
	-0.162016 0.218096 -0.011498 -0.314971 -0.083580 -0.489967
	0.000000 0.492872 -0.000000 0.887870 0.016979 0.128689
	0.142976 0.370391 -0.009384 0.034188 -0.000016 0.377640
	-0.000000 0.422763 -0.000000 0.395401 -0.048052 0.088002
	-0.137594 0.373323 -0.014729 -0.076572 0.039894 -0.321081
	0.000000 0.421663 -0.000000 0.646538 0.080382 -0.024899
	0.035670 -0.040818 0.060015 -0.051227 0.135547 -0.986839
	0.000000 0.026025 0.000000 0.003054 -0.025728 0.001890
	-0.027674 -0.041720 0.059816 -0.084616 -0.186194 0.977899
	0.000000 0.025637 0.000000 0.002271 0.121473 -0.002747
	-0.050906 -0.034136 0.024111 0.056438 0.042340 -0.988328
	-0.000000 0.049218 0.000000 0.124172 0.091965 -0.499263
	0.059788 -0.034178 0.023788 0.029002 -0.028684 0.967432
	-0.000000 0.049218 -0.000000 0.154779 -0.099220 0.543743
	0.032298 -0.054366 -0.002832 0.031485 -0.283033 -0.952500
	0.000000 0.018246 0.000000 -0.002944 0.105293 0.002951
	-0.026453 -0.054341 -0.002832 0.043977 0.279679 0.948916
	-0.000000 0.018247 0.000000 -0.002703 -0.102710 -0.003204
	-0.012173 -0.129294 -0.000047 -0.083866 0.236072 0.951085
	0.039476 -0.129554 -0.005177 -0.083973 -0.236037 -0.951008
	0.021281 -0.127661 0.036009 -0.000097 -0.468376 0.883529
	-0.015666 -0.134768 0.023741 -0.000097 -0.468376 0.883529
	0.018362 -0.104453 0.030109 -0.080502 -0.440954 -0.880320
	-0.007601 -0.106059 0.030767 -0.080308 0.440987 0.880387
	0.474754 0.073628 -0.348140 -0.000374 -0.707079 -0.000000
	0.247377 -0.529487 -0.555359 0.000000 0.250468 -0.968125
	-0.176126 0.019149 -0.453369 -0.000374 -0.707079 -0.000000
	-0.039207 -0.465247 -0.609129 -0.339129 0.234470 -0.906822
	0.474764 0.073662 0.436749 -0.000374 -0.707079 -0.000000
	0.235789 -0.529287 0.460345 -0.968125 0.000000 -0.000000
	-0.116756 0.073446 0.678554 -0.000374 -0.707107 -0.000000
	-0.076369 -0.456156 0.497842 -0.906822 0.087686 -0.339129
	-0.520514 0.070208 0.642892 -0.000374 -0.707079 -0.000000
	-0.366548 -0.326156 0.403474 -0.878231 0.076169 -0.447886
	-0.487638 0.073501 -0.476640 -0.000374 -0.707079 -0.000000
	-0.193768 -0.308986 -0.445908 0.865705 -0.166269 0.471641
	-0.785594 -0.551457 0.016354 -0.576453 0.409514 -0.576453
}

frame 13 {
	-0.018897 0.000000 0.100036 0.707107 0.000000 -0.000000
	0.351769 -0.388009 0.009650 -0.481138 0.529434 -0.508281
	-0.000000 0.520055 0.000000 -0.146720 -0.010935 0.066769
	-0.136733 0.038257 0.004402 -0.130767 -0.104155 -0.603931
	0.000000 0.447469 0.000000 0.300930 0.353388 -0.836530
	0.151140 0.042027 0.014281 -0.089417 0.069403 0.679663
	-0.000000 0.437615 -0.000000 0.292118 -0.358973 0.827779
	0.162623 0.221462 -0.011451 -0.216957 0.129146 0.562088
	0.000000 0.501200 0.000000 0.822612 0.024413 -0.049152
	-0.162016 0.218096 -0.011498 -0.248816 -0.026114 -0.472852
	0.000000 0.492872 0.000000 0.883147 0.028550 0.142515
	0.142976 0.370391 -0.009384 0.036673 0.004882 0.362622
	0.000000 0.422763 -0.000000 0.437970 -0.047478 0.096083
	-0.137594 0.373323 -0.014729 -0.077188 0.035935 -0.341815
	-0.000000 0.421663 0.000000 0.617865 0.081325 -0.025217
	0.035670 -0.040818 0.060015 -0.048414 0.127733 -0.988562
	0.000000 0.026025 0.000000 0.003017 -0.026390 0.001825
	-0.027674 -0.041720 0.059816 -0.082177 -0.175159 0.980356
	0.000000 0.025637 0.000000 0.002230 0.121376 -0.002727
	-0.050906 -0.034136 0.024111 0.052777 0.044702 -0.987300
	-0.000000 0.049218 -0.000000 0.122057 0.095636 -0.480324
	0.059788 -0.034178 0.023788 0.029158 -0.034363 0.969527
	0.000000 0.049218 -0.000000 0.147756 -0.102548 0.515072
	0.032298 -0.054366 -0.002832 0.029265 -0.261201 -0.959810
	-0.000000 0.018246 0.000000 -0.002846 0.105229 0.002969
	-0.026453 -0.054341 -0.002832 0.041332 0.259016 0.956344
	0.000000 0.018247 0.000000 -0.002575 -0.102738 -0.003178
	-0.016181 -0.131913 -0.001322 -0.083867 0.236072 0.951085
	0.041559 -0.132152 -0.005951 -0.083973 -0.236037 -0.951008
	0.022983 -0.127128 0.037560 -0.000097 -0.468376 0.883529
	-0.017172 -0.133538 0.026490 -0.000097 -0.468376 0.883529
	0.019680 -0.105607 0.027515 -0.080502 -0.440954 -0.880320
	-0.009226 -0.107054 0.028109 -0.080308 0.440987 0.880387
	0.474750 0.073678 -0.373596 -0.000374 -0.707079 -0.000000
	0.247377 -0.529487 -0.555359 0.000000 0.250468 -0.968125
	-0.183460 0.073430 -0.321468 -0.000374 -0.707079 -0.000000
	-0.038243 -0.465283 -0.609560 -0.339129 0.234470 -0.906822
	0.474765 0.073666 0.388387 -0.000374 -0.707079 -0.000000
	0.234520 -0.529282 0.471758 -0.968125 0.000000 -0.000000
	-0.118764 0.073440 0.645499 -0.000374 -0.707107 -0.000000
	-0.064130 -0.456157 0.496482 -0.906822 0.087686 -0.339129
	-0.520519 0.070211 0.630886 -0.000374 -0.707079 -0.000000
	-0.369371 -0.326119 0.396072 -0.878231 0.076169 -0.447886
	-0.487511 0.073484 -0.502788 -0.000374 -0.707079 -0.000000
	-0.193973 -0.309088 -0.467725 0.865705 -0.166269 0.471641
	-0.783691 -0.551935 0.004968 -0.576453 0.409514 -0.576453
}

frame 14 {
	-0.018897 0.000000 0.100036 0.707107 0.000000 -0.000000
	0.349556 -0.390269 0.023561 -0.482163 0.536315 -0.506108
	0.000000 0.520055 0.000000 -0.147536 -0.009383 0.058235
	-0.136732 0.038257 0.004402 -0.145295 -0.118373 -0.594620
	-0.000000 0.447469 -0.000000 0.297105 0.368465 -0.826286
	0.151140 0.042027 0.014281 -0.062614 0.039202 0.697655
	-0.000000 0.437615 0.000000 0.295202 -0.346112 0.836499
	0.162623 0.221463 -0.011451 -0.215189 0.119742 0.567957
	-0.000000 0.501200 -0.000000 0.838477 0.019863 -0.060492
	-0.162016 0.218096 -0.011498 -0.264023 -0.043281 -0.474283
	0.000000 0.492872 0.000000 0.879536 0.023346 0.135161
	0.142976 0.370391 -0.009384 0.029229 0.008591 0.345861
	0.000000 0.422763 0.000000 0.473561 -0.046929 0.102740
	-0.137594 0.373323 -0.014729 -0.074984 0.031794 -0.352985
	-0.000000 0.421663 -0.000000 0.592555 0.079945 -0.028670
	0.035670 -0.040818 0.060015 -0.044527 0.117047 -0.990706
	0.000000 0.026025 0.000000 0.002963 -0.027320 0.001734
	-0.027674 -0.041720 0.059816 -0.078709 -0.159644 0.983542
	-0.000000 0.025637 0.000000 0.002173 0.121266 -0.002701
	-0.050906 -0.034136 0.024111 0.049409 0.050370 -0.986315
	0.000000 0.049218 -0.000000 0.116384 0.101227 -0.448710
	0.059788 -0.034178 0.023788 0.030671 -0.043965 0.972677
	0.000000 0.049218 -0.000000 0.135900 -0.107293 0.472041
	0.032298 -0.054366 -0.002832 0.026161 -0.231276 -0.968798
	0.000000 0.018247 0.000000 -0.002689 0.105189 0.003002
	-0.026453 -0.054341 -0.002832 0.037579 0.230428 0.965633
	0.000000 0.018246 -0.000000 -0.002380 -0.102836 -0.003141
	-0.021522 -0.135402 -0.003022 -0.083867 0.236072 0.951085
	0.044334 -0.135614 -0.006983 -0.083973 -0.236037 -0.951008
	0.025251 -0.126418 0.039627 -0.000097 -0.468377 0.883529
	-0.019178 -0.131899 0.030153 -0.000097 -0.468376 0.883529
	0.021437 -0.107145 0.024058 -0.080502 -0.440954 -0.880320
	-0.011390 -0.108380 0.024566 -0.080308 0.440987 0.880387
	0.474748 0.073724 -0.402886 -0.000374 -0.707079 -0.000000
	0.247377 -0.529487 -0.555359 0.000000 0.250468 -0.968125
	-0.182782 0.073438 -0.347783 -0.000374 -0.707079 -0.000000
	-0.040799 -0.465187 -0.608417 -0.339129 0.234470 -0.906822
	0.474766 0.073664 0.340165 -0.000374 -0.707079 -0.000000
	0.235145 -0.529290 0.483285 -0.968125 0.000000 -0.000000
	-0.120609 0.073432 0.611990 -0.000374 -0.707107 -0.000000
	-0.054402 -0.456157 0.495402 -0.906822 0.087686 -0.339129
	-0.520523 0.070212 0.611458 -0.000374 -0.707079 -0.000000
	-0.372528 -0.326078 0.387798 -0.878231 0.076169 -0.447886
	-0.487380 0.073467 -0.529840 -0.000374 -0.707079 -0.000000
	-0.198829 -0.310348 -0.481885 0.865705 -0.166269 0.471641
	-0.781734 -0.552425 -0.006732 -0.576453 0.409514 -0.576453
}

frame 15 {
	-0.018897 0.000000 0.100036 0.707107 0.000000 -0.000000
	0.349658 -0.385419 0.023554 -0.480822 0.532384 -0.507982
	0.000000 0.520055 -0.000000 -0.151579 -0.006803 0.044098
	-0.136733 0.038257 0.004402 -0.148690 -0.122105 -0.593938
	0.000000 0.447469 -0.000000 0.293966 0.378415 -0.819000
	0.151140 0.042027 0.014281 -0.055180 0.030025 0.705368
	-0.000000 0.437615 0.000000 0.298202 -0.331304 0.845892
	0.162623 0.221462 -0.011451 -0.230562 0.120115 0.565557
	-0.000000 0.501200 0.000000 0.852290 0.017001 -0.067731
	-0.162016 0.218096 -0.011498 -0.270610 -0.055488 -0.475522
	-0.000000 0.492872 -0.000000 0.876424 0.018823 0.128319
	0.142976 0.370391 -0.009384 0.007782 0.013544 0.332475
	0.000000 0.422763 0.000000 0.503209 -0.045662 0.109826
	-0.137594 0.373323 -0.014729 -0.066557 0.029583 -0.359670
	-0.000000 0.421663 -0.000000 0.572434 0.077863 -0.032972
	0.035670 -0.040818 0.060014 -0.039772 0.104155 -0.992966
	-0.000000 0.026025 0.000000 0.002893 -0.028479 0.001619
	-0.027674 -0.041720 0.059816 -0.074310 -0.140250 0.987083
	0.000000 0.025637 0.000000 0.002102 0.121176 -0.002671
	-0.050906 -0.034136 0.024111 0.047768 0.060924 -0.985936
	-0.000000 0.049218 0.000000 0.105255 0.107917 -0.400186
	0.059788 -0.034178 0.023788 0.033911 -0.057871 0.976930
	0.000000 0.049218 -0.000000 0.118480 -0.112963 0.412209
	0.032298 -0.054366 -0.002832 0.022341 -0.195402 -0.978030
	-0.000000 0.018247 0.000000 -0.002442 0.105205 0.003038
	-0.026453 -0.054341 -0.002832 0.032849 0.195561 0.975447
	-0.000000 0.018246 -0.000000 -0.002364 -0.103040 -0.003477
	-0.027773 -0.139487 -0.005011 -0.083866 0.236072 0.951085
	0.047583 -0.139666 -0.008191 -0.083973 -0.236037 -0.951008
	0.027905 -0.125587 0.042045 -0.000097 -0.468376 0.883529
	-0.021526 -0.129981 0.034441 -0.000097 -0.468376 0.883529
	0.023493 -0.108945 0.020011 -0.080501 -0.440954 -0.880320
	-0.013923 -0.109932 0.020420 -0.080308 0.440987 0.880387
	0.474747 0.073766 -0.434732 -0.000374 -0.707079 -0.000000
	0.247377 -0.529487 -0.555359 0.000000 0.250468 -0.968125
	-0.181132 0.073441 -0.381224 -0.000374 -0.707079 -0.000000
	-0.048430 -0.464903 -0.605003 -0.339129 0.234470 -0.906822
	0.474767 0.073650 0.293602 -0.000374 -0.707079 -0.000000
	0.237010 -0.529312 0.496732 -0.968125 0.000000 -0.000000
	-0.122221 0.073424 0.578133 -0.000374 -0.707107 -0.000000
	-0.047391 -0.456157 0.494623 -0.906822 0.087686 -0.339129
	-0.520525 0.070211 0.589911 -0.000374 -0.707079 -0.000000
	-0.375801 -0.326035 0.379217 -0.878231 0.076169 -0.447886
	-0.487249 0.073451 -0.557632 -0.000374 -0.707079 -0.000000
	-0.206969 -0.314342 -0.490699 0.865705 -0.166269 0.471641
	-0.779831 -0.552903 -0.018117 -0.576453 0.409514 -0.576453
}

frame 16 {
	-0.018897 0.000000 0.100036 0.707107 0.000000 -0.000000
	0.349991 -0.372732 0.023498 -0.477657 0.521618 -0.512460
	0.000000 0.520055 -0.000000 -0.159923 -0.002458 0.020322
	-0.136732 0.038256 0.004402 -0.149073 -0.123011 -0.598617
	0.000000 0.447469 0.000000 0.290474 0.386860 -0.812239
	0.151140 0.042027 0.014281 -0.061054 0.035528 0.709237
	0.000000 0.437615 -0.000000 0.301159 -0.310734 0.857760
	0.162623 0.221463 -0.011451 -0.261100 0.128846 0.552019
	0.000000 0.501200 -0.000000 0.869010 0.015465 -0.072137
	-0.162016 0.218096 -0.011498 -0.274281 -0.067220 -0.479379
	-0.000000 0.492872 -0.000000 0.873859 0.014249 0.120824
	0.142976 0.370391 -0.009384 -0.029537 0.021520 0.315002
	0.000000 0.422763 0.000000 0.540479 -0.043036 0.120872
	-0.137594 0.373323 -0.014729 -0.055086 0.029679 -0.370188
	0.000000 0.421663 0.000000 0.552030 0.075905 -0.037038
	0.035670 -0.040818 0.060014 -0.034530 0.090175 -0.995006
	0.000000 0.026025 -0.000000 0.002808 -0.029781 0.001489
	-0.027674 -0.041720 0.059816 -0.069259 -0.118348 0.990490
	-0.000000 0.025637 0.000000 0.002020 0.121137 -0.002641
	-0.050906 -0.034136 0.024111 0.046639 0.074926 -0.987089
	0.000000 0.049218 0.000000 0.089683 0.114665 -0.329091
	0.059788 -0.034178 0.023788 0.038089 -0.075183 0.982195
	-0.000000 0.049218 -0.000000 0.096363 -0.118638 0.331808
	0.032298 -0.054366 -0.002832 0.018134 -0.157076 -0.986076
	-0.000000 0.018246 -0.000000 -0.002315 0.105287 0.003421
	-0.026453 -0.054341 -0.002832 0.027566 0.158011 0.984159
	0.000000 0.018247 0.000000 -0.002135 -0.103353 -0.003731
	-0.034350 -0.143784 -0.007104 -0.083867 0.236072 0.951085
	0.051001 -0.143930 -0.009461 -0.083973 -0.236037 -0.951008
	0.030698 -0.124713 0.044590 -0.000097 -0.468376 0.883529
	-0.023996 -0.127963 0.038953 -0.000097 -0.468376 0.883529
	0.025657 -0.110839 0.015754 -0.080502 -0.440954 -0.880320
	-0.016589 -0.111564 0.016057 -0.080308 0.440987 0.880387
	0.474747 0.073802 -0.468362 -0.000374 -0.707079 -0.000000
	0.247377 -0.529487 -0.555359 0.000000 0.250468 -0.968125
	-0.178883 0.073439 -0.416251 -0.000374 -0.707079 -0.000000
	-0.060444 -0.464454 -0.599629 -0.339129 0.234470 -0.906822
	0.474768 0.073616 0.251995 -0.000374 -0.707079 -0.000000
	0.239947 -0.529346 0.511329 -0.968125 0.000000 -0.000000
	-0.123523 0.073416 0.544008 -0.000374 -0.707107 -0.000000
	-0.043188 -0.456157 0.494156 -0.906822 0.087686 -0.339129
	-0.520527 0.070208 0.567278 -0.000374 -0.707079 -0.000000
	-0.378958 -0.325994 0.370943 -0.878231 0.076169 -0.447886
	-0.487123 0.073436 -0.586040 -0.000374 -0.707079 -0.000000
	-0.217065 -0.322250 -0.496724 0.865705 -0.166269 0.471641
	-0.778079 -0.553342 -0.028594 -0.576453 0.409514 -0.576453
}

frame 17 {
	-0.018897 0.000000 0.100036 0.707107 0.000000 -0.000000
	0.350508 -0.360048 0.023335 -0.475506 0.509659 -0.515876
	0.000000 0.520055 -0.000000 -0.166927 0.002353 -0.006057
	-0.136732 0.038257 0.004402 -0.147660 -0.122270 -0.606186
	-0.000000 0.447469 0.000000 0.286219 0.396976 -0.803813
	0.151140 0.042027 0.014281 -0.073088 0.048160 0.708094
	0.000000 0.437615 0.000000 0.303319 -0.293529 0.866963
	0.162623 0.221463 -0.011451 -0.290527 0.136662 0.531656
	-0.000000 0.501200 -0.000000 0.884233 0.013792 -0.076644
	-0.162016 0.218096 -0.011498 -0.274642 -0.079277 -0.483637
	0.000000 0.492872 -0.000000 0.870084 0.009111 0.111435
	0.142976 0.370391 -0.009384 -0.064849 0.028023 0.292622
	0.000000 0.422763 -0.000000 0.574240 -0.040550 0.131191
	-0.137594 0.373323 -0.014729 -0.040375 0.031667 -0.383616
	0.000000 0.421663 -0.000000 0.526684 0.073496 -0.040496
	0.035670 -0.040818 0.060014 -0.029319 0.076526 -0.996578
	0.000000 0.026025 -0.000000 0.002713 -0.031093 0.001353
	-0.027674 -0.041720 0.059816 0.064028 0.096101 -0.993310
	-0.000000 0.025637 0.000000 0.001931 0.121170 -0.002612
	-0.050906 -0.034136 0.024111 0.048795 0.096116 -0.989237
	0.000000 0.049218 -0.000000 0.064422 0.121342 -0.226910
	0.059788 -0.034178 0.023788 0.044806 -0.098618 0.987326
	-0.000000 0.049218 -0.000000 0.065673 -0.124037 0.222614
	0.032298 -0.054366 -0.002832 0.014051 -0.120951 -0.991956
	-0.000000 0.018247 0.000000 -0.001863 0.105418 0.003626
	-0.026453 -0.054341 -0.002832 0.022323 0.122115 0.990700
	-0.000000 0.018246 -0.000000 -0.001630 -0.103730 -0.003756
	-0.040601 -0.147868 -0.009093 -0.083867 0.236072 0.951085
	0.054250 -0.147982 -0.010669 -0.083973 -0.236037 -0.951008
	0.033352 -0.123882 0.047009 -0.000097 -0.468376 0.883529
	-0.026345 -0.126045 0.043241 -0.000097 -0.468376 0.883529
	0.027713 -0.112639 0.011708 -0.080502 -0.440954 -0.880320
	-0.019122 -0.113116 0.011910 -0.080308 0.440987 0.880387
	0.474748 0.073830 -0.503247 -0.000374 -0.707079 -0.000000
	0.247377 -0.529487 -0.555359 0.000000 0.250468 -0.968125
	-0.176258 0.073435 -0.452059 -0.000374 -0.707079 -0.000000
	-0.075078 -0.463908 -0.593083 -0.339129 0.234470 -0.906822
	0.474767 0.073528 0.227593 -0.000374 -0.707079 -0.000000
	0.243524 -0.529386 0.525743 -0.968125 0.000000 -0.000000
	-0.124422 0.073409 0.509691 -0.000374 -0.707107 -0.000000
	-0.041799 -0.456157 0.494001 -0.906822 0.087686 -0.339129
	-0.520527 0.070204 0.543990 -0.000374 -0.707079 -0.000000
	-0.381782 -0.325957 0.363541 -0.878231 0.076169 -0.447886
	-0.487005 0.073423 -0.614959 -0.000374 -0.707079 -0.000000
	-0.228766 -0.332167 -0.500297 0.865705 -0.166269 0.471641
	-0.776563 -0.553722 -0.037665 -0.576453 0.409514 -0.576453
}

frame 18 {
	-0.018897 0.000000 0.100036 0.707107 0.000000 -0.000000
	0.351074 -0.355204 0.023059 -0.476903 0.502912 -0.515260
	-0.000000 0.520055 0.000000 -0.168810 0.005983 -0.026028
	-0.136732 0.038256 0.004402 -0.146050 -0.121320 -0.613209
	0.000000 0.447469 -0.000000 0.280884 0.411544 -0.791561
	0.151140 0.042027 0.014281 -0.230091 0.236171 0.600335
	0.000000 0.437615 -0.000000 0.299814 -0.270954 0.876586
	0.162623 0.221462 -0.011451 -0.301293 0.139348 0.495751
	-0.000000 0.501200 0.000000 0.894839 0.012973 -0.078798
	-0.162016 0.218096 -0.011498 -0.272515 -0.091958 -0.485572
	0.000000 0.492872 0.000000 0.863448 0.003235 0.099528
	0.142976 0.370391 -0.009384 -0.082498 0.029171 0.269035
	-0.000000 0.422763 0.000000 0.597400 -0.039885 0.135758
	-0.137594 0.373323 -0.014729 -0.022813 0.033575 -0.396133
	-0.000000 0.421663 0.000000 0.491982 0.070546 -0.044502
	0.035670 -0.040818 0.060015 0.024712 -0.064328 0.997621
	-0.000000 0.026025 0.000000 0.003039 -0.032270 0.001424
	-0.027674 -0.041720 0.059816 0.059209 0.075971 -0.995301
	0.000000 0.025637 0.000000 0.001845 0.121263 -0.002587
	-0.050906 -0.034136 0.024111 -0.062681 -0.144237 0.987516
	-0.000000 0.049217 0.000000 0.001222 0.127189 -0.004161
	0.059788 -0.034178 0.023788 -0.061331 0.145911 -0.987395
	-0.000000 0.049218 -0.000000 0.001242 -0.128400 0.004156
	0.032298 -0.054366 -0.002832 0.010553 -0.090815 -0.995603
	0.000000 0.018247 -0.000000 -0.001112 0.105563 0.003422
	-0.026453 -0.054341 -0.002832 0.017740 0.091776 0.994868
	0.000000 0.018246 0.000000 -0.000922 -0.104102 -0.003389
	-0.045942 -0.151358 -0.010792 -0.083867 0.236072 0.951085
	0.057025 -0.151444 -0.011701 -0.083973 -0.236037 -0.951008
	0.035620 -0.123173 0.049075 -0.000097 -0.468376 0.883529
	-0.028351 -0.124406 0.046904 -0.000097 -0.468376 0.883529
	0.029470 -0.114177 0.008251 -0.080502 -0.440954 -0.880320
	-0.021286 -0.114442 0.008368 -0.080308 0.440987 0.880387
	0.474749 0.073849 -0.538992 -0.000374 -0.707079 -0.000000
	0.247377 -0.529487 -0.555359 0.000000 0.250468 -0.968125
	-0.173409 0.073429 -0.488323 -0.000374 -0.707079 -0.000000
	-0.089712 -0.463362 -0.586537 -0.339129 0.234470 -0.906822
	0.474773 -0.021067 0.430463 -0.000374 -0.707079 -0.000000
	0.247101 -0.529426 0.538354 -0.968125 0.000000 -0.000000
	-0.124796 0.073406 0.475254 -0.000374 -0.707107 -0.000000
	-0.066962 -0.456157 0.496798 -0.906822 0.087686 -0.339129
	-0.520527 0.070200 0.520284 -0.000374 -0.707079 -0.000000
	-0.384102 -0.325927 0.357460 -0.878231 0.076169 -0.447886
	-0.486899 0.073413 -0.644298 -0.000374 -0.707079 -0.000000
	-0.241424 -0.340763 -0.502398 0.865705 -0.166269 0.471641
	-0.775342 -0.554028 -0.044964 -0.576453 0.409514 -0.576453
}

frame 19 {
	-0.018897 0.000000 0.100036 0.707107 0.000000 -0.000000
	0.351966 -0.356411 0.006186 -0.483399 0.501418 -0.509307
	-0.000000 0.520055 0.000000 -0.168123 0.006506 -0.028927
	-0.136732 0.038257 0.004402 -0.148304 -0.124237 -0.619779
	-0.000000 0.447469 0.000000 0.277120 0.420322 -0.783538
	0.151140 0.042027 0.014281 -0.204257 0.196999 0.615973
	-0.000000 0.437615 -0.000000 0.269458 -0.421930 0.775500
	0.162623 0.221462 -0.011451 -0.294684 0.138469 0.447533
	0.000000 0.501200 0.000000 0.898340 0.013976 -0.076558
	-0.162016 0.218096 -0.011498 -0.273579 -0.105497 -0.481112
	0.000000 0.492872 0.000000 0.859421 -0.002502 0.086787
	0.142976 0.370391 -0.009384 -0.081421 0.023621 0.257520
	0.000000 0.422763 -0.000000 0.602840 -0.042433 0.130152
	-0.137594 0.373323 -0.014729 -0.014541 0.030254 -0.402977
	0.000000 0.421663 0.000000 0.469453 0.066304 -0.051718
	0.035670 -0.040818 0.060015 0.021143 -0.055312 0.998174
	-0.000000 0.026025 -0.000000 0.002942 -0.033184 0.001305
	-0.027674 -0.041720 0.059816 0.055360 0.060017 -0.996495
	-0.000000 0.025637 -0.000000 0.002050 0.121378 -0.002968
	-0.050906 -0.034136 0.024111 0.060278 0.145121 -0.987548
	-0.000000 0.049218 -0.000000 0.001250 0.128850 -0.004155
	0.059788 -0.034178 0.023788 0.060002 -0.145347 0.987522
	-0.000000 0.049218 -0.000000 0.001253 -0.129031 0.004154
	0.032298 -0.054366 -0.002832 0.007932 -0.068771 -0.997552
	0.000000 0.018246 0.000000 -0.000424 0.105688 0.003144
	-0.026453 -0.054341 -0.002832 0.014260 0.069357 0.997152
	-0.000000 0.018247 -0.000000 -0.000332 -0.104403 -0.003053
	-0.049950 -0.153976 -0.012068 -0.083867 0.236072 0.951085
	0.059108 -0.154042 -0.012475 -0.083973 -0.236037 -0.951008
	0.037321 -0.122640 0.050626 -0.000097 -0.468376 0.883529
	-0.029856 -0.123176 0.049653 -0.000097 -0.468376 0.883529
	0.030788 -0.115331 0.005657 -0.080502 -0.440954 -0.880320
	-0.022911 -0.115436 0.005709 -0.080308 0.440987 0.880387
	0.474751 0.073857 -0.575268 -0.000374 -0.707079 -0.000000
	0.247377 -0.529487 -0.555359 0.000000 0.250468 -0.968125
	-0.170443 0.073421 -0.524870 -0.000374 -0.707079 -0.000000
	-0.101726 -0.462914 -0.581163 -0.339129 0.234470 -0.906822
	0.474758 0.001712 0.668678 -0.000374 -0.707079 -0.000000
	0.250037 -0.529459 0.547814 -0.968125 0.000000 -0.000000
	-0.124478 0.073405 0.440778 -0.000374 -0.707107 -0.000000
	-0.132774 -0.456160 0.504112 -0.906822 0.087686 -0.339129
	-0.520527 0.070196 0.496313 -0.000374 -0.707079 -0.000000
	-0.385805 -0.325905 0.352996 -0.878231 0.076169 -0.447886
	-0.486809 0.073408 -0.673967 -0.000374 -0.707079 -0.000000
	-0.254158 -0.345038 -0.504371 0.865705 -0.166269 0.471641
	-0.774457 -0.554250 -0.050260 -0.576453 0.409514 -0.576453
}

frame 20 {
	-0.018897 0.000000 0.100036 0.707107 0.000000 -0.000000
	0.353108 -0.358984 -0.029471 -0.492550 0.502641 -0.500454
	0.000000 0.520055 -0.000000 -0.167108 0.003836 -0.014230
	-0.136732 0.038256 0.004402 -0.155247 -0.131704 -0.625062
	0.000000 0.447469 -0.000000 0.276076 0.419753 -0.783238
	0.151140 0.042027 0.014281 -0.130504 0.111978 0.652892
	0.000000 0.437615 0.000000 0.230664 -0.541589 0.651656
	0.162623 0.221462 -0.011451 -0.282128 0.133041 0.419343
	-0.000000 0.501200 0.000000 0.896631 0.014440 -0.075137
	-0.162016 0.218096 -0.011498 -0.279611 -0.119518 -0.469353
	-0.000000 0.492872 -0.000000 0.860537 -0.007827 0.074726
	0.142976 0.370391 -0.009384 -0.070504 0.014196 0.261089
	-0.000000 0.422763 -0.000000 0.594207 -0.047336 0.117282
	-0.137594 0.373323 -0.014729 -0.018939 0.019982 -0.402079
	0.000000 0.421663 0.000000 0.469275 0.060284 -0.062733
	0.035670 -0.040818 0.060014 0.018923 -0.049741 0.998420
	-0.000000 0.026025 -0.000000 0.002876 -0.033754 0.001228
	-0.027674 -0.041720 0.059816 0.052927 0.050114 -0.997068
	-0.000000 0.025637 0.000000 0.001992 0.121469 -0.002950
	-0.050906 -0.034136 0.024111 0.058856 0.145619 -0.987440
	-0.000000 0.049217 -0.000000 0.001267 0.129828 -0.004152
	0.059788 -0.034178 0.023788 0.059225 -0.145010 0.987563
	0.000000 0.049218 0.000000 0.001259 -0.129404 0.004153
	0.032298 -0.054366 -0.002832 0.006316 -0.055606 -0.998427
	0.000000 0.018246 0.000000 0.000036 0.105770 0.003075
	-0.026453 -0.054341 -0.002832 0.012127 0.055882 0.998201
	0.000000 0.018247 0.000000 0.000053 -0.104595 -0.003118
	-0.052394 -0.155574 -0.012846 -0.083867 0.236072 0.951085
	0.060378 -0.155626 -0.012948 -0.083973 -0.236037 -0.951008
	0.038359 -0.122315 0.051572 -0.000097 -0.468376 0.883529
	-0.030775 -0.122426 0.051330 -0.000097 -0.468376 0.883529
	0.031592 -0.116035 0.004074 -0.080502 -0.440954 -0.880320
	-0.023901 -0.116043 0.004088 -0.080308 0.440987 0.880387
	0.474753 0.073851 -0.611777 -0.000374 -0.707079 -0.000000
	0.247377 -0.529487 -0.555359 0.000000 0.250468 -0.968125
	-0.167443 0.073414 -0.561590 -0.000374 -0.707079 -0.000000
	-0.109358 -0.462629 -0.577749 -0.339129 0.234470 -0.906822
	0.474766 0.050636 0.789736 -0.000374 -0.707079 -0.000000
	0.251903 -0.529480 0.553457 -0.968125 0.000000 -0.000000
	-0.123213 0.073407 0.406379 -0.000374 -0.707107 -0.000000
	-0.198602 -0.456160 0.511426 -0.906822 0.087686 -0.339129
	-0.520526 0.070192 0.472187 -0.000374 -0.707079 -0.000000
	-0.386834 -0.325891 0.350299 -0.878231 0.076169 -0.447886
	-0.486736 0.073406 -0.703858 -0.000374 -0.707079 -0.000000
	-0.266017 -0.343810 -0.507404 0.865705 -0.166269 0.471641
	-0.773925 -0.554384 -0.053443 -0.576453 0.409514 -0.576453
}

