MD5Version 10
commandline ""

numFrames 21
numJoints 46
frameRate 60
numAnimatedComponents 276

hierarchy {
	"origin"	-1 63 0	//
	"chest"	0 63 6	// origin
	"tail"	1 63 12	// chest
	"leg0_upper"	1 63 18	// chest
	"leg0_lower"	3 63 24	// leg0_upper
	"leg5_upper"	1 63 30	// chest
	"leg5_lower"	5 63 36	// leg5_upper
	"leg4_upper"	1 63 42	// chest
	"leg4_lower"	7 63 48	// leg4_upper
	"leg1_upper"	1 63 54	// chest
	"leg1_lower"	9 63 60	// leg1_upper
	"leg3_upper"	1 63 66	// chest
	"leg3_lower"	11 63 72	// leg3_upper
	"leg2_upper"	1 63 78	// chest
	"leg2_lower"	13 63 84	// leg2_upper
	"antenna_upper_left0"	1 63 90	// chest
	"antenna_upper_left1"	15 63 96	// antenna_upper_left0
	"antenna_upper_right0"	1 63 102	// chest
	"antenna_upper_right1"	17 63 108	// antenna_upper_right0
	"antenna_right0"	1 63 114	// chest
	"antenna_right1"	19 63 120	// antenna_right0
	"antenna_left0"	1 63 126	// chest
	"antenna_left1"	21 63 132	// antenna_left0
	"antenna_lower_left0"	1 63 138	// chest
	"antenna_lower_left1"	23 63 144	// antenna_lower_left0
	"antenna_lower_right0"	1 63 150	// chest
	"antenna_lower_right1"	25 63 156	// antenna_lower_right0
	"IKantenna_right"	1 63 162	// chest
	"IKantenna_left"	1 63 168	// chest
	"IKantenna_upper_left"	1 63 174	// chest
	"IKantenna_upper_right"	1 63 180	// chest
	"IKantenna_lower_left"	1 63 186	// chest
	"IKantenna_lower_right"	1 63 192	// chest
	"IKleg0"	0 63 198	// origin
	"IKleg0_upper"	0 63 204	// origin
	"IKleg1"	0 63 210	// origin
	"IKleg1_upper"	0 63 216	// origin
	"IKleg5"	0 63 222	// origin
	"IKleg5_upper"	0 63 228	// origin
	"IKleg4"	0 63 234	// origin
	"IKleg4_upper"	0 63 240	// origin
	"IKleg3"	0 63 246	// origin
	"IKleg3_upper"	0 63 252	// origin
	"IKleg2"	0 63 258	// origin
	"IKIKleg2_upper"	0 63 264	// origin
	"IKtail"	0 63 270	// origin
}

bounds {
	( 0.000000 0.000000 0.000000 ) ( 0.000000 0.000000 0.000000 )
	( 0.000000 0.000000 0.000000 ) ( 0.000000 0.000000 0.000000 )
	( 0.000000 0.000000 0.000000 ) ( 0.000000 0.000000 0.000000 )
	( 0.000000 0.000000 0.000000 ) ( 0.000000 0.000000 0.000000 )
	( 0.000000 0.000000 0.000000 ) ( 0.000000 0.000000 0.000000 )
	( 0.000000 0.000000 0.000000 ) ( 0.000000 0.000000 0.000000 )
	( 0.000000 0.000000 0.000000 ) ( 0.000000 0.000000 0.000000 )
	( 0.000000 0.000000 0.000000 ) ( 0.000000 0.000000 0.000000 )
	( 0.000000 0.000000 0.000000 ) ( 0.000000 0.000000 0.000000 )
	( 0.000000 0.000000 0.000000 ) ( 0.000000 0.000000 0.000000 )
	( 0.000000 0.000000 0.000000 ) ( 0.000000 0.000000 0.000000 )
	( 0.000000 0.000000 0.000000 ) ( 0.000000 0.000000 0.000000 )
	( 0.000000 0.000000 0.000000 ) ( 0.000000 0.000000 0.000000 )
	( 0.000000 0.000000 0.000000 ) ( 0.000000 0.000000 0.000000 )
	( 0.000000 0.000000 0.000000 ) ( 0.000000 0.000000 0.000000 )
	( 0.000000 0.000000 0.000000 ) ( 0.000000 0.000000 0.000000 )
	( 0.000000 0.000000 0.000000 ) ( 0.000000 0.000000 0.000000 )
	( 0.000000 0.000000 0.000000 ) ( 0.000000 0.000000 0.000000 )
	( 0.000000 0.000000 0.000000 ) ( 0.000000 0.000000 0.000000 )
	( 0.000000 0.000000 0.000000 ) ( 0.000000 0.000000 0.000000 )
	( 0.000000 0.000000 0.000000 ) ( 0.000000 0.000000 0.000000 )
}

baseframe {
	( -0.018897 0.000000 0.100036 ) ( -0.707107 -0.000000 0.000000 )
	( 0.353578 -0.360185 -0.046103 ) ( 0.496413 -0.503564 0.496625 )
	( 0.000000 0.520055 -0.000000 ) ( 0.167556 0.005161 -0.035372 )
	( -0.136732 0.038257 0.004402 ) ( 0.263384 0.066311 0.719496 )
	( 0.000000 0.447469 -0.000000 ) ( -0.343981 -0.423618 0.813538 )
	( 0.151140 0.042027 0.014281 ) ( 0.099980 -0.096236 -0.843682 )
	( -0.000000 0.437615 -0.000000 ) ( -0.209160 0.454421 -0.698143 )
	( 0.162623 0.221463 -0.011451 ) ( 0.265283 -0.130022 -0.494847 )
	( -0.000000 0.501200 -0.000000 ) ( -0.843688 -0.014369 0.072537 )
	( -0.162016 0.218096 -0.011498 ) ( 0.201669 0.179367 0.565490 )
	( 0.000000 0.492872 -0.000000 ) ( -0.840228 0.130773 0.073236 )
	( 0.142976 0.370391 -0.009384 ) ( 0.004689 0.112402 -0.327640 )
	( -0.000000 0.422763 -0.000000 ) ( -0.425178 0.124416 0.018903 )
	( -0.137594 0.373323 -0.014729 ) ( 0.106632 0.002559 0.361731 )
	( -0.000000 0.421663 0.000000 ) ( -0.706199 -0.057147 0.079964 )
	( 0.035670 -0.040818 0.060014 ) ( -0.018182 0.047886 -0.998486 )
	( 0.000000 0.026025 0.000000 ) ( -0.002853 0.033945 -0.001202 )
	( -0.027674 -0.041720 0.059816 ) ( -0.052106 -0.046785 0.997231 )
	( 0.000000 0.025637 -0.000000 ) ( -0.001972 -0.121503 0.002943 )
	( -0.050906 -0.034136 0.024111 ) ( -0.058393 -0.145779 0.987384 )
	( 0.000000 0.049218 0.000000 ) ( -0.001273 -0.130147 0.004151 )
	( 0.059788 -0.034178 0.023788 ) ( -0.058968 0.144899 -0.987571 )
	( -0.000000 0.049218 -0.000000 ) ( -0.001261 0.129525 -0.004153 )
	( 0.032298 -0.054366 -0.002832 ) ( -0.005733 0.051283 0.998667 )
	( -0.000000 0.018246 0.000000 ) ( -0.000223 -0.105798 -0.003347 )
	( -0.026453 -0.054341 -0.002832 ) ( -0.011414 -0.051461 -0.998493 )
	( 0.000000 0.018246 -0.000000 ) ( -0.000219 0.104659 0.003397 )
	( -0.053205 -0.156103 -0.013104 ) ( 0.083867 -0.236072 -0.951085 )
	( 0.060800 -0.156152 -0.013104 ) ( 0.083973 0.236037 0.951008 )
	( 0.038704 -0.122207 0.051886 ) ( -0.000097 -0.468376 0.883529 )
	( -0.031079 -0.122177 0.051886 ) ( -0.000097 -0.468376 0.883529 )
	( 0.031859 -0.116268 0.003549 ) ( 0.080502 0.440954 0.880320 )
	( -0.024230 -0.116244 0.003550 ) ( 0.080308 -0.440987 -0.880387 )
	( 0.224721 0.079790 -0.503450 ) ( 0.000374 0.707079 0.000000 )
	( 0.424139 -0.529487 -0.578595 ) ( -0.000000 -0.250468 0.968125 )
	( 0.221105 0.063787 -0.735435 ) ( 0.000374 0.707079 0.000000 )
	( -0.169644 -0.744542 -0.518543 ) ( 0.339129 -0.234470 0.906822 )
	( 0.835723 0.075110 0.441854 ) ( 0.000374 0.707079 0.000000 )
	( 0.489857 -0.529487 0.531277 ) ( 0.968125 -0.000000 0.000000 )
	( -0.160859 0.073580 0.544356 ) ( 0.000374 0.707107 0.000000 )
	( -0.163415 -0.456157 0.611538 ) ( 0.906822 -0.087686 0.339129 )
	( -0.674134 0.073399 0.422616 ) ( 0.000374 0.707079 0.000000 )
	( -0.145801 -0.330299 0.363617 ) ( 0.878231 -0.076169 0.447886 )
	( -0.400468 0.081357 -0.516368 ) ( 0.000374 0.707079 0.000000 )
	( -0.164324 -0.328145 -0.363843 ) ( -0.865705 0.166269 -0.471641 )
	( -0.768131 -0.554428 -0.001125 ) ( 0.576453 -0.409514 0.576453 )
}

frame 0 {
	-0.018897 0.000000 0.100036 0.707107 0.000000 -0.000000
	0.353578 -0.360185 -0.046103 -0.496413 0.503564 -0.496625
	0.000000 0.520055 -0.000000 -0.167556 -0.005161 0.035372
	-0.136732 0.038257 0.004402 -0.263384 -0.066311 -0.719496
	0.000000 0.447469 -0.000000 0.343981 0.423618 -0.813538
	0.151140 0.042027 0.014281 -0.099980 0.096236 0.843682
	-0.000000 0.437615 -0.000000 0.209160 -0.454421 0.698143
	0.162623 0.221463 -0.011451 -0.265283 0.130022 0.494847
	-0.000000 0.501200 -0.000000 0.843688 0.014369 -0.072537
	-0.162016 0.218096 -0.011498 -0.201669 -0.179367 -0.565490
	0.000000 0.492872 -0.000000 0.840228 -0.130773 -0.073236
	0.142976 0.370391 -0.009384 -0.004689 -0.112402 0.327640
	-0.000000 0.422763 -0.000000 0.425178 -0.124416 -0.018903
	-0.137594 0.373323 -0.014729 -0.106632 -0.002559 -0.361731
	-0.000000 0.421663 0.000000 0.706199 0.057147 -0.079964
	0.035670 -0.040818 0.060014 0.018182 -0.047886 0.998486
	0.000000 0.026025 0.000000 0.002853 -0.033945 0.001202
	-0.027674 -0.041720 0.059816 0.052106 0.046785 -0.997231
	0.000000 0.025637 -0.000000 0.001972 0.121503 -0.002943
	-0.050906 -0.034136 0.024111 0.058393 0.145779 -0.987384
	0.000000 0.049218 0.000000 0.001273 0.130147 -0.004151
	0.059788 -0.034178 0.023788 0.058968 -0.144899 0.987571
	-0.000000 0.049218 -0.000000 0.001261 -0.129525 0.004153
	0.032298 -0.054366 -0.002832 0.005733 -0.051283 -0.998667
	-0.000000 0.018246 0.000000 0.000223 0.105798 0.003347
	-0.026453 -0.054341 -0.002832 0.011414 0.051461 0.998493
	0.000000 0.018246 -0.000000 0.000219 -0.104659 -0.003397
	-0.053205 -0.156103 -0.013104 -0.083867 0.236072 0.951085
	0.060800 -0.156152 -0.013104 -0.083973 -0.236037 -0.951008
	0.038704 -0.122207 0.051886 -0.000097 -0.468376 0.883529
	-0.031079 -0.122177 0.051886 -0.000097 -0.468376 0.883529
	0.031859 -0.116268 0.003549 -0.080502 -0.440954 -0.880320
	-0.024230 -0.116244 0.003550 -0.080308 0.440987 0.880387
	0.224721 0.079790 -0.503450 -0.000374 -0.707079 -0.000000
	0.424139 -0.529487 -0.578595 0.000000 0.250468 -0.968125
	0.221105 0.063787 -0.735435 -0.000374 -0.707079 -0.000000
	-0.169644 -0.744542 -0.518543 -0.339129 0.234470 -0.906822
	0.835723 0.075110 0.441854 -0.000374 -0.707079 -0.000000
	0.489857 -0.529487 0.531277 -0.968125 0.000000 -0.000000
	-0.160859 0.073580 0.544356 -0.000374 -0.707107 -0.000000
	-0.163415 -0.456157 0.611538 -0.906822 0.087686 -0.339129
	-0.674134 0.073399 0.422616 -0.000374 -0.707079 -0.000000
	-0.145801 -0.330299 0.363617 -0.878231 0.076169 -0.447886
	-0.400468 0.081357 -0.516368 -0.000374 -0.707079 -0.000000
	-0.164324 -0.328145 -0.363843 0.865705 -0.166269 0.471641
	-0.768131 -0.554428 -0.001125 -0.576453 0.409514 -0.576453
}

frame 1 {
	-0.018897 0.000000 0.100036 0.707107 0.000000 -0.000000
	0.350653 -0.372595 -0.039994 -0.487688 0.507390 -0.496026
	0.000000 0.520055 0.000000 -0.175638 -0.004637 0.032646
	-0.136732 0.038257 0.004402 -0.290889 -0.158911 -0.706055
	0.000000 0.447469 0.000000 0.337810 0.353006 -0.848211
	0.151140 0.042027 0.014281 -0.106195 0.090233 0.847213
	0.000000 0.437615 -0.000000 0.215316 -0.458182 0.702152
	0.162623 0.221462 -0.011451 -0.268563 0.120954 0.494844
	-0.000000 0.501200 0.000000 0.836439 0.010583 -0.081375
	-0.162016 0.218096 -0.011498 -0.199796 -0.170351 -0.554633
	0.000000 0.492872 -0.000000 0.837477 -0.116688 -0.061517
	0.142975 0.370391 -0.009384 -0.069846 -0.080805 0.347314
	0.000000 0.422763 0.000000 0.520452 -0.118102 -0.014338
	-0.137594 0.373323 -0.014729 -0.097536 0.010014 -0.350402
	-0.000000 0.421663 -0.000000 0.675520 0.064476 -0.061019
	0.035670 -0.040818 0.060015 0.019771 -0.054651 0.998181
	-0.000000 0.026025 -0.000000 0.002942 -0.033604 0.001254
	-0.027674 -0.041720 0.059816 0.053458 0.052842 -0.996921
	0.000000 0.025637 -0.000000 0.002006 0.121489 -0.002948
	-0.050906 -0.034136 0.024111 0.058953 0.146159 -0.987362
	0.000000 0.049218 0.000000 0.001270 0.129906 -0.004158
	0.059788 -0.034178 0.023788 0.059403 -0.145659 0.987469
	-0.000000 0.049218 0.000000 0.001263 -0.129460 0.004160
	0.032298 -0.054366 -0.002832 0.006535 -0.058144 -0.998277
	0.000000 0.018246 0.000000 -0.000047 0.105781 0.003142
	-0.026453 -0.054341 -0.002832 0.012791 0.058636 0.997993
	-0.000000 0.018247 -0.000000 -0.000023 -0.104514 -0.003215
	-0.052275 -0.155652 -0.013007 -0.083867 0.236072 0.951085
	0.060127 -0.155553 -0.013084 -0.083973 -0.236037 -0.951008
	0.038013 -0.122306 0.050761 -0.000097 -0.468376 0.883529
	-0.030597 -0.122650 0.050866 -0.000097 -0.468376 0.883529
	0.031465 -0.116179 0.004415 -0.080502 -0.440954 -0.880320
	-0.023609 -0.116164 0.004449 -0.080308 0.440987 0.880387
	0.330641 0.013927 -0.479196 -0.000374 -0.707079 -0.000000
	0.424139 -0.529487 -0.578595 0.000000 0.250468 -0.968125
	0.186804 0.063924 -0.735445 -0.000374 -0.707079 -0.000000
	-0.169644 -0.744542 -0.518543 -0.339129 0.234470 -0.906822
	0.817447 0.075246 0.441422 -0.000374 -0.707079 -0.000000
	0.492342 -0.529487 0.531277 -0.968125 0.000000 -0.000000
	-0.186624 0.073594 0.544356 -0.000374 -0.707107 -0.000000
	-0.161288 -0.456157 0.610120 -0.906822 0.087686 -0.339129
	-0.632812 0.046688 0.422601 -0.000374 -0.707079 -0.000000
	-0.145801 -0.330299 0.363617 -0.878231 0.076169 -0.447886
	-0.440268 0.081433 -0.516371 -0.000374 -0.707079 -0.000000
	-0.163786 -0.328145 -0.363753 0.865705 -0.166269 0.471641
	-0.767664 -0.554428 -0.004395 -0.576453 0.409514 -0.576453
}

frame 2 {
	-0.018897 0.000000 0.100036 0.707107 0.000000 -0.000000
	0.344394 -0.399145 -0.025534 -0.467190 0.516175 -0.495638
	-0.000000 0.520055 -0.000000 -0.193262 -0.003438 0.026394
	-0.136732 0.038257 0.004402 -0.241326 -0.282116 -0.668346
	0.000000 0.447469 -0.000000 0.288048 0.267700 -0.876372
	0.151140 0.042027 0.014281 -0.117572 0.074780 0.858600
	0.000000 0.437615 0.000000 0.226625 -0.468311 0.706220
	0.162623 0.221463 -0.011451 -0.275761 0.108866 0.499123
	-0.000000 0.501200 0.000000 0.825549 0.004835 -0.094745
	-0.162016 0.218096 -0.011498 -0.188244 -0.150008 -0.541920
	-0.000000 0.492872 -0.000000 0.826978 -0.096089 -0.042425
	0.142976 0.370391 -0.009384 -0.208239 -0.004451 0.393013
	-0.000000 0.422763 -0.000000 0.700949 -0.096563 0.004128
	-0.137594 0.373323 -0.014729 -0.080457 0.025975 -0.330307
	0.000000 0.421663 0.000000 0.628819 0.074747 -0.037459
	0.035670 -0.040818 0.060015 0.024478 -0.075052 0.996871
	0.000000 0.026025 -0.000000 0.002757 -0.032600 0.001212
	-0.027674 -0.041720 0.059816 0.057398 0.070755 -0.995738
	-0.000000 0.025637 0.000000 0.001815 0.121478 -0.002556
	-0.050906 -0.034136 0.024111 0.060664 0.147307 -0.987212
	-0.000000 0.049218 -0.000000 0.001264 0.129171 -0.004179
	0.059788 -0.034178 0.023788 0.060743 -0.147989 0.987110
	-0.000000 0.049218 -0.000000 0.001266 -0.129262 0.004181
	0.032298 -0.054366 -0.002832 0.008718 -0.078777 -0.996761
	-0.000000 0.018246 -0.000000 -0.000711 0.105739 0.003259
	-0.026453 -0.054341 -0.002832 0.016862 0.080239 0.996035
	-0.000000 0.018247 0.000000 -0.000589 -0.104093 -0.003287
	-0.049475 -0.154295 -0.012718 -0.083867 0.236072 0.951085
	0.058102 -0.153751 -0.013023 -0.083973 -0.236037 -0.951008
	0.035934 -0.122603 0.047378 -0.000097 -0.468376 0.883529
	-0.029147 -0.124074 0.047795 -0.000097 -0.468376 0.883529
	0.030281 -0.115908 0.007018 -0.080502 -0.440954 -0.880320
	-0.021741 -0.115921 0.007154 -0.080308 0.440987 0.880387
	0.585253 -0.126326 -0.427327 -0.000374 -0.707079 -0.000000
	0.424139 -0.529487 -0.578595 0.000000 0.250468 -0.968125
	0.145353 0.064290 -0.735507 -0.000374 -0.707079 -0.000000
	-0.169644 -0.744542 -0.518543 -0.339129 0.234470 -0.906822
	0.784949 0.075642 0.440121 -0.000374 -0.707079 -0.000000
	0.499822 -0.529487 0.531277 -0.968125 0.000000 -0.000000
	-0.222525 0.073611 0.544356 -0.000374 -0.707107 -0.000000
	-0.154888 -0.456157 0.605853 -0.906822 0.087686 -0.339129
	-0.510777 -0.021481 0.422565 -0.000374 -0.707079 -0.000000
	-0.145801 -0.330299 0.363617 -0.878231 0.076169 -0.447886
	-0.484191 0.081620 -0.516371 -0.000374 -0.707079 -0.000000
	-0.162159 -0.328145 -0.363482 0.865705 -0.166269 0.471641
	-0.766258 -0.554428 -0.014236 -0.576453 0.409514 -0.576453
}

frame 3 {
	-0.018897 0.000000 0.100036 0.707107 0.000000 -0.000000
	0.341468 -0.411553 -0.015143 -0.453212 0.522230 -0.498169
	0.000000 0.520055 -0.000000 -0.203425 -0.002168 0.019597
	-0.136732 0.038256 0.004402 -0.128032 -0.234502 -0.724499
	0.000000 0.447469 0.000000 0.235262 0.287532 -0.832596
	0.151140 0.042027 0.014281 -0.139731 0.076202 0.864347
	0.000000 0.437616 0.000000 0.242300 -0.465272 0.723373
	0.162623 0.221462 -0.011451 -0.280643 0.094100 0.501968
	-0.000000 0.501200 0.000000 0.809915 -0.001681 -0.109327
	-0.162016 0.218096 -0.011498 -0.188707 -0.138582 -0.520137
	0.000000 0.492872 -0.000000 0.820002 -0.078883 -0.024790
	0.142975 0.370391 -0.009384 -0.300372 0.088251 0.438849
	-0.000000 0.422763 0.000000 0.829100 -0.065633 0.063769
	-0.137594 0.373323 -0.014729 -0.063692 0.040286 -0.306963
	-0.000000 0.421663 -0.000000 0.579705 0.082871 -0.021741
	0.035670 -0.040818 0.060015 -0.031766 0.107177 -0.993628
	-0.000000 0.026025 -0.000000 0.003098 -0.031064 0.001414
	-0.027674 -0.041720 0.059816 0.063319 0.098102 -0.993157
	-0.000000 0.025637 0.000000 0.001921 0.121545 -0.002562
	-0.050906 -0.034136 0.024111 -0.063540 -0.149278 0.986671
	0.000000 0.049217 0.000000 0.001123 0.127944 -0.003776
	0.059788 -0.034178 0.023788 -0.063011 0.151973 -0.986336
	0.000000 0.049218 -0.000000 0.001140 -0.128930 0.003779
	0.032298 -0.054366 -0.002832 0.012136 -0.112142 -0.993216
	0.000000 0.018247 0.000000 -0.001548 0.105705 0.003422
	-0.026453 -0.054341 -0.002832 0.023200 0.114993 0.991465
	-0.000000 0.018246 -0.000000 -0.001359 -0.103476 -0.003698
	-0.044924 -0.152088 -0.012247 -0.083867 0.236072 0.951085
	0.054811 -0.150821 -0.012925 -0.083973 -0.236037 -0.951008
	0.032554 -0.123086 0.041876 -0.000097 -0.468376 0.883529
	-0.026789 -0.126388 0.042801 -0.000097 -0.468376 0.883529
	0.028355 -0.115468 0.011251 -0.080502 -0.440954 -0.880320
	-0.018703 -0.115525 0.011552 -0.080308 0.440987 0.880387
	0.789908 -0.191861 -0.403084 -0.000374 -0.707079 -0.000000
	0.424139 -0.529487 -0.578595 0.000000 0.250468 -0.968125
	0.096399 0.064866 -0.735675 -0.000374 -0.707079 -0.000000
	-0.169644 -0.744542 -0.518543 -0.339129 0.234470 -0.906822
	0.737231 0.076288 0.437988 -0.000374 -0.707079 -0.000000
	0.511983 -0.529487 0.531277 -0.968125 0.000000 -0.000000
	-0.271441 0.073632 0.544356 -0.000374 -0.707107 -0.000000
	-0.144481 -0.456158 0.598915 -0.906822 0.087686 -0.339129
	-0.337428 -0.073214 0.422538 -0.000374 -0.707079 -0.000000
	-0.145801 -0.330299 0.363617 -0.878231 0.076169 -0.447886
	-0.528375 0.081901 -0.516371 -0.000374 -0.707079 -0.000000
	-0.159452 -0.328145 -0.363031 0.865705 -0.166269 0.471641
	-0.763972 -0.554428 -0.030237 -0.576453 0.409514 -0.576453
}

frame 4 {
	-0.018897 0.000000 0.100036 0.707107 0.000000 -0.000000
	0.342132 -0.411553 -0.010330 -0.445964 0.526347 -0.503310
	0.000000 0.520055 0.000000 -0.206161 -0.001331 0.015044
	-0.136733 0.038257 0.004402 -0.051458 -0.150539 -0.784068
	-0.000000 0.447469 -0.000000 0.201679 0.353440 -0.755959
	0.151140 0.042027 0.014281 -0.169157 0.090294 0.865095
	-0.000000 0.437615 -0.000000 0.260948 -0.451113 0.749134
	0.162623 0.221463 -0.011451 -0.278311 0.074537 0.503104
	0.000000 0.501200 0.000000 0.785588 -0.009221 -0.124121
	-0.162016 0.218096 -0.011498 -0.198544 -0.134468 -0.489950
	-0.000000 0.492872 -0.000000 0.815824 -0.064522 -0.008670
	0.142976 0.370391 -0.009384 -0.295216 0.175758 0.477386
	0.000000 0.422763 -0.000000 0.876181 -0.035067 0.155086
	-0.137594 0.373323 -0.014729 -0.045684 0.052994 -0.280900
	-0.000000 0.421663 -0.000000 0.529158 0.088871 -0.012148
	0.035670 -0.040818 0.060015 -0.040621 0.147455 -0.987542
	-0.000000 0.026025 -0.000000 0.003022 -0.029266 0.001432
	-0.027674 -0.041720 0.059816 -0.070261 -0.130771 0.988854
	0.000000 0.025637 0.000000 0.002033 0.121756 -0.002570
	-0.050906 -0.034136 0.024111 0.056987 0.124186 -0.989855
	0.000000 0.049218 0.000000 0.039230 0.125030 -0.134916
	0.059788 -0.034178 0.023788 0.046967 -0.108203 0.987721
	-0.000000 0.049218 -0.000000 0.067493 -0.124885 0.224940
	0.032298 -0.054366 -0.002832 0.016396 -0.154870 -0.986692
	0.000000 0.018246 -0.000000 -0.002191 0.105726 0.003332
	-0.026453 -0.054341 -0.002832 0.030924 0.159162 0.983126
	0.000000 0.018247 0.000000 -0.001854 -0.102817 -0.003546
	-0.038970 -0.149201 -0.011631 -0.083867 0.236072 0.951085
	0.050505 -0.146989 -0.012796 -0.083973 -0.236037 -0.951008
	0.028133 -0.123718 0.034680 -0.000097 -0.468376 0.883529
	-0.023705 -0.129415 0.036270 -0.000097 -0.468376 0.883529
	0.025836 -0.114893 0.016788 -0.080502 -0.440954 -0.880320
	-0.014729 -0.115008 0.017305 -0.080308 0.440987 0.880387
	0.916609 -0.154546 -0.416957 -0.000374 -0.707079 -0.000000
	0.424139 -0.529487 -0.578595 0.000000 0.250468 -0.968125
	0.039696 0.065630 -0.736012 -0.000374 -0.707079 -0.000000
	-0.169644 -0.744542 -0.518543 -0.339129 0.234470 -0.906822
	0.674511 0.077149 0.435144 -0.000374 -0.707079 -0.000000
	0.527888 -0.529487 0.531277 -0.968125 0.000000 -0.000000
	-0.335581 0.073655 0.544356 -0.000374 -0.707107 -0.000000
	-0.130870 -0.456158 0.589841 -0.906822 0.087686 -0.339129
	-0.168243 -0.094888 0.422527 -0.000374 -0.707079 -0.000000
	-0.145801 -0.330299 0.363617 -0.878231 0.076169 -0.447886
	-0.571795 0.082238 -0.516369 -0.000374 -0.707079 -0.000000
	-0.155721 -0.328145 -0.362409 0.865705 -0.166269 0.471641
	-0.760983 -0.554428 -0.051164 -0.576453 0.409514 -0.576453
}

frame 5 {
	-0.018897 0.000000 0.100036 0.707107 0.000000 -0.000000
	0.344261 -0.411553 -0.007486 -0.438540 0.531589 -0.509202
	-0.000000 0.520055 0.000000 -0.207234 -0.001084 0.013700
	-0.136732 0.038257 0.004402 0.029460 -0.045758 -0.827598
	-0.000000 0.447469 0.000000 0.166826 0.449976 -0.638407
	0.151140 0.042027 0.014281 -0.198394 0.099430 0.866534
	0.000000 0.437615 0.000000 0.281198 -0.437189 0.772649
	0.162623 0.221463 -0.011451 -0.267370 0.050180 0.502965
	-0.000000 0.501200 0.000000 0.749471 -0.017960 -0.137571
	-0.162016 0.218096 -0.011497 -0.208099 -0.128936 -0.453620
	0.000000 0.492872 -0.000000 0.807705 -0.050087 0.009363
	0.142975 0.370391 -0.009384 -0.228183 0.216567 0.521882
	0.000000 0.422763 -0.000000 0.872232 -0.011959 0.223099
	-0.137594 0.373323 -0.014729 -0.021619 0.064312 -0.248378
	0.000000 0.421663 0.000000 0.468893 0.093662 -0.005754
	0.035670 -0.040818 0.060015 -0.049635 0.189767 -0.978736
	-0.000000 0.026025 -0.000000 0.002920 -0.027552 0.001429
	-0.027674 -0.041720 0.059816 -0.077114 -0.163961 0.983129
	0.000000 0.025637 -0.000000 0.002136 0.122111 -0.002585
	-0.050906 -0.034136 0.024111 0.054136 0.106573 -0.990329
	-0.000000 0.049218 -0.000000 0.067046 0.120510 -0.236470
	0.059788 -0.034178 0.023788 0.041794 -0.091776 0.984795
	0.000000 0.049218 0.000000 0.096838 -0.120375 0.324642
	0.032298 -0.054366 -0.002832 0.020831 -0.200865 -0.977160
	-0.000000 0.018247 0.000000 -0.002728 0.105836 0.003359
	-0.026453 -0.054341 -0.002832 0.038730 0.206001 0.971214
	0.000000 0.018247 -0.000000 -0.002214 -0.102286 -0.003491
	-0.032226 -0.145930 -0.010934 -0.083867 0.236072 0.951085
	0.045628 -0.142648 -0.012650 -0.083973 -0.236037 -0.951008
	0.023124 -0.124433 0.026528 -0.000097 -0.468376 0.883529
	-0.020211 -0.132844 0.028872 -0.000097 -0.468376 0.883529
	0.022983 -0.114242 0.023060 -0.080502 -0.440954 -0.880320
	-0.010228 -0.114423 0.023823 -0.080308 0.440987 0.880387
	1.018413 -0.056707 -0.453260 -0.000374 -0.707079 -0.000000
	0.424139 -0.529487 -0.578595 0.000000 0.250468 -0.968125
	-0.024802 0.066555 -0.736589 -0.000374 -0.707079 -0.000000
	-0.169644 -0.744542 -0.518543 -0.339129 0.234470 -0.906822
	0.599364 0.078157 0.431810 -0.000374 -0.707079 -0.000000
	0.545906 -0.529487 0.531277 -0.968125 0.000000 -0.000000
	-0.411119 0.073675 0.544356 -0.000374 -0.707107 -0.000000
	-0.115451 -0.456158 0.579562 -0.906822 0.087686 -0.339129
	-0.045769 -0.097855 0.422525 -0.000374 -0.707079 -0.000000
	-0.145801 -0.330299 0.363617 -0.878231 0.076169 -0.447886
	-0.613628 0.082575 -0.516368 -0.000374 -0.707079 -0.000000
	-0.151084 -0.328145 -0.361636 0.865705 -0.166269 0.471641
	-0.757596 -0.554428 -0.074870 -0.576453 0.409514 -0.576453
}

frame 6 {
	-0.018897 0.000000 0.100036 0.707107 0.000000 -0.000000
	0.347433 -0.411553 -0.006502 -0.433304 0.535754 -0.513629
	-0.000000 0.520055 0.000000 -0.206729 -0.000368 0.009742
	-0.136732 0.038257 0.004402 0.092055 0.041831 -0.848718
	-0.000000 0.447469 -0.000000 0.136013 0.530330 -0.513767
	0.151140 0.042027 0.014281 -0.224030 0.097918 0.867850
	-0.000000 0.437615 0.000000 0.301170 -0.426800 0.790491
	0.162623 0.221462 -0.011451 -0.250738 0.026553 0.498343
	0.000000 0.501200 0.000000 0.708335 -0.026423 -0.145908
	-0.162016 0.218096 -0.011498 -0.215032 -0.121188 -0.418359
	-0.000000 0.492872 -0.000000 0.793150 -0.036713 0.027331
	0.142975 0.370391 -0.009384 -0.124442 0.181625 0.581404
	0.000000 0.422763 0.000000 0.840907 -0.001731 0.249735
	-0.137594 0.373323 -0.014729 0.009380 0.076780 -0.221304
	-0.000000 0.421663 -0.000000 0.397237 0.097252 0.002278
	0.035670 -0.040818 0.060015 -0.057564 0.228167 -0.968594
	0.000000 0.026025 0.000000 0.002768 -0.026174 0.001391
	-0.027674 -0.041720 0.059816 -0.083022 -0.193299 0.976930
	0.000000 0.025637 0.000000 0.002226 0.122534 -0.002606
	-0.050906 -0.034136 0.024111 0.055385 0.099099 -0.990630
	-0.000000 0.049218 0.000000 0.081378 0.116454 -0.294291
	0.059788 -0.034178 0.023788 0.039487 -0.082592 0.982497
	-0.000000 0.049218 -0.000000 0.116809 -0.116138 0.393503
	0.032298 -0.054366 -0.002832 0.024848 -0.243804 -0.965853
	0.000000 0.018247 0.000000 -0.002684 0.106029 0.002921
	-0.026453 -0.054341 -0.002832 0.045517 0.248666 0.957584
	0.000000 0.018247 -0.000000 -0.002335 -0.101974 -0.003297
	-0.025482 -0.142660 -0.010236 -0.083867 0.236072 0.951085
	0.040750 -0.138306 -0.012503 -0.083973 -0.236037 -0.951008
	0.018116 -0.125149 0.018376 -0.000097 -0.468376 0.883529
	-0.016717 -0.136273 0.021473 -0.000097 -0.468376 0.883529
	0.020129 -0.113590 0.029332 -0.080502 -0.440954 -0.880320
	-0.005726 -0.113837 0.030340 -0.080308 0.440987 0.880387
	1.076597 0.041528 -0.489568 -0.000374 -0.707079 -0.000000
	0.424139 -0.529487 -0.578595 0.000000 0.250468 -0.968125
	-0.096790 0.067611 -0.737485 -0.000374 -0.707079 -0.000000
	-0.169644 -0.744542 -0.518543 -0.339129 0.234470 -0.906822
	0.517717 0.079220 0.428299 -0.000374 -0.707079 -0.000000
	0.563923 -0.529487 0.531277 -0.968125 0.000000 -0.000000
	-0.481560 0.073683 0.544356 -0.000374 -0.707107 -0.000000
	-0.100032 -0.456157 0.569283 -0.906822 0.087686 -0.339129
	0.041603 -0.051350 0.422550 -0.000374 -0.707079 -0.000000
	-0.145801 -0.330299 0.363617 -0.878231 0.076169 -0.447886
	-0.652724 0.082853 -0.516367 -0.000374 -0.707079 -0.000000
	-0.145728 -0.328145 -0.360744 0.865705 -0.166269 0.471641
	-0.754210 -0.554428 -0.098575 -0.576453 0.409514 -0.576453
}

frame 7 {
	-0.018897 0.000000 0.100036 0.707107 0.000000 -0.000000
	0.350731 -0.411553 -0.006389 -0.431612 0.537192 -0.515113
	0.000000 0.520055 -0.000000 -0.205409 0.001656 -0.001442
	-0.136732 0.038257 0.004402 0.116770 0.074886 -0.852307
	-0.000000 0.447469 -0.000000 0.123250 0.558343 -0.461194
	0.151140 0.042027 0.014281 -0.242734 0.082725 0.868469
	0.000000 0.437615 -0.000000 0.318503 -0.422797 0.800917
	0.162623 0.221463 -0.011451 -0.235614 0.008977 0.490259
	0.000000 0.501200 -0.000000 0.674712 -0.032564 -0.149591
	-0.162016 0.218096 -0.011498 -0.216145 -0.110645 -0.390512
	-0.000000 0.492872 -0.000000 0.770037 -0.025201 0.043363
	0.142976 0.370391 -0.009384 -0.000366 0.065908 0.624793
	-0.000000 0.422763 0.000000 0.772298 -0.011644 0.217789
	-0.137594 0.373323 -0.014729 0.046267 0.089273 -0.202979
	-0.000000 0.421663 0.000000 0.315701 0.101409 0.008410
	0.035670 -0.040818 0.060014 -0.063705 0.258550 -0.959105
	-0.000000 0.026025 -0.000000 0.002979 -0.025205 0.001526
	-0.027674 -0.041720 0.059816 -0.087559 -0.216314 0.971314
	0.000000 0.025637 0.000000 0.002297 0.122929 -0.002628
	-0.050906 -0.034136 0.024111 0.058184 0.096689 -0.991135
	-0.000000 0.049218 0.000000 0.088698 0.113398 -0.328309
	0.059788 -0.034178 0.023788 0.038134 -0.077098 0.981432
	-0.000000 0.049218 -0.000000 0.131318 -0.112383 0.440115
	0.032298 -0.054366 -0.002832 0.027987 -0.278380 -0.955033
	0.000000 0.018246 -0.000000 -0.002862 0.106250 0.002897
	-0.026453 -0.054341 -0.002832 0.050665 0.282377 0.944928
	0.000000 0.018246 -0.000000 -0.002603 -0.101846 -0.003448
	-0.019528 -0.139773 -0.009620 -0.083867 0.236072 0.951085
	0.036445 -0.134474 -0.012374 -0.083973 -0.236037 -0.951008
	0.013695 -0.125781 0.011180 -0.000097 -0.468377 0.883529
	-0.013632 -0.139300 0.014942 -0.000097 -0.468376 0.883529
	0.017610 -0.113015 0.034869 -0.080502 -0.440954 -0.880320
	-0.001753 -0.113320 0.036093 -0.080308 0.440987 0.880387
	1.092753 0.079791 -0.503450 -0.000374 -0.707079 -0.000000
	0.424139 -0.529487 -0.578595 0.000000 0.250468 -0.968125
	-0.175391 0.068764 -0.738791 -0.000374 -0.707079 -0.000000
	-0.169644 -0.744542 -0.518543 -0.339129 0.234470 -0.906822
	0.438418 0.080231 0.424953 -0.000374 -0.707079 -0.000000
	0.579828 -0.529487 0.531277 -0.968125 0.000000 -0.000000
	-0.530218 0.073669 0.544356 -0.000374 -0.707107 -0.000000
	-0.086421 -0.456157 0.560209 -0.906822 0.087686 -0.339129
	0.074662 0.084140 0.422622 -0.000374 -0.707079 -0.000000
	-0.145801 -0.330299 0.363617 -0.878231 0.076169 -0.447886
	-0.686699 0.083035 -0.516367 -0.000374 -0.707079 -0.000000
	-0.139907 -0.328145 -0.359774 0.865705 -0.166269 0.471641
	-0.751220 -0.554428 -0.119500 -0.576453 0.409514 -0.576453
}

frame 8 {
	-0.018897 0.000000 0.100036 0.707107 0.000000 -0.000000
	0.354939 -0.411553 -0.011302 -0.435078 0.536045 -0.513336
	0.000000 0.520055 -0.000000 -0.201841 0.004079 -0.014869
	-0.136732 0.038257 0.004402 0.109128 0.067751 -0.850216
	0.000000 0.447469 0.000000 0.128745 0.551389 -0.480239
	0.151140 0.042027 0.014281 -0.251261 0.056808 0.865504
	-0.000000 0.437615 0.000000 0.331116 -0.427881 0.803132
	0.162623 0.221463 -0.011451 -0.221838 -0.002854 0.480912
	0.000000 0.501200 -0.000000 0.651301 -0.036175 -0.150282
	-0.162016 0.218096 -0.011498 -0.210893 -0.099619 -0.368011
	0.000000 0.492872 0.000000 0.739276 -0.015814 0.055885
	0.142975 0.370391 -0.009384 -0.006404 0.065833 0.611368
	-0.000000 0.422763 0.000000 0.774586 -0.014271 0.212457
	-0.137594 0.373323 -0.014729 0.075345 0.097793 -0.194935
	-0.000000 0.421663 0.000000 0.253957 0.104108 0.010014
	0.035670 -0.040818 0.060015 -0.067902 0.279738 -0.951713
	-0.000000 0.026025 0.000000 0.003134 -0.024597 0.001626
	-0.027674 -0.041720 0.059816 -0.090649 -0.232272 0.967030
	0.000000 0.025637 -0.000000 0.002350 0.123231 -0.002648
	-0.050906 -0.034136 0.024111 0.060787 0.096443 -0.991633
	0.000000 0.049218 -0.000000 0.092274 0.111303 -0.346577
	0.059788 -0.034178 0.023788 0.037763 -0.074526 0.981127
	-0.000000 0.049218 -0.000000 0.140542 -0.109624 0.469627
	0.032298 -0.054366 -0.002833 0.030149 -0.302750 -0.946458
	0.000000 0.018246 -0.000000 -0.002981 0.106439 0.002893
	-0.026453 -0.054341 -0.002832 0.054158 0.305956 0.935039
	0.000000 0.018246 0.000000 -0.002458 -0.101819 -0.003140
	-0.014977 -0.137566 -0.009150 -0.083866 0.236072 0.951085
	0.033153 -0.131544 -0.012276 -0.083973 -0.236037 -0.951008
	0.010315 -0.126264 0.005678 -0.000097 -0.468376 0.883529
	-0.011274 -0.141614 0.009949 -0.000097 -0.468376 0.883529
	0.015685 -0.112575 0.039102 -0.080502 -0.440954 -0.880320
	0.001285 -0.112925 0.040491 -0.080308 0.440987 0.880387
	1.082966 0.080783 -0.503449 -0.000374 -0.707079 -0.000000
	0.424139 -0.529487 -0.578595 0.000000 0.250468 -0.968125
	-0.258855 0.069974 -0.740607 -0.000374 -0.707079 -0.000000
	-0.169644 -0.744542 -0.518543 -0.339129 0.234470 -0.906822
	0.370643 0.081096 0.422086 -0.000374 -0.707079 -0.000000
	0.591988 -0.529487 0.531277 -0.968125 0.000000 -0.000000
	-0.555591 0.073633 0.544356 -0.000374 -0.707107 -0.000000
	-0.076015 -0.456157 0.553272 -0.906822 0.087686 -0.339129
	0.059682 0.083924 0.422621 -0.000374 -0.707079 -0.000000
	-0.145801 -0.330299 0.363617 -0.878231 0.076169 -0.447886
	-0.706440 0.083101 -0.516367 -0.000374 -0.707079 -0.000000
	-0.133926 -0.328145 -0.358777 0.865705 -0.166269 0.471641
	-0.748934 -0.554428 -0.135499 -0.576453 0.409514 -0.576453
}

frame 9 {
	-0.018897 0.000000 0.100036 0.707107 0.000000 -0.000000
	0.360491 -0.411553 -0.025428 -0.445535 0.532437 -0.507318
	0.000000 0.520055 -0.000000 -0.195215 0.006310 -0.027302
	-0.136732 0.038257 0.004402 0.084989 0.049817 -0.848773
	0.000000 0.447469 0.000000 0.141942 0.533318 -0.524963
	0.151140 0.042027 0.014281 -0.250033 0.027466 0.856270
	-0.000000 0.437616 0.000000 0.338918 -0.442098 0.797724
	0.162623 0.221463 -0.011451 -0.205672 -0.011993 0.469474
	0.000000 0.501200 0.000000 0.633885 -0.037553 -0.148939
	-0.162016 0.218096 -0.011498 -0.200342 -0.090228 -0.350279
	-0.000000 0.492872 0.000000 0.702878 -0.009326 0.063591
	0.142976 0.370391 -0.009384 -0.020186 0.063484 0.580620
	-0.000000 0.422763 0.000000 0.777821 -0.021348 0.196652
	-0.137594 0.373323 -0.014729 -0.018794 0.064312 -0.235073
	-0.000000 0.421663 0.000000 0.451696 0.093947 -0.004549
	0.035670 -0.040818 0.060015 -0.070293 0.292157 -0.947082
	-0.000000 0.026025 0.000000 0.002781 -0.024271 0.001453
	-0.027674 -0.041720 0.059816 -0.092403 -0.241441 0.964422
	-0.000000 0.025637 -0.000000 0.002382 0.123412 -0.002660
	-0.050906 -0.034136 0.024111 0.062351 0.096602 -0.991969
	0.000000 0.049218 0.000000 0.094106 0.109899 -0.354951
	0.059788 -0.034178 0.023788 0.037813 -0.073605 0.981158
	0.000000 0.049218 -0.000000 0.145500 -0.107988 0.485546
	0.032298 -0.054366 -0.002832 0.031381 -0.316855 -0.941129
	-0.000000 0.018246 -0.000000 -0.003051 0.106560 0.002896
	-0.026453 -0.054341 -0.002832 0.056099 0.319350 0.929055
	-0.000000 0.018246 0.000000 -0.002549 -0.101825 -0.003195
	-0.012177 -0.136209 -0.008860 -0.083866 0.236072 0.951085
	0.031129 -0.129742 -0.012215 -0.083973 -0.236037 -0.951008
	0.008236 -0.126561 0.002294 -0.000097 -0.468376 0.883529
	-0.009824 -0.143037 0.006878 -0.000097 -0.468376 0.883529
	0.014500 -0.112305 0.041706 -0.080501 -0.440954 -0.880320
	0.003154 -0.112681 0.043197 -0.080308 0.440987 0.880387
	1.053394 0.081706 -0.503449 -0.000374 -0.707079 -0.000000
	0.424139 -0.529487 -0.578595 0.000000 0.250468 -0.968125
	-0.344223 0.071193 -0.743050 -0.000374 -0.707079 -0.000000
	-0.169644 -0.744542 -0.518543 -0.339129 0.234470 -0.906822
	0.320801 0.081745 0.419920 -0.000374 -0.707079 -0.000000
	0.599466 -0.529487 0.531277 -0.968125 0.000000 -0.000000
	-0.563449 0.073580 0.544356 -0.000374 -0.707107 -0.000000
	-0.069615 -0.456157 0.549005 -0.906822 0.087686 -0.339129
	0.019875 0.083352 0.422621 -0.000374 -0.707079 -0.000000
	-0.145801 -0.330299 0.363617 -0.878231 0.076169 -0.447886
	-0.623741 0.073884 -0.516378 -0.000374 -0.707079 -0.000000
	-0.128106 -0.328145 -0.357807 0.865705 -0.166269 0.471641
	-0.747529 -0.554428 -0.145338 -0.576453 0.409514 -0.576453
}

frame 10 {
	-0.018897 0.000000 0.100036 0.707107 0.000000 -0.000000
	0.365002 -0.411553 -0.042991 -0.459730 0.527164 -0.497584
	-0.000000 0.520055 -0.000000 -0.189368 0.008748 -0.040861
	-0.136732 0.038257 0.004402 0.046894 0.025568 -0.848419
	-0.000000 0.447469 0.000000 0.160129 0.509433 -0.581630
	0.151140 0.042027 0.014281 -0.242808 0.003537 0.842412
	-0.000000 0.437615 0.000000 0.342837 -0.458767 0.789110
	0.162623 0.221463 -0.011451 -0.209205 -0.000047 0.469430
	0.000000 0.501200 -0.000000 0.635538 -0.031689 -0.142835
	-0.162016 0.218096 -0.011498 -0.184907 -0.081373 -0.340412
	0.000000 0.492872 -0.000000 0.660594 -0.005144 0.066665
	0.142976 0.370391 -0.009384 -0.039504 0.055844 0.539104
	0.000000 0.422763 0.000000 0.778752 -0.030817 0.172792
	-0.137594 0.373323 -0.014729 -0.110799 0.020416 -0.287947
	0.000000 0.421663 -0.000000 0.635124 0.075511 -0.032195
	0.035670 -0.040818 0.060014 -0.071053 0.296074 -0.945574
	0.000000 0.026025 0.000000 0.002808 -0.024171 0.001470
	-0.027674 -0.041720 0.059816 -0.092964 -0.244385 0.963562
	0.000000 0.025637 0.000000 0.002392 0.123472 -0.002665
	-0.050906 -0.034136 0.024111 0.062919 0.096762 -0.992067
	0.000000 0.049218 -0.000000 0.094586 0.109440 -0.357302
	0.059788 -0.034178 0.023788 0.037979 -0.073495 0.981156
	0.000000 0.049218 0.000000 0.146943 -0.107491 0.490656
	0.032298 -0.054366 -0.002832 0.031774 -0.321395 -0.939356
	-0.000000 0.018247 0.000000 -0.003073 0.106601 0.002898
	-0.026453 -0.054341 -0.002832 0.056714 0.323639 0.927081
	0.000000 0.018247 -0.000000 -0.002578 -0.101830 -0.003213
	-0.011247 -0.135758 -0.008764 -0.083867 0.236072 0.951085
	0.030456 -0.129143 -0.012195 -0.083973 -0.236037 -0.951008
	0.007545 -0.126659 0.001170 -0.000097 -0.468377 0.883529
	-0.009342 -0.143510 0.005857 -0.000097 -0.468376 0.883529
	0.014107 -0.112215 0.042571 -0.080502 -0.440954 -0.880320
	0.003775 -0.112601 0.044095 -0.080308 0.440987 0.880387
	1.004307 0.082546 -0.503448 -0.000374 -0.707079 -0.000000
	0.427505 -0.529487 -0.578595 0.000000 0.250468 -0.968125
	-0.427060 0.072366 -0.746252 -0.000374 -0.707079 -0.000000
	-0.169644 -0.744542 -0.518543 -0.339129 0.234470 -0.906822
	0.291405 0.082141 0.418580 -0.000374 -0.707079 -0.000000
	0.601951 -0.529487 0.531277 -0.968125 0.000000 -0.000000
	-0.532317 0.052732 0.583661 -0.000374 -0.707107 -0.000000
	-0.067489 -0.456157 0.547587 -0.906822 0.087686 -0.339129
	-0.037964 0.082522 0.422621 -0.000374 -0.707079 -0.000000
	-0.145801 -0.330299 0.363617 -0.878231 0.076169 -0.447886
	-0.494106 0.047980 -0.516414 -0.000374 -0.707079 -0.000000
	-0.122750 -0.328145 -0.356914 0.865705 -0.166269 0.471641
	-0.747062 -0.554428 -0.148608 -0.576453 0.409514 -0.576453
}

frame 11 {
	-0.018897 0.000000 0.100036 0.707107 0.000000 -0.000000
	0.366582 -0.411553 -0.056582 -0.472661 0.521845 -0.486453
	-0.000000 0.520055 -0.000000 -0.187877 0.011343 -0.055196
	-0.136732 0.038257 0.004402 -0.001348 -0.001692 -0.848019
	-0.000000 0.447469 0.000000 0.181860 0.486015 -0.638582
	0.151140 0.042027 0.014281 -0.234297 -0.008809 0.827900
	0.000000 0.437615 0.000000 0.343940 -0.470263 0.782552
	0.162623 0.221463 -0.011451 -0.252706 0.058657 0.498480
	0.000000 0.501200 0.000000 0.693835 -0.011406 -0.121565
	-0.162016 0.218096 -0.011498 -0.166390 -0.070960 -0.339026
	-0.000000 0.492872 0.000000 0.613562 -0.002447 0.066939
	0.142975 0.370391 -0.009384 -0.063035 0.042237 0.495307
	0.000000 0.422763 -0.000000 0.775565 -0.041174 0.143631
	-0.137594 0.373323 -0.014729 -0.172708 -0.034070 -0.342924
	0.000000 0.421663 0.000000 0.759687 0.055889 -0.074834
	0.035670 -0.040818 0.060015 -0.070426 0.292845 -0.946819
	-0.000000 0.026025 0.000000 0.002786 -0.024254 0.001456
	-0.027674 -0.041720 0.059816 -0.092502 -0.241957 0.964272
	0.000000 0.025637 0.000000 0.002384 0.123422 -0.002661
	-0.050906 -0.034136 0.024111 0.062448 0.096626 -0.991987
	0.000000 0.049218 -0.000000 0.094194 0.109819 -0.355377
	0.059788 -0.034178 0.023788 0.037841 -0.073585 0.981160
	-0.000000 0.049218 -0.000000 0.145752 -0.107903 0.486434
	0.032298 -0.054366 -0.002832 0.031449 -0.317651 -0.940820
	0.000000 0.018246 0.000000 -0.003055 0.106567 0.002896
	-0.026453 -0.054341 -0.002832 0.056207 0.320103 0.928711
	-0.000000 0.018246 -0.000000 -0.002554 -0.101825 -0.003198
	-0.012015 -0.136130 -0.008843 -0.083867 0.236072 0.951085
	0.031011 -0.129638 -0.012212 -0.083973 -0.236037 -0.951008
	0.008115 -0.126578 0.002098 -0.000097 -0.468376 0.883529
	-0.009740 -0.143120 0.006700 -0.000097 -0.468376 0.883529
	0.014432 -0.112289 0.041856 -0.080502 -0.440954 -0.880320
	0.003262 -0.112667 0.043353 -0.080308 0.440987 0.880387
	0.937009 0.083295 -0.503448 -0.000374 -0.707079 -0.000000
	0.437553 -0.529487 -0.578595 0.000000 0.250468 -0.968125
	-0.501540 0.073429 -0.750364 -0.000374 -0.707079 -0.000000
	-0.169644 -0.744542 -0.518543 -0.339129 0.234470 -0.906822
	0.281998 0.082272 0.418104 -0.000374 -0.707079 -0.000000
	0.599899 -0.529487 0.531277 -0.968125 0.000000 -0.000000
	-0.391736 0.008169 0.667732 -0.000374 -0.707107 -0.000000
	-0.069245 -0.456157 0.548758 -0.906822 0.087686 -0.339129
	-0.108068 0.081515 0.422620 -0.000374 -0.707079 -0.000000
	-0.145801 -0.330299 0.363617 -0.878231 0.076169 -0.447886
	-0.349145 0.014732 -0.516463 -0.000374 -0.707079 -0.000000
	-0.118113 -0.328145 -0.356141 0.865705 -0.166269 0.471641
	-0.747447 -0.554428 -0.145908 -0.576453 0.409514 -0.576453
}

frame 12 {
	-0.018897 0.000000 0.100036 0.707107 0.000000 -0.000000
	0.365945 -0.411553 -0.066414 -0.486791 0.515452 -0.469017
	-0.000000 0.520055 -0.000000 -0.194819 0.015787 -0.079560
	-0.136732 0.038256 0.004402 -0.059965 -0.030635 -0.852748
	0.000000 0.447469 -0.000000 0.207165 0.464128 -0.690234
	0.151140 0.042027 0.014281 -0.270335 0.133399 0.788471
	-0.000000 0.437616 -0.000000 0.339724 -0.401106 0.820296
	0.162623 0.221462 -0.011451 -0.260033 0.196961 0.543847
	-0.000000 0.501200 0.000000 0.816990 0.038571 -0.011797
	-0.162016 0.218096 -0.011498 -0.153650 -0.059450 -0.354033
	0.000000 0.492872 -0.000000 0.569537 -0.001620 0.064339
	0.142976 0.370391 -0.009384 -0.087362 0.021382 0.438890
	0.000000 0.422763 -0.000000 0.767124 -0.051900 0.112063
	-0.137594 0.373323 -0.014729 -0.186714 -0.098846 -0.415958
	0.000000 0.421663 -0.000000 0.827200 0.036686 -0.134586
	0.035670 -0.040818 0.060015 -0.068465 0.282605 -0.950664
	0.000000 0.026025 -0.000000 0.003155 -0.024519 0.001640
	-0.027674 -0.041720 0.059816 -0.091064 -0.234428 0.966426
	0.000000 0.025637 0.000000 0.002357 0.123273 -0.002650
	-0.050906 -0.034136 0.024111 0.061126 0.096435 -0.991715
	0.000000 0.049218 0.000000 0.092750 0.110977 -0.348686
	0.059788 -0.034178 0.023788 0.037751 -0.074263 0.981118
	0.000000 0.049218 0.000000 0.141739 -0.109241 0.473453
	0.032298 -0.054366 -0.002832 0.030440 -0.306061 -0.945231
	-0.000000 0.018247 0.000000 -0.002997 0.106467 0.002893
	-0.026453 -0.054341 -0.002832 0.054618 0.309110 0.933655
	0.000000 0.018246 -0.000000 -0.002480 -0.101819 -0.003153
	-0.014331 -0.137253 -0.009083 -0.083867 0.236072 0.951085
	0.032686 -0.131129 -0.012262 -0.083973 -0.236037 -0.951008
	0.009835 -0.126332 0.004898 -0.000097 -0.468376 0.883529
	-0.010940 -0.141942 0.009241 -0.000097 -0.468376 0.883529
	0.015412 -0.112513 0.039702 -0.080502 -0.440954 -0.880320
	0.001716 -0.112869 0.041115 -0.080308 0.440987 0.880387
	0.854120 0.083942 -0.503448 -0.000374 -0.707079 -0.000000
	0.453371 -0.529487 -0.578595 0.000000 0.250468 -0.968125
	-0.561102 0.074307 -0.755560 -0.000374 -0.707079 -0.000000
	-0.169644 -0.744542 -0.518543 -0.339129 0.234470 -0.906822
	0.412080 -0.003984 0.418031 -0.000374 -0.707079 -0.000000
	0.593712 -0.529487 0.531277 -0.968125 0.000000 -0.000000
	0.035835 -0.012840 0.707016 -0.000374 -0.707107 -0.000000
	-0.074540 -0.456157 0.552288 -0.906822 0.087686 -0.339129
	-0.185512 0.080403 0.422619 -0.000374 -0.707079 -0.000000
	-0.145801 -0.330299 0.363617 -0.878231 0.076169 -0.447886
	-0.195480 -0.011188 -0.516497 -0.000374 -0.707079 -0.000000
	-0.114382 -0.328145 -0.355519 0.865705 -0.166269 0.471641
	-0.748610 -0.554428 -0.137767 -0.576453 0.409514 -0.576453
}

frame 13 {
	-0.018897 0.000000 0.100036 0.707107 0.000000 -0.000000
	0.364578 -0.411553 -0.074561 -0.500628 0.508792 -0.446455
	-0.000000 0.520055 0.000000 -0.209663 0.020927 -0.107602
	-0.136732 0.038256 0.004402 -0.121286 -0.058815 -0.860814
	-0.000000 0.447469 -0.000000 0.235190 0.444270 -0.734407
	0.151140 0.042027 0.014281 -0.232966 0.302227 0.711490
	0.000000 0.437615 -0.000000 0.275347 -0.345933 0.826858
	0.162623 0.221462 -0.011451 -0.206024 0.209347 0.536699
	-0.000000 0.501200 -0.000000 0.833454 0.059666 0.025471
	-0.162016 0.218096 -0.011498 -0.152385 -0.049525 -0.380354
	0.000000 0.492872 0.000000 0.537945 -0.002488 0.060350
	0.142976 0.370391 -0.009384 -0.108771 -0.003496 0.371695
	0.000000 0.422763 -0.000000 0.748181 -0.062735 0.081578
	-0.137594 0.373323 -0.014729 -0.135291 -0.148491 -0.511335
	-0.000000 0.421663 -0.000000 0.839488 0.014439 -0.202340
	0.035670 -0.040818 0.060015 -0.065040 0.265252 -0.956836
	0.000000 0.026025 0.000000 0.003027 -0.025007 0.001557
	-0.027674 -0.041720 0.059816 -0.088542 -0.221366 0.969993
	-0.000000 0.025637 0.000000 0.002313 0.123023 -0.002634
	-0.050906 -0.034136 0.024111 0.059016 0.096562 -0.991271
	0.000000 0.049217 0.000000 0.089860 0.112778 -0.334586
	0.059788 -0.034178 0.023788 0.037963 -0.076168 0.981293
	-0.000000 0.049218 -0.000000 0.134310 -0.111524 0.449691
	0.032298 -0.054366 -0.002832 0.028674 -0.286066 -0.952413
	0.000000 0.018246 -0.000000 -0.002899 0.106307 0.002893
	-0.026453 -0.054341 -0.002832 0.051771 0.289786 0.941919
	0.000000 0.018247 -0.000000 -0.002660 -0.101832 -0.003482
	-0.018128 -0.139094 -0.009475 -0.083866 0.236072 0.951085
	0.035433 -0.133573 -0.012344 -0.083973 -0.236037 -0.951008
	0.012655 -0.125929 0.009487 -0.000097 -0.468377 0.883529
	-0.012907 -0.140011 0.013406 -0.000097 -0.468376 0.883529
	0.017018 -0.112880 0.036171 -0.080501 -0.440954 -0.880320
	-0.000818 -0.113198 0.037446 -0.080308 0.440987 0.880387
	0.759710 0.084483 -0.503447 -0.000374 -0.707079 -0.000000
	0.472640 -0.529487 -0.578595 0.000000 0.250468 -0.968125
	-0.599697 0.074911 -0.762042 -0.000374 -0.707079 -0.000000
	-0.169644 -0.744542 -0.518543 -0.339129 0.234470 -0.906822
	0.728465 -0.188201 0.417943 -0.000374 -0.707079 -0.000000
	0.583568 -0.529487 0.531277 -0.968125 0.000000 -0.000000
	0.190888 0.006552 0.675378 -0.000374 -0.707107 -0.000000
	-0.083221 -0.456157 0.558075 -0.906822 0.087686 -0.339129
	-0.266078 0.079247 0.422619 -0.000374 -0.707079 -0.000000
	-0.145801 -0.330299 0.363617 -0.878231 0.076169 -0.447886
	-0.036665 -0.020446 -0.516501 -0.000374 -0.707079 -0.000000
	-0.111675 -0.328145 -0.355068 0.865705 -0.166269 0.471641
	-0.750517 -0.554428 -0.124421 -0.576453 0.409514 -0.576453
}

frame 14 {
	-0.018897 0.000000 0.100036 0.707107 0.000000 -0.000000
	0.363940 -0.411553 -0.080991 -0.504492 0.507238 -0.435932
	0.000000 0.520055 -0.000000 -0.219437 0.020731 -0.106326
	-0.136732 0.038256 0.004402 -0.169751 -0.077853 -0.859453
	-0.000000 0.447469 -0.000000 0.263979 0.427191 -0.770266
	0.151140 0.042027 0.014281 -0.119973 0.234805 0.777971
	0.000000 0.437615 -0.000000 0.200827 -0.396247 0.720756
	0.162623 0.221462 -0.011451 -0.131064 0.191671 0.549104
	0.000000 0.501200 0.000000 0.840504 0.078684 0.043946
	-0.162016 0.218096 -0.011498 -0.154233 -0.046819 -0.390494
	-0.000000 0.492872 0.000000 0.525065 -0.003144 0.058324
	0.142976 0.370391 -0.009384 -0.118661 -0.023342 0.332827
	0.000000 0.422763 -0.000000 0.712053 -0.073977 0.054055
	-0.137594 0.373323 -0.014729 -0.027255 -0.107726 -0.584601
	0.000000 0.421663 -0.000000 0.800043 0.003155 -0.225708
	0.035670 -0.040818 0.060015 -0.060021 0.240239 -0.964980
	-0.000000 0.026025 0.000000 0.002851 -0.025775 0.001444
	-0.027674 -0.041720 0.059816 -0.084839 -0.202470 0.974772
	0.000000 0.025637 0.000000 0.002254 0.122685 -0.002614
	-0.050906 -0.034136 0.024111 0.056309 0.097786 -0.990807
	0.000000 0.049218 0.000000 0.084694 0.115185 -0.308867
	0.059788 -0.034178 0.023788 0.038843 -0.080167 0.981995
	-0.000000 0.049218 0.000000 0.122763 -0.114675 0.412698
	0.032298 -0.054366 -0.002832 0.026100 -0.257485 -0.961758
	0.000000 0.018247 0.000000 -0.002758 0.106109 0.002910
	-0.026453 -0.054341 -0.002832 0.047587 0.262080 0.952751
	0.000000 0.018247 -0.000000 -0.002443 -0.101910 -0.003357
	-0.023188 -0.141548 -0.009999 -0.083867 0.236072 0.951085
	0.039092 -0.136830 -0.012454 -0.083973 -0.236037 -0.951008
	0.016413 -0.125392 0.015603 -0.000097 -0.468377 0.883529
	-0.015528 -0.137439 0.018957 -0.000097 -0.468376 0.883529
	0.019159 -0.113369 0.031465 -0.080502 -0.440954 -0.880320
	-0.004195 -0.113638 0.032556 -0.080308 0.440987 0.880387
	0.659132 0.084917 -0.503447 -0.000374 -0.707079 -0.000000
	0.491909 -0.529487 -0.578595 0.000000 0.250468 -0.968125
	-0.613088 0.075141 -0.770045 -0.000374 -0.707079 -0.000000
	-0.169644 -0.744542 -0.518543 -0.339129 0.234470 -0.906822
	0.981082 -0.274351 0.417916 -0.000374 -0.707079 -0.000000
	0.570051 -0.529487 0.531277 -0.968125 0.000000 -0.000000
	0.311227 0.048581 0.605333 -0.000374 -0.707107 -0.000000
	-0.094788 -0.456157 0.565787 -0.906822 0.087686 -0.339129
	-0.346129 0.078099 0.422618 -0.000374 -0.707079 -0.000000
	-0.145801 -0.330299 0.363617 -0.878231 0.076169 -0.447886
	0.073947 0.036561 -0.516436 -0.000374 -0.707079 -0.000000
	-0.110048 -0.328145 -0.354797 0.865705 -0.166269 0.471641
	-0.753058 -0.554428 -0.106637 -0.576453 0.409514 -0.576453
}

frame 15 {
	-0.018897 0.000000 0.100036 0.707107 0.000000 -0.000000
	0.369223 -0.411608 -0.086362 -0.491313 0.507219 -0.447004
	0.000000 0.520055 -0.000000 -0.219575 0.014564 -0.072318
	-0.136732 0.038257 0.004402 -0.192901 -0.067730 -0.849088
	-0.000000 0.447469 -0.000000 0.291648 0.416100 -0.794574
	0.151140 0.042027 0.014281 -0.017993 0.054799 0.870945
	-0.000000 0.437615 -0.000000 0.147289 -0.515484 0.545885
	0.162623 0.221463 -0.011451 -0.113067 0.187799 0.567872
	-0.000000 0.501200 -0.000000 0.841173 0.087865 0.051573
	-0.162016 0.218096 -0.011498 -0.338484 -0.168877 -0.455464
	0.000000 0.492872 -0.000000 0.796485 -0.038369 0.018799
	0.142976 0.370391 -0.009384 -0.123836 -0.033657 0.331316
	-0.000000 0.422763 0.000000 0.658443 -0.084514 0.033417
	-0.137594 0.373323 -0.014729 0.094794 -0.047142 -0.589665
	0.000000 0.421663 0.000000 0.753771 -0.004412 -0.226828
	0.035670 -0.040818 0.060015 -0.053427 0.207900 -0.974202
	0.000000 0.026025 0.000000 0.003058 -0.026875 0.001516
	-0.027674 -0.041720 0.059816 -0.079952 -0.177969 0.980303
	0.000000 0.025637 -0.000000 0.002179 0.122301 -0.002594
	-0.050906 -0.034136 0.024111 0.054397 0.102346 -0.990429
	0.000000 0.049218 -0.000000 0.074663 0.118578 -0.266408
	0.059788 -0.034178 0.023788 0.040488 -0.086915 0.983623
	0.000000 0.049218 -0.000000 0.106829 -0.118385 0.359037
	0.032298 -0.054366 -0.002832 0.022728 -0.221039 -0.972144
	0.000000 0.018246 0.000000 -0.002898 0.105916 0.003346
	-0.026453 -0.054341 -0.002832 0.041978 0.226180 0.965108
	0.000000 0.018246 0.000000 -0.002423 -0.102117 -0.003606
	-0.029110 -0.144420 -0.010611 -0.083866 0.236072 0.951085
	0.043375 -0.140642 -0.012582 -0.083973 -0.236037 -0.951008
	0.020811 -0.124764 0.022762 -0.000097 -0.468376 0.883529
	-0.018597 -0.134428 0.025454 -0.000097 -0.468376 0.883529
	0.021665 -0.113941 0.025957 -0.080502 -0.440954 -0.880320
	-0.008148 -0.114152 0.026833 -0.080308 0.440987 0.880387
	0.558511 0.085249 -0.503447 -0.000374 -0.707079 -0.000000
	0.507727 -0.529487 -0.578595 0.000000 0.250468 -0.968125
	-0.225947 -0.050157 -0.795751 -0.000374 -0.707079 -0.000000
	-0.169644 -0.744542 -0.518543 -0.339129 0.234470 -0.906822
	1.113855 -0.101742 0.429884 -0.000374 -0.707079 -0.000000
	0.554229 -0.529487 0.531277 -0.968125 0.000000 -0.000000
	0.350098 0.069329 0.566469 -0.000374 -0.707107 -0.000000
	-0.108328 -0.456157 0.574814 -0.906822 0.087686 -0.339129
	-0.422529 0.077003 0.422618 -0.000374 -0.707079 -0.000000
	-0.145801 -0.330299 0.363617 -0.878231 0.076169 -0.447886
	0.165207 0.093590 -0.516362 -0.000374 -0.707079 -0.000000
	-0.109509 -0.328145 -0.354707 0.865705 -0.166269 0.471641
	-0.756032 -0.554428 -0.085820 -0.576453 0.409514 -0.576453
}

frame 16 {
	-0.018897 0.000000 0.100036 0.707107 0.000000 -0.000000
	0.374507 -0.411553 -0.088282 -0.476373 0.508905 -0.461889
	0.000000 0.520055 0.000000 -0.217781 0.007082 -0.031102
	-0.136732 0.038257 0.004402 -0.204138 -0.039516 -0.837020
	0.000000 0.447469 -0.000000 0.314054 0.416031 -0.805431
	0.151140 0.042027 0.014281 0.056671 -0.100485 0.905317
	-0.000000 0.437615 0.000000 0.098957 -0.607561 0.357139
	0.162623 0.221462 -0.011451 -0.138880 0.197830 0.572496
	-0.000000 0.501200 -0.000000 0.846144 0.084979 0.049767
	-0.162016 0.218096 -0.011498 -0.415549 -0.256094 -0.458139
	-0.000000 0.492872 -0.000000 0.859979 -0.061698 -0.027162
	0.142975 0.370391 -0.009384 -0.114905 -0.044629 0.336394
	-0.000000 0.422763 0.000000 0.593219 -0.094877 0.017055
	-0.137594 0.373323 -0.014729 0.066206 -0.045746 -0.503776
	0.000000 0.421663 -0.000000 0.781414 0.006917 -0.209562
	0.035670 -0.040818 0.060015 -0.045610 0.170793 -0.982992
	0.000000 0.026025 -0.000000 0.002777 -0.028300 0.001340
	-0.027674 -0.041720 0.059816 -0.074075 -0.149130 0.985856
	-0.000000 0.025637 -0.000000 0.002091 0.121936 -0.002577
	-0.050906 -0.034136 0.024111 0.054649 0.112704 -0.990243
	0.000000 0.049217 -0.000000 0.056917 0.122541 -0.198419
	0.059788 -0.034178 0.023788 0.043674 -0.098079 0.986117
	-0.000000 0.049218 -0.000000 0.084992 -0.122424 0.284162
	0.032298 -0.054366 -0.002832 0.018834 -0.179982 -0.981813
	0.000000 0.018247 0.000000 -0.002516 0.105774 0.003362
	-0.026453 -0.054341 -0.002832 0.035261 0.184911 0.976964
	-0.000000 0.018246 0.000000 -0.001976 -0.102503 -0.003355
	-0.035341 -0.147441 -0.011256 -0.083867 0.236072 0.951085
	0.047881 -0.144653 -0.012717 -0.083973 -0.236037 -0.951008
	0.025438 -0.124103 0.030293 -0.000097 -0.468376 0.883529
	-0.021825 -0.131260 0.032289 -0.000097 -0.468376 0.883529
	0.024301 -0.114543 0.020163 -0.080502 -0.440954 -0.880320
	-0.012307 -0.114693 0.020812 -0.080308 0.440987 0.880387
	0.463984 0.085489 -0.503447 -0.000374 -0.707079 -0.000000
	0.517775 -0.529487 -0.578595 0.000000 0.250468 -0.968125
	-0.043500 -0.175149 -0.816290 -0.000374 -0.707079 -0.000000
	-0.169644 -0.744542 -0.518543 -0.339129 0.234470 -0.906822
	1.153650 0.072167 0.441852 -0.000374 -0.707079 -0.000000
	0.537582 -0.529487 0.531277 -0.968125 0.000000 -0.000000
	0.323214 0.070882 0.557870 -0.000374 -0.707107 -0.000000
	-0.122574 -0.456158 0.584311 -0.906822 0.087686 -0.339129
	-0.492554 0.075999 0.422617 -0.000374 -0.707079 -0.000000
	-0.145801 -0.330299 0.363617 -0.878231 0.076169 -0.447886
	0.087509 0.093072 -0.516351 -0.000374 -0.707079 -0.000000
	-0.112895 -0.328145 -0.355272 0.865705 -0.166269 0.471641
	-0.759161 -0.554428 -0.063919 -0.576453 0.409514 -0.576453
}

frame 17 {
	-0.018897 0.000000 0.100036 0.707107 0.000000 -0.000000
	0.372648 -0.406852 -0.084533 -0.474895 0.511935 -0.468526
	-0.000000 0.520055 0.000000 -0.213148 0.001841 -0.002304
	-0.136732 0.038257 0.004402 -0.220569 -0.022222 -0.825342
	0.000000 0.447469 0.000000 0.328946 0.420855 -0.809047
	0.151140 0.042027 0.014281 0.039234 -0.072961 0.900154
	-0.000000 0.437615 -0.000000 0.115700 -0.588207 0.416950
	0.162623 0.221463 -0.011451 -0.176652 0.198346 0.553644
	0.000000 0.501200 0.000000 0.858131 0.068416 0.029160
	-0.162016 0.218096 -0.011498 -0.360442 -0.252037 -0.491140
	-0.000000 0.492872 -0.000000 0.871464 -0.086254 -0.052113
	0.142975 0.370391 -0.009384 -0.087966 -0.061809 0.331943
	-0.000000 0.422763 -0.000000 0.531232 -0.105368 0.002562
	-0.137594 0.373323 -0.014729 0.004984 -0.048927 -0.450697
	-0.000000 0.421663 0.000000 0.795171 0.016739 -0.191116
	0.035670 -0.040818 0.060015 -0.037310 0.132319 -0.990093
	0.000000 0.026025 0.000000 0.002890 -0.029928 0.001351
	-0.027674 -0.041720 0.059816 -0.067693 -0.118536 0.990620
	-0.000000 0.025637 -0.000000 0.001992 0.121661 -0.002567
	-0.050906 -0.034136 0.024111 0.061300 0.138683 -0.988422
	0.000000 0.049218 -0.000000 0.018003 0.126671 -0.061383
	0.059788 -0.034178 0.023788 0.050124 -0.117329 0.988586
	0.000000 0.049218 0.000000 0.052718 -0.126480 0.175342
	0.032298 -0.054366 -0.002832 0.014771 -0.138463 -0.989466
	0.000000 0.018246 -0.000000 -0.002169 0.105709 0.003687
	-0.026453 -0.054341 -0.002832 0.028026 0.142346 0.986637
	0.000000 0.018247 -0.000000 -0.001778 -0.103050 -0.003772
	-0.041264 -0.150313 -0.011868 -0.083867 0.236072 0.951085
	0.052164 -0.148466 -0.012845 -0.083973 -0.236037 -0.951008
	0.029836 -0.123474 0.037452 -0.000097 -0.468376 0.883529
	-0.024893 -0.128249 0.038787 -0.000097 -0.468376 0.883529
	0.026807 -0.115115 0.014655 -0.080502 -0.440954 -0.880320
	-0.016260 -0.115208 0.015089 -0.080308 0.440987 0.880387
	0.380930 0.085653 -0.503447 -0.000374 -0.707079 -0.000000
	0.521141 -0.529487 -0.578595 0.000000 0.250468 -0.968125
	0.087179 -0.117037 -0.796760 -0.000374 -0.707079 -0.000000
	-0.169644 -0.744542 -0.518543 -0.339129 0.234470 -0.906822
	1.116320 0.073263 0.441861 -0.000374 -0.707079 -0.000000
	0.521760 -0.529487 0.531277 -0.968125 0.000000 -0.000000
	0.233149 0.072105 0.551309 -0.000374 -0.707107 -0.000000
	-0.136114 -0.456158 0.593337 -0.906822 0.087686 -0.339129
	-0.553841 0.075121 0.422617 -0.000374 -0.707079 -0.000000
	-0.145801 -0.330299 0.363617 -0.878231 0.076169 -0.447886
	-0.007248 0.091496 -0.516346 -0.000374 -0.707079 -0.000000
	-0.122750 -0.328145 -0.356914 0.865705 -0.166269 0.471641
	-0.762135 -0.554428 -0.043101 -0.576453 0.409514 -0.576453
}

frame 18 {
	-0.018897 0.000000 0.100036 0.707107 0.000000 -0.000000
	0.367409 -0.393967 -0.073973 -0.479396 0.511334 -0.477961
	-0.000000 0.520055 0.000000 -0.200732 -0.001870 0.017904
	-0.136732 0.038257 0.004402 -0.235377 -0.020611 -0.802797
	-0.000000 0.447469 0.000000 0.337486 0.425096 -0.810234
	0.151140 0.042027 0.014281 -0.013006 -0.006260 0.880421
	-0.000000 0.437615 0.000000 0.156160 -0.540625 0.545860
	0.162623 0.221463 -0.011451 -0.225877 0.187903 0.528451
	0.000000 0.501200 -0.000000 0.865870 0.046404 -0.005448
	-0.162016 0.218096 -0.011498 -0.214220 -0.187877 -0.582251
	-0.000000 0.492872 0.000000 0.847615 -0.141818 -0.082294
	0.142976 0.370391 -0.009384 -0.057778 -0.079859 0.330064
	0.000000 0.422763 0.000000 0.482622 -0.113847 -0.007555
	-0.137594 0.373323 -0.014729 -0.049085 -0.047892 -0.416695
	0.000000 0.421663 0.000000 0.794620 0.025712 -0.169707
	0.035670 -0.040818 0.060015 -0.029567 0.097431 -0.994764
	0.000000 0.026025 -0.000000 0.002996 -0.031522 0.001353
	-0.027674 -0.041720 0.059816 0.061558 0.089881 -0.994030
	0.000000 0.025637 -0.000000 0.001891 0.121514 -0.002561
	-0.050906 -0.034136 0.024111 -0.062653 -0.148700 0.986871
	0.000000 0.049218 0.000000 0.001126 0.128326 -0.003767
	0.059788 -0.034178 0.023788 -0.062318 0.150759 -0.986594
	0.000000 0.049218 -0.000000 0.001138 -0.129033 0.003769
	0.032298 -0.054366 -0.002832 0.011085 -0.101850 -0.994457
	0.000000 0.018247 -0.000000 -0.001421 0.105711 0.003646
	-0.026453 -0.054341 -0.002832 0.021297 0.104418 0.993037
	-0.000000 0.018247 0.000000 -0.001086 -0.103656 -0.003414
	-0.046324 -0.152767 -0.012392 -0.083867 0.236072 0.951085
	0.055823 -0.151722 -0.012955 -0.083973 -0.236037 -0.951008
	0.033593 -0.122937 0.043568 -0.000097 -0.468376 0.883529
	-0.027514 -0.125676 0.044337 -0.000097 -0.468376 0.883529
	0.028947 -0.115604 0.009949 -0.080502 -0.440954 -0.880320
	-0.019637 -0.115647 0.010200 -0.080308 0.440987 0.880387
	0.313457 0.085756 -0.503447 -0.000374 -0.707079 -0.000000
	0.507728 -0.529487 -0.578595 0.000000 0.250468 -0.968125
	0.289140 0.007338 -0.754971 -0.000374 -0.707079 -0.000000
	-0.169644 -0.744542 -0.518543 -0.339129 0.234470 -0.906822
	1.014252 0.074065 0.441862 -0.000374 -0.707079 -0.000000
	0.508242 -0.529487 0.531277 -0.968125 0.000000 -0.000000
	0.096219 0.072928 0.547119 -0.000374 -0.707107 -0.000000
	-0.147682 -0.456157 0.601049 -0.906822 0.087686 -0.339129
	-0.604329 0.074398 0.422616 -0.000374 -0.707079 -0.000000
	-0.145801 -0.330299 0.363617 -0.878231 0.076169 -0.447886
	-0.105512 0.089210 -0.516346 -0.000374 -0.707079 -0.000000
	-0.136917 -0.328145 -0.359275 0.865705 -0.166269 0.471641
	-0.764675 -0.554428 -0.025315 -0.576453 0.409514 -0.576453
}

frame 19 {
	-0.018897 0.000000 0.100036 0.707107 0.000000 -0.000000
	0.360680 -0.377510 -0.060413 -0.487243 0.508155 -0.487649
	-0.000000 0.520055 0.000000 -0.184691 -0.003995 0.029291
	-0.136732 0.038257 0.004402 -0.248345 -0.035410 -0.767801
	0.000000 0.447469 -0.000000 0.341622 0.426886 -0.810732
	0.151140 0.042027 0.014281 -0.055620 0.046138 0.863969
	-0.000000 0.437615 -0.000000 0.182994 -0.497938 0.628044
	0.162623 0.221463 -0.011451 -0.255931 0.163692 0.510133
	-0.000000 0.501200 -0.000000 0.860819 0.028580 -0.040369
	-0.162016 0.218096 -0.011498 -0.154148 -0.157431 -0.617357
	0.000000 0.492872 -0.000000 0.823590 -0.165822 -0.092355
	0.142976 0.370391 -0.009384 -0.030554 -0.096331 0.329226
	0.000000 0.422763 0.000000 0.450703 -0.119876 -0.013959
	-0.137594 0.373323 -0.014729 -0.086347 -0.039635 -0.397100
	0.000000 0.421663 0.000000 0.779873 0.035164 -0.143301
	0.035670 -0.040818 0.060015 0.023394 -0.070204 0.997234
	0.000000 0.026025 -0.000000 0.003142 -0.032828 0.001372
	-0.027674 -0.041720 0.059816 0.056512 0.066727 -0.996040
	-0.000000 0.025637 0.000000 0.001797 0.121477 -0.002555
	-0.050906 -0.034136 0.024111 0.060271 0.147039 -0.987257
	0.000000 0.049218 -0.000000 0.001265 0.129342 -0.004174
	0.059788 -0.034178 0.023788 0.060430 -0.147443 0.987200
	-0.000000 0.049218 0.000000 0.001265 -0.129308 0.004176
	0.032298 -0.054366 -0.002832 0.008210 -0.073990 -0.997160
	0.000000 0.018247 -0.000000 -0.000603 0.105747 0.003423
	-0.026453 -0.054341 -0.002832 0.015924 0.075238 0.996552
	-0.000000 0.018247 0.000000 -0.000496 -0.104187 -0.003434
	-0.050121 -0.154608 -0.012785 -0.083867 0.236072 0.951085
	0.058569 -0.154167 -0.013037 -0.083973 -0.236037 -0.951008
	0.036413 -0.122534 0.048158 -0.000097 -0.468376 0.883529
	-0.029481 -0.123745 0.048503 -0.000097 -0.468376 0.883529
	0.030554 -0.115970 0.006418 -0.080501 -0.440954 -0.880320
	-0.022171 -0.115977 0.006530 -0.080308 0.440987 0.880387
	0.264218 0.085813 -0.503447 -0.000374 -0.707079 -0.000000
	0.472646 -0.529487 -0.578595 0.000000 0.250468 -0.968125
	0.352661 0.065531 -0.735434 -0.000374 -0.707079 -0.000000
	-0.169644 -0.744542 -0.518543 -0.339129 0.234470 -0.906822
	0.928993 0.074500 0.441859 -0.000374 -0.707079 -0.000000
	0.498097 -0.529487 0.531277 -0.968125 0.000000 -0.000000
	-0.035562 0.073363 0.545080 -0.000374 -0.707107 -0.000000
	-0.156364 -0.456157 0.606837 -0.906822 0.087686 -0.339129
	-0.642222 0.073856 0.422616 -0.000374 -0.707079 -0.000000
	-0.145801 -0.330299 0.363617 -0.878231 0.076169 -0.447886
	-0.205278 0.086926 -0.516351 -0.000374 -0.707079 -0.000000
	-0.151083 -0.328145 -0.361636 0.865705 -0.166269 0.471641
	-0.766582 -0.554428 -0.011967 -0.576453 0.409514 -0.576453
}

frame 20 {
	-0.018897 0.000000 0.100036 0.707107 0.000000 -0.000000
	0.355439 -0.364721 -0.049852 -0.493940 0.504871 -0.494378
	0.000000 0.520055 0.000000 -0.172069 -0.004932 0.034199
	-0.136732 0.038257 0.004402 -0.256395 -0.052942 -0.734603
	0.000000 0.447469 0.000000 0.342955 0.427271 -0.811024
	0.151140 0.042027 0.014281 -0.083417 0.079897 0.852355
	0.000000 0.437615 -0.000000 0.198510 -0.468891 0.673809
	0.162623 0.221463 -0.011451 -0.265174 0.137434 0.497998
	-0.000000 0.501200 0.000000 0.847822 0.017039 -0.066326
	-0.162016 0.218096 -0.011498 -0.180652 -0.172669 -0.593070
	0.000000 0.492872 -0.000000 0.832513 -0.150000 -0.085531
	0.142976 0.370391 -0.009384 -0.011549 -0.108189 0.328363
	-0.000000 0.422763 0.000000 0.431941 -0.123294 -0.017745
	-0.137594 0.373323 -0.014729 -0.103864 -0.022978 -0.381024
	-0.000000 0.421663 0.000000 0.749871 0.045771 -0.111863
	0.035670 -0.040818 0.060015 0.019497 -0.053474 0.998238
	-0.000000 0.026025 0.000000 0.002926 -0.033663 0.001245
	-0.027674 -0.041720 0.059816 0.053224 0.051794 -0.996978
	0.000000 0.025637 0.000000 0.002000 0.121491 -0.002947
	-0.050906 -0.034136 0.024111 0.058856 0.146092 -0.987366
	-0.000000 0.049217 -0.000000 0.001271 0.129948 -0.004156
	0.059788 -0.034178 0.023788 0.059329 -0.145525 0.987487
	0.000000 0.049218 0.000000 0.001262 -0.129472 0.004158
	0.032298 -0.054366 -0.002832 0.006415 -0.056952 -0.998349
	0.000000 0.018247 -0.000000 -0.000004 0.105783 0.003106
	-0.026453 -0.054341 -0.002832 0.012554 0.057387 0.998085
	-0.000000 0.018246 0.000000 0.000015 -0.104539 -0.003176
	-0.052437 -0.155731 -0.013024 -0.083867 0.236072 0.951085
	0.060244 -0.155658 -0.013088 -0.083973 -0.236037 -0.951008
	0.038133 -0.122289 0.050957 -0.000097 -0.468377 0.883529
	-0.030681 -0.122568 0.051044 -0.000097 -0.468376 0.883529
	0.031534 -0.116194 0.004264 -0.080502 -0.440954 -0.880320
	-0.023717 -0.116178 0.004292 -0.080308 0.440987 0.880387
	0.234544 0.085839 -0.503447 -0.000374 -0.707079 -0.000000
	0.437558 -0.529487 -0.578595 0.000000 0.250468 -0.968125
	0.289624 0.064730 -0.735430 -0.000374 -0.707079 -0.000000
	-0.169644 -0.744542 -0.518543 -0.339129 0.234470 -0.906822
	0.872867 0.074655 0.441856 -0.000374 -0.707079 -0.000000
	0.491909 -0.529487 0.531277 -0.968125 0.000000 -0.000000
	-0.134707 0.073531 0.544433 -0.000374 -0.707107 -0.000000
	-0.161659 -0.456157 0.610367 -0.906822 0.087686 -0.339129
	-0.665949 0.073516 0.422616 -0.000374 -0.707079 -0.000000
	-0.145801 -0.330299 0.363617 -0.878231 0.076169 -0.447886
	-0.305321 0.085353 -0.516359 -0.000374 -0.707079 -0.000000
	-0.160938 -0.328145 -0.363279 0.865705 -0.166269 0.471641
	-0.767745 -0.554428 -0.003825 -0.576453 0.409514 -0.576453
}

