MD5Version 10 // Parameters used during export: Reorient: False; Scale: 1.0
commandline ""

numFrames 6
numJoints 27
frameRate 60
numAnimatedComponents 162

hierarchy {
  "origin" -1 63 0 //
  "chest" 0 63 6 //
  "tail" 1 63 12 //
  "leg0_upper" 1 63 18 //
  "leg0_lower" 3 63 24 //
  "leg5_upper" 1 63 30 //
  "leg5_lower" 5 63 36 //
  "leg4_upper" 1 63 42 //
  "leg4_lower" 7 63 48 //
  "leg1_upper" 1 63 54 //
  "leg1_lower" 9 63 60 //
  "leg3_upper" 1 63 66 //
  "leg3_lower" 11 63 72 //
  "leg2_upper" 1 63 78 //
  "leg2_lower" 13 63 84 //
  "antenna_upper_left0" 1 63 90 //
  "antenna_upper_left1" 15 63 96 //
  "antenna_upper_right0" 1 63 102 //
  "antenna_upper_right1" 17 63 108 //
  "antenna_right0" 1 63 114 //
  "antenna_right1" 19 63 120 //
  "antenna_left0" 1 63 126 //
  "antenna_left1" 21 63 132 //
  "antenna_lower_left0" 1 63 138 //
  "antenna_lower_left1" 23 63 144 //
  "antenna_lower_right0" 1 63 150 //
  "antenna_lower_right1" 25 63 156 //
}

bounds {
  ( -0.9553217292 -1.1510990858 0.1781873107 ) ( 0.5010514855 1.1298679113 0.7450917363 )
  ( -0.9659259915 -1.0864946842 0.1621412933 ) ( 0.4841197133 1.1041057110 0.7359904647 )
  ( -0.9486608505 -0.9247582555 0.1222365871 ) ( 0.4704620242 1.0304759741 0.7438679338 )
  ( -0.9119972587 -0.8808375001 0.1276542395 ) ( 0.4756461382 0.9362857938 0.7727725506 )
  ( -0.8900177479 -0.8477715254 0.0305518731 ) ( 0.4869809151 0.8650360703 0.7305015326 )
  ( -0.8838571906 -0.8362707496 -0.0060403305 ) ( 0.5015997291 0.8401566744 0.7355550528 )
}

baseframe {
  ( 0.0000000000 0.0000000000 0.1000000015 ) ( 0.7071068287 -0.0000000000 -0.0000000000 )
  ( 0.2934706807 -0.3602214158 -0.0048920386 ) ( -0.4964132011 0.5035642385 -0.4966249764 )
  ( 0.0000080311 0.5389489532 0.0002984107 ) ( -0.1784965545 0.0006216453 0.0037200444 )
  ( -0.1367243677 0.0571507215 0.0047000772 ) ( -0.1446045935 -0.1217156276 -0.6598580480 )
  ( 0.0188033730 0.4492226839 -0.0006588334 ) ( 0.2914981842 0.3391291201 -0.8406866193 )
  ( 0.1511484981 0.0609211028 0.0145796919 ) ( -0.1361550987 0.1165692955 0.6686438918 )
  ( -0.0188374277 0.4390271902 -0.0004912592 ) ( 0.2926936448 -0.3480054438 0.8343683481 )
  ( 0.1626309156 0.2403567135 -0.0111524481 ) ( -0.1080924198 0.0413611457 0.3954822123 )
  ( -0.0137833599 0.5138163567 -0.0028145127 ) ( 0.5014041662 0.0156385396 -0.0498958528 )
  ( -0.1620082557 0.2369901687 -0.0111991586 ) ( -0.1099235415 -0.0419307724 -0.3936591744 )
  ( 0.0137448302 0.5055176020 -0.0028717890 ) ( 0.5045711994 -0.0136532076 0.0436128974 )
  ( 0.1429835856 0.3892854154 -0.0090858266 ) ( 0.0111710364 -0.0027141315 0.1080545485 )
  ( -0.0040532337 0.4412065148 0.0007069071 ) ( 0.4295544028 -0.0485373773 0.0925593302 )
  ( -0.1375856400 0.3922168314 -0.0144305658 ) ( 0.0112098185 0.0028863086 -0.1146928743 )
  ( 0.0043151118 0.4400462806 0.0007065351 ) ( 0.4298218489 0.0452572927 -0.0862943754 )
  ( 0.0356778391 -0.0219234787 0.0603129305 ) ( 0.0103111053 -0.1781353056 0.9820153713 )
  ( -0.0023677417 0.0083696377 -0.0063066618 ) ( 0.3025591075 -0.0381402522 0.0498569980 )
  ( -0.0276663788 -0.0228254311 0.0601140521 ) ( 0.0233672094 0.1717036813 -0.9742456675 )
  ( 0.0054568490 0.0085394774 -0.0059142075 ) ( 0.2978127897 0.1312129349 -0.1743576527 )
  ( -0.0508979969 -0.0152415158 0.0244091116 ) ( 0.0117792804 0.0538802668 -0.9588342309 )
  ( 0.0101123052 0.0333281234 -0.0015321304 ) ( 0.1461273730 0.1195054427 -0.4428290129 )
  ( 0.0597957559 -0.0152841890 0.0240866188 ) ( 0.0117620174 -0.0538869537 0.9589529634 )
  ( -0.0101124281 0.0333282128 -0.0015321332 ) ( 0.1461275220 -0.1195051521 0.4428286254 )
  ( 0.0323061757 -0.0354717970 -0.0025340349 ) ( -0.0037301253 -0.2637203634 -0.9645053148 )
  ( 0.0005006421 0.0021384403 0.0098670051 ) ( -0.1936063468 0.1096101850 0.1188093349 )
  ( -0.0264448021 -0.0354467630 -0.0025336863 ) ( -0.0036117367 0.2637220025 0.9645107388 )
  ( -0.0005007304 0.0021384496 0.0098670144 ) ( -0.1936063617 -0.1096105203 -0.1188094392 )
}

frame 0 {
  0.0000000000 0.0000000000 0.1000000015 0.7071068287 -0.0000000000 -0.0000000000
  0.2576283813 -0.2869956791 -0.0048920466 -0.5045900345 0.4953704178 -0.5047982931
  0.0000080221 0.5389485359 -0.0003202557 0.0824527591 -0.0004110172 0.0040180446
  -0.1367243528 0.0571504347 0.0040813736 -0.2262651771 -0.2066576481 -0.6807327867
  0.0188713279 0.4467245638 -0.0006282963 0.1256646961 0.6548888683 -0.3827932179
  0.1511484832 0.0609208047 0.0139610758 -0.2607753575 0.2680790722 0.6448234916
  -0.0188904777 0.4380112588 -0.0002727408 0.1670731306 -0.6036046147 0.5064542294
  0.1626309305 0.2403563708 -0.0117711620 -0.2382360995 0.1057040468 0.4567272365
  -0.0156148337 0.5099115372 -0.0061128438 0.2741134465 0.0297874287 -0.0150540760
  -0.1620082706 0.2369898409 -0.0118177952 -0.3247964084 -0.1384967119 -0.4250065088
  0.0150758699 0.5007377863 -0.0082417056 0.5423402190 -0.0156322755 0.0426987335
  0.1429836005 0.3892849982 -0.0097044818 -0.3826541901 0.1025021002 0.3174428344
  -0.0117895417 0.4320880771 -0.0114514977 0.5235613585 -0.0731940195 0.0511993766
  -0.1375856251 0.3922164440 -0.0150491875 -0.3565937579 -0.0665833801 -0.2731201947
  0.0100747012 0.4327140749 -0.0115517974 0.5832291842 0.0723731816 -0.0375191607
  0.0356778279 -0.0219237786 0.0596942678 0.0181774050 -0.0478778630 0.9984862208
  -0.0008090170 0.0072639724 -0.0021115304 0.0028526895 -0.0339449085 0.0012019825
  -0.0276663862 -0.0228257012 0.0594954304 0.0521063879 0.0467752703 -0.9972310662
  0.0010604076 0.0068799402 -0.0020314832 0.0019716765 0.1215026453 -0.0029434194
  -0.0508979894 -0.0152418595 0.0237904564 0.0583902374 0.1457764953 -0.9873848557
  0.0011050636 0.0312349927 -0.0056999354 0.0012725660 0.1301466227 -0.0041509108
  0.0597957484 -0.0152844889 0.0234679710 0.0589702949 -0.1449006796 0.9875704646
  -0.0009339866 0.0312182065 -0.0056770714 0.0012615428 -0.1295253634 0.0041525667
  0.0323061720 -0.0354720503 -0.0031526431 0.0059083854 -0.0512859039 -0.9986658096
  0.0000309684 -0.0005806910 0.0016173949 0.0002232620 0.1057976112 0.0033464662
  -0.0264448058 -0.0354470164 -0.0031522943 0.0114090201 0.0514624380 0.9984931946
  -0.0005694609 -0.0005710489 0.0016299936 0.0002190991 -0.1046594307 -0.0033967716
}

frame 1 {
  0.0000000000 0.0000000000 0.1000000015 0.7071068287 -0.0000000000 -0.0000000000
  0.2576286197 -0.2470610440 -0.0048920489 -0.5045900345 0.4953704178 -0.5047982931
  0.0000080223 0.5389485359 -0.0003202813 0.0165905487 -0.0001597802 0.0040171547
  -0.1367243826 0.0571504198 0.0040813778 -0.2792109847 -0.2656718493 -0.6371447444
  0.0188729614 0.4478434026 -0.0008652462 0.1666886657 0.6161055565 -0.4983099103
  0.1511484832 0.0609208159 0.0139610199 -0.2991315722 0.3109666705 0.6138784885
  -0.0188628826 0.4386439323 -0.0004659700 0.1939565688 -0.5669871569 0.5816036463
  0.1626309305 0.2403563857 -0.0117711285 -0.2666881084 0.1176478863 0.4490879476
  -0.0155009441 0.5096124411 -0.0067844465 0.3321170807 0.0286882818 -0.0190052595
  -0.1620082706 0.2369898856 -0.0118178511 -0.3339949250 -0.1411651373 -0.4205237329
  0.0149874613 0.5006474257 -0.0084851459 0.5527221560 -0.0157102924 0.0432683527
  0.1429835707 0.3892850280 -0.0097044781 -0.3714425564 0.0787695199 0.2964055836
  -0.0108882375 0.4329039752 -0.0116488338 0.5043236613 -0.0722285807 0.0524847992
  -0.1375856549 0.3922164738 -0.0150492731 -0.3668363988 -0.0608049072 -0.2575612962
  0.0095040090 0.4327417612 -0.0120001957 0.5909501910 0.0676257312 -0.0491943695
  0.0356778279 -0.0219237637 0.0596942417 0.0181774143 -0.0478778370 0.9984862208
  -0.0008090159 0.0072639310 -0.0021114480 0.0028526897 -0.0339449085 0.0012019833
  -0.0276663899 -0.0228256863 0.0594953746 0.0521063879 0.0467752703 -0.9972310662
  0.0010604095 0.0068798959 -0.0020314977 0.0019716765 0.1215026453 -0.0029434194
  -0.0508979931 -0.0152418455 0.0237903707 0.0583906211 0.1457759887 -0.9873849154
  0.0011050566 0.0312350001 -0.0056998772 0.0012725607 0.1301465929 -0.0041509219
  0.0597957484 -0.0152845038 0.0234679170 0.0589697994 -0.1449006498 0.9875704646
  -0.0009339952 0.0312182233 -0.0056771319 0.0012615563 -0.1295253485 0.0041525541
  0.0323061757 -0.0354720652 -0.0031526980 0.0058978871 -0.0512855202 -0.9986658692
  0.0000309643 -0.0005806847 0.0016173822 0.0002232504 0.1057976112 0.0033464681
  -0.0264448095 -0.0354470313 -0.0031523493 0.0114089977 0.0514624305 0.9984931946
  -0.0005694535 -0.0005709780 0.0016299761 0.0002190910 -0.1046594307 -0.0033967569
}

frame 2 {
  0.0000000000 0.0000000000 0.1000000015 0.7071068287 -0.0000000000 -0.0000000000
  0.2576283813 -0.2071563303 -0.0048920526 -0.5045900345 0.4953704178 -0.5047982931
  0.0000080222 0.5389485359 -0.0003202557 -0.0994186625 0.0002845411 0.0039688777
  -0.1367243528 0.0571504310 0.0040814034 -0.3479538560 -0.3613640964 -0.5651752949
  0.0187646039 0.4494367838 -0.0010456545 0.2331634760 0.4860557318 -0.6989716291
  0.1511484832 0.0609207712 0.0139610460 -0.3561927974 0.3868927360 0.5500003099
  -0.0187261701 0.4400035143 -0.0008420814 0.2478265464 -0.4516151845 0.7368808389
  0.1626309305 0.2403563708 -0.0117711322 -0.3056757152 0.1335552633 0.4348597229
  -0.0152689740 0.5092212558 -0.0077197254 0.4683261216 0.0248147734 -0.0328777209
  -0.1620082706 0.2369898409 -0.0118177654 -0.3289401829 -0.1365285665 -0.4154362082
  0.0148272291 0.5009379983 -0.0084955245 0.5823603868 -0.0146797746 0.0470610708
  0.1429836005 0.3892849982 -0.0097044520 -0.3659099340 0.0607453957 0.2485946119
  -0.0092148595 0.4340462685 -0.0120358691 0.5696568489 -0.0595913865 0.0834582597
  -0.1375856251 0.3922164440 -0.0150492173 -0.3488249481 -0.0466899388 -0.2189476788
  0.0081302635 0.4339342713 -0.0118484199 0.6144362092 0.0568489693 -0.0767821223
  0.0356778279 -0.0219237804 0.0596942678 0.0181768518 -0.0478780083 0.9984862208
  -0.0008090180 0.0072639235 -0.0021114175 0.0028527102 -0.0339449085 0.0012019837
  -0.0276663899 -0.0228257030 0.0594953708 0.0521069206 0.0467755869 -0.9972309470
  0.0010604132 0.0068799709 -0.0020314413 0.0019716837 0.1215026677 -0.0029434257
  -0.0508979931 -0.0152418623 0.0237904266 0.0583906434 0.1457758397 -0.9873849154
  0.0011050653 0.0312349685 -0.0056998986 0.0012725542 0.1301465929 -0.0041509266
  0.0597957484 -0.0152844908 0.0234679412 0.0589697994 -0.1449005306 0.9875705242
  -0.0009339844 0.0312182158 -0.0056771170 0.0012615485 -0.1295253485 0.0041525601
  0.0323061720 -0.0354720503 -0.0031526431 0.0059083854 -0.0512859039 -0.9986658096
  0.0000309726 -0.0005807041 0.0016173651 0.0002232620 0.1057976112 0.0033464662
  -0.0264448058 -0.0354470164 -0.0031522943 0.0114090294 0.0514624491 0.9984931350
  -0.0005694558 -0.0005710463 0.0016299938 0.0002191009 -0.1046594307 -0.0033967686
}

frame 3 {
  0.0000000000 0.0000000000 0.1000000015 0.7071068287 -0.0000000000 -0.0000000000
  0.2662863433 -0.2441081405 -0.0048920498 -0.5026273131 0.4973618686 -0.5028363466
  0.0000080257 0.5389505625 -0.0001708769 -0.1656787395 0.0005478291 0.0038675969
  -0.1367243826 0.0571522936 0.0042308369 -0.3413155675 -0.3719505966 -0.5464153290
  0.0186196528 0.4505276084 -0.0010159211 0.2756066322 0.3375365734 -0.8338712454
  0.1511484683 0.0609227009 0.0141104637 -0.3394647837 0.3770985007 0.5464053750
  -0.0186187774 0.4407293200 -0.0008513778 0.2830274105 -0.3242880106 0.8436580896
  0.1626309305 0.2403583080 -0.0116216801 -0.2692608535 0.1143763065 0.4246272147
  -0.0149028189 0.5104513168 -0.0070281327 0.5565815568 0.0194458030 -0.0477775373
  -0.1620082557 0.2369917631 -0.0116684111 -0.2654917836 -0.1059541330 -0.4142734706
  0.0145901423 0.5025194883 -0.0071506649 0.5911262035 -0.0126174400 0.0513191111
  0.1429835707 0.3892868459 -0.0095551554 -0.2614826262 0.0349122658 0.1842324585
  -0.0069245733 0.4377082586 -0.0092616566 0.5976200700 -0.0491841957 0.1125960276
  -0.1375856549 0.3922182918 -0.0148997968 -0.2380392551 -0.0247008614 -0.1691434085
  0.0063355453 0.4372541308 -0.0085932650 0.5993521214 0.0485184193 -0.0988427550
  0.0356778279 -0.0219218712 0.0598437004 0.0181764252 -0.0478774533 0.9984862804
  -0.0008039584 0.0072476352 -0.0019630166 0.0028526704 -0.0339449011 0.0012019787
  -0.0276663844 -0.0228238478 0.0596448407 0.0521065407 0.0467755869 -0.9972310066
  0.0010453369 0.0068636676 -0.0018837135 0.0019716541 0.1215026751 -0.0029433952
  -0.0508979931 -0.0152399214 0.0239398796 0.0583887622 0.1457760334 -0.9873849750
  0.0010888246 0.0311897770 -0.0055583068 0.0012725848 0.1301465780 -0.0041509592
  0.0597957484 -0.0152826002 0.0236174185 0.0589699000 -0.1448994279 0.9875705838
  -0.0009173430 0.0311733447 -0.0055355257 0.0012615387 -0.1295253187 0.0041525690
  0.0323061720 -0.0354702212 -0.0030032315 0.0059235380 -0.0512855276 -0.9986657500
  0.0000292056 -0.0005673093 0.0017662522 0.0002232780 0.1057976112 0.0033464693
  -0.0264448039 -0.0354451872 -0.0030029127 0.0114110876 0.0514626540 0.9984931946
  -0.0005658707 -0.0005575680 0.0017788084 0.0002190584 -0.1046594456 -0.0033967672
}

frame 4 {
  0.0000000000 0.0000000000 0.1000000015 0.7071068287 -0.0000000000 -0.0000000000
  0.2848128676 -0.3232013285 -0.0048920424 -0.4984006286 0.5015972853 -0.4986115098
  0.0000080296 0.5389506817 0.0001489700 -0.1794797331 0.0006177163 0.0037615658
  -0.1367243677 0.0571525097 0.0045505809 -0.2296063900 -0.2242408842 -0.6309053898
  0.0187845994 0.4494138062 -0.0006597182 0.2894657850 0.3088928163 -0.8560126424
  0.1511484683 0.0609229244 0.0144301979 -0.2202805728 0.2168834507 0.6389479041
  -0.0188105032 0.4393429160 -0.0005112509 0.2932316363 -0.3135734797 0.8533990979
  0.1626309156 0.2403585166 -0.0113019645 -0.1656210572 0.0645396486 0.4132255018
  -0.0143493442 0.5126638412 -0.0044446737 0.5409876704 0.0155520849 -0.0532254502
  -0.1620082557 0.2369919717 -0.0113486685 -0.1635036916 -0.0593997315 -0.4081827998
  0.0142006744 0.5045062304 -0.0044793710 0.5458637476 -0.0112277148 0.0505988039
  0.1429835707 0.3892872334 -0.0092352666 -0.0838783830 0.0083102006 0.1301892847
  -0.0048799864 0.4407799244 -0.0029441733 0.5118975043 -0.0470323078 0.1081769839
  -0.1375856400 0.3922186494 -0.0145800021 -0.0756391659 -0.0046591782 -0.1284210831
  0.0048215948 0.4397395849 -0.0026565180 0.5026966333 0.0456481092 -0.0958920792
  0.0356778353 -0.0219217092 0.0601634830 0.0181759354 -0.0478776656 0.9984863400
  -0.0007929835 0.0072165681 -0.0016449483 0.0028526511 -0.0339449011 0.0012019852
  -0.0276663806 -0.0228236616 0.0599646531 0.0521065891 0.0467752628 -0.9972309470
  0.0010128506 0.0068327584 -0.0015669449 0.0019716499 0.1215026453 -0.0029433968
  -0.0508979894 -0.0152397202 0.0242596343 0.0583887286 0.1457754821 -0.9873850942
  0.0010538241 0.0310968217 -0.0052544442 0.0012725496 0.1301465631 -0.0041509592
  0.0597957522 -0.0152823469 0.0239371862 0.0589688122 -0.1448995322 0.9875707030
  -0.0008815173 0.0310810003 -0.0052313320 0.0012615219 -0.1295253187 0.0041525471
  0.0323061794 -0.0354700051 -0.0026834833 0.0058556385 -0.0512854978 -0.9986661077
  0.0000254397 -0.0005347168 0.0020843884 0.0002232871 0.1057975963 0.0033464564
  -0.0264448039 -0.0354450010 -0.0026831052 0.0114100939 0.0514625423 0.9984931946
  -0.0005580867 -0.0005250663 0.0020968122 0.0002190700 -0.1046594307 -0.0033967576
}

frame 5 {
  0.0000000000 0.0000000000 0.1000000015 0.7071068287 -0.0000000000 -0.0000000000
  0.2934706807 -0.3602214158 -0.0048920386 -0.4964132011 0.5035642385 -0.4966249764
  0.0000080306 0.5389489532 0.0002984107 -0.1784965396 0.0006216418 0.0037200642
  -0.1367243379 0.0571507849 0.0047000181 -0.1536253840 -0.1339017451 -0.6706203222
  0.0188574474 0.4485884011 -0.0004705940 0.2888039052 0.3329931796 -0.8429363966
  0.1511485279 0.0609211661 0.0145796333 -0.1419776082 0.1267754436 0.6779645681
  -0.0188738648 0.4384978712 -0.0002876827 0.2899525166 -0.3419176638 0.8366848230
  0.1626309454 0.2403567433 -0.0111524481 -0.1140462756 0.0412341282 0.4074379802
  -0.0141138379 0.5134067535 -0.0029777139 0.5176978707 0.0148990443 -0.0524834432
  -0.1620082259 0.2369901687 -0.0111990990 -0.1161567345 -0.0387639739 -0.4040533006
  0.0140234549 0.5051535368 -0.0030963980 0.5158702135 -0.0112202642 0.0485521220
  0.1429836303 0.3892854154 -0.0090858266 0.0015146526 -0.0004759943 0.1134820357
  -0.0042530205 0.4411717653 0.0003532195 0.4435115159 -0.0475538671 0.0968037546
  -0.1375855953 0.3922168612 -0.0144305658 -0.0074881758 0.0006939496 -0.1158684120
  0.0043573920 0.4400499165 0.0000142902 0.4546217620 0.0446319766 -0.0912352204
  0.0356778316 -0.0219234768 0.0603128709 0.0181757677 -0.0478775315 0.9984862804
  -0.0007877732 0.0072039417 -0.0014961100 0.0028526497 -0.0339449011 0.0012019773
  -0.0276663750 -0.0228254311 0.0601140521 0.0521066077 0.0467753522 -0.9972309470
  0.0009975918 0.0068202438 -0.0014189277 0.0019716599 0.1215026528 -0.0029434087
  -0.0508979931 -0.0152415158 0.0244091116 0.0583884418 0.1457761526 -0.9873850346
  0.0010373909 0.0310551692 -0.0051118387 0.0012725762 0.1301466227 -0.0041509452
  0.0597957484 -0.0152841890 0.0240866188 0.0589689203 -0.1449001729 0.9875705838
  -0.0008646809 0.0310397036 -0.0050888136 0.0012615544 -0.1295253187 0.0041525620
  0.0323061720 -0.0354717970 -0.0025340349 0.0058949939 -0.0512847118 -0.9986659884
  0.0000236723 -0.0005176496 0.0022327851 0.0002233128 0.1057976037 0.0033464460
  -0.0264448021 -0.0354467630 -0.0025336863 0.0114129148 0.0514624193 0.9984931946
  -0.0005543958 -0.0005079508 0.0022452581 0.0002190998 -0.1046594456 -0.0033967565
}

