MD5Version 10 // Parameters used during export: Reorient: False; Scale: 1.0
commandline ""

numFrames 10
numJoints 38
frameRate 60
numAnimatedComponents 228

hierarchy {
  "origin" -1 63 0 //
  "torso1" 0 63 6 //
  "plate2" 1 63 12 //
  "butt" 1 63 18 //
  "butt1" 3 63 24 //
  "butt2" 4 63 30 //
  "torso" 1 63 36 //
  "plate1" 6 63 42 //
  "neck" 6 63 48 //
  "plate" 8 63 54 //
  "head" 8 63 60 //
  "jaw" 10 63 66 //
  "jaw1" 11 63 72 //
  "jaw2" 12 63 78 //
  "eye_R" 10 63 84 //
  "eye1_R" 10 63 90 //
  "eye2_R" 10 63 96 //
  "eye_L" 10 63 102 //
  "eye1_L" 10 63 108 //
  "eye2_L" 10 63 114 //
  "arm_R" 8 63 120 //
  "arm1_R" 20 63 126 //
  "arm2_R" 21 63 132 //
  "arm_L" 8 63 138 //
  "arm1_L" 23 63 144 //
  "arm2_L" 24 63 150 //
  "mid_leg_R" 6 63 156 //
  "mid_leg1_R" 26 63 162 //
  "mid_leg2_R" 27 63 168 //
  "mid_leg_L" 6 63 174 //
  "mid_leg1_L" 29 63 180 //
  "mid_leg2_L" 30 63 186 //
  "back_leg_R" 1 63 192 //
  "back_leg1_R" 32 63 198 //
  "back_leg2_R" 33 63 204 //
  "back_leg_L" 1 63 210 //
  "back_leg1_L" 35 63 216 //
  "back_leg2_L" 36 63 222 //
}

bounds {
  ( -21.5717926025 -17.3202819824 -0.0299763456 ) ( 23.6628303528 17.3223876953 28.8835296631 )
  ( -21.3952293396 -17.3186111450 -0.0488733053 ) ( 23.5956459045 17.3266296387 28.6652107239 )
  ( -21.2247543335 -17.3185710907 -0.0740470886 ) ( 23.5069160461 17.3318233490 28.3867626190 )
  ( -21.1859893799 -17.3229141235 -0.0870653391 ) ( 23.4339027405 17.3357849121 28.1702136993 )
  ( -21.2608394623 -17.3244361877 -0.0881659985 ) ( 23.4044570923 17.3372077942 28.1248493195 )
  ( -21.4927330017 -17.3229141235 -0.0870652199 ) ( 23.4339027405 17.3357849121 28.2003707886 )
  ( -21.6369724274 -17.3185729980 -0.1635131836 ) ( 23.5069160461 17.3318233490 28.3867626190 )
  ( -21.5932559967 -17.3186111450 -0.0550532639 ) ( 23.5956459045 17.3266296387 28.6652107239 )
  ( -21.6262798309 -17.3202857971 -0.0426899791 ) ( 23.6628303528 17.3223838806 28.8835296631 )
  ( -21.6379737854 -17.3208045959 0.0114950929 ) ( 23.6832809448 17.3208026886 28.9616394043 )
}

baseframe {
  ( 0.0000000000 0.0000000000 3.0000000000 ) ( 0.7071068287 -0.0000000000 -0.0000000000 )
  ( -3.7220883369 -12.5883541107 -0.0158073828 ) ( 0.4658228457 0.5319861770 0.4658226967 )
  ( 0.0158069823 0.7253785133 -4.2293028831 ) ( 0.6815124154 0.1885223836 -0.6815125942 )
  ( -0.0000008617 1.0023927689 -2.2860689163 ) ( -0.0000003336 -0.0596590862 -0.9982188940 )
  ( 0.0000000022 5.2951149940 -0.0000035391 ) ( 0.0778666586 -0.0000000115 -0.0000000567 )
  ( 0.0000000016 5.5872893333 -0.0000021528 ) ( 0.0159793925 -0.0040049804 -0.0016346667 )
  ( -0.0000000006 5.4236173630 0.0000006886 ) ( 0.0150023354 -0.0000000872 0.0000000255 )
  ( 0.0158079248 2.6921281815 -2.7244765759 ) ( 0.6528964639 0.2715258896 -0.6528964043 )
  ( -0.0000000021 5.6076006889 0.0000002388 ) ( 0.0177963823 -0.0000022194 -0.0000192518 )
  ( 0.0159386676 3.2198216915 -1.4872399569 ) ( 0.5966547132 0.3794800341 -0.5966378450 )
  ( -0.0000000008 4.9625759125 0.0000001787 ) ( 0.0018392461 0.0000013021 0.0000192297 )
  ( 0.0159972087 -0.3164609075 2.4960210323 ) ( -0.1907610744 0.0000005140 -0.0000000139 )
  ( -0.0000000000 3.9519104958 -0.0000000000 ) ( 0.0602938719 0.0000000970 0.0000000065 )
  ( 0.0000000000 3.2605526447 -0.0000000000 ) ( 0.0867455527 -0.0000000546 -0.0000000094 )
  ( -5.7047095299 2.7340440750 -2.3252048492 ) ( 0.6987986565 -0.7152213454 0.0022497049 )
  ( -4.9808626175 4.7615990639 -1.6856462955 ) ( -0.5616764426 0.8254736662 -0.0105944872 )
  ( -4.1405067444 6.8342146873 -0.9228301048 ) ( 0.5536530614 -0.8290354013 -0.0782902539 )
  ( 5.7367138863 2.7340435982 -2.3251926899 ) ( -0.4867381752 -0.5081037879 0.5014085174 )
  ( 5.0128650665 4.7615985870 -1.6856358051 ) ( 0.5539450645 0.8213630319 0.0934752151 )
  ( 4.1725082397 6.8342146873 -0.9228212833 ) ( -0.5568270683 -0.8277298808 -0.0510365143 )
  ( -8.6595220566 -0.8033437729 2.2397105694 ) ( -0.2792378664 0.7978030443 0.5003764629 )
  ( -0.0000012517 7.2231278419 0.0000007153 ) ( 0.0927500799 -0.5032480955 -0.8570010662 )
  ( -0.0000008345 11.4308471680 -0.0000014305 ) ( -0.9652854204 0.0058597908 0.0368101969 )
  ( 8.6910619736 -0.8040108681 2.2397751808 ) ( -0.2775568962 -0.7984271049 -0.5013206601 )
  ( -0.0000006855 7.2231278419 -0.0000007153 ) ( 0.1676159203 0.5067350268 0.8455526233 )
  ( -0.0000004768 11.4308471680 0.0000002384 ) ( -0.9655788541 -0.0355931520 0.0280772764 )
  ( -7.7061944008 -0.1411822885 2.6340744495 ) ( -0.4844969809 0.6715618968 0.4026111066 )
  ( 0.0000000000 6.3036546707 -0.0000001192 ) ( 0.2013461739 -0.5005802512 -0.8413326740 )
  ( -0.0000001192 7.2933096886 0.0000000000 ) ( -0.9073526859 0.0195215177 -0.1706070751 )
  ( 7.7378115654 -0.1411831975 2.6340732574 ) ( -0.4643301368 -0.6897498369 -0.4257118702 )
  ( 0.0000001414 6.3036546707 0.0000001788 ) ( 0.1303734779 0.5009765625 0.8552095294 )
  ( 0.0000004470 7.2933082581 0.0000007153 ) ( -0.9134224653 -0.0079756901 0.1343692839 )
  ( -7.0111346245 1.1081303358 3.4398810863 ) ( -0.6126219630 0.5615828633 0.3317724168 )
  ( 0.0000003874 5.9885420799 0.0000001192 ) ( 0.0563724898 -0.5975179672 -0.7991786003 )
  ( 0.0000000298 6.1728172302 0.0000009537 ) ( -0.8802543879 0.0119903116 -0.0398214608 )
  ( 7.0427536964 1.1081300974 3.4398784637 ) ( -0.6268337369 -0.5410783887 -0.3040692806 )
  ( 0.0000000808 5.9885425568 -0.0000007749 ) ( 0.1305470318 0.5976420045 0.7904570103 )
  ( 0.0000002807 6.1728167534 0.0000001714 ) ( -0.8755496144 -0.0259163510 0.0992288291 )
}

frame 0 {
  0.0000000000 0.0000000000 3.0000000000 0.7071068287 -0.0000000000 -0.0000000000
  -3.7222235203 -12.5204906464 -0.0158073884 0.4661808908 0.5316774249 0.4661770165
  0.0158069823 0.7253773212 -4.2293043137 0.6815125346 0.1885223538 -0.6815126538
  -0.0000008625 1.0023918152 -2.2860677242 0.0002241024 -0.0914599448 -0.9958022237
  0.0000000047 5.2951159477 -0.0000004053 0.1378681064 -0.0001722264 -0.0031774098
  0.0000000000 5.5872888565 -0.0000006632 -0.0142771248 0.0026924303 -0.0084848301
  -0.0000000014 5.4236164093 0.0000009920 0.0045822319 0.0000023802 0.0000679366
  0.0158079248 2.6921286583 -2.7244760990 0.6533930302 0.2704383135 -0.6533388495
  0.0000000034 5.6076006889 0.0000014774 0.0302297212 -0.0000016592 0.0000134659
  0.0159386676 3.2198219299 -1.4872392416 0.5960227847 0.3803906739 -0.5960538387
  -0.0000000001 4.9625773430 0.0000009297 -0.0049787932 0.0003116588 0.0057779369
  0.0159972310 -0.3164615929 2.4960186481 -0.1930437237 -0.0000004033 0.0000066877
  -0.0000000243 3.9519083500 -0.0000029852 0.0724275336 0.0000002887 0.0000031071
  0.0000000119 3.2605540752 -0.0000009907 0.0826299936 0.0002510195 0.0000459472
  -5.7047100067 2.7340435982 -2.3252062798 0.6987987757 -0.7152211666 0.0022497058
  -4.9808630943 4.7615976334 -1.6856480837 -0.5616764426 0.8254736662 -0.0105944872
  -4.1405062675 6.8342151642 -0.9228322506 0.5536530614 -0.8290354013 -0.0782902613
  5.7367138863 2.7340431213 -2.3251950741 -0.4867381752 -0.5081037879 0.5014085174
  5.0128655434 4.7615971565 -1.6856371164 0.5539450645 0.8213630319 0.0934750587
  4.1725091934 6.8342137337 -0.9228237271 -0.5568271875 -0.8277297616 -0.0510368310
  -8.6595230103 -0.8033443093 2.2397105694 -0.2791942060 0.8041276932 0.4908978939
  0.0000004694 7.2231273651 0.0000002384 0.0924829170 -0.5081388354 -0.8540912867
  0.0000009537 11.4308490753 0.0000023842 -0.9660663009 0.0046552122 0.0368315093
  8.6910619736 -0.8040121794 2.2397742271 -0.2773775756 -0.8077562451 -0.4873839617
  -0.0000021681 7.2231264114 0.0000007153 0.1669648588 0.5141231418 0.8412020206
  -0.0000001267 11.4308500290 0.0000004768 -0.9674423933 -0.0335486047 0.0283731353
  -7.7061963081 -0.1411824971 2.6340739727 -0.5046398640 0.6485996246 0.3981708288
  0.0000001602 6.3036522865 0.0000032634 0.1861840785 -0.4844570458 -0.8547729850
  0.0000007153 7.2933082581 0.0000009537 -0.9112063050 0.0397366919 -0.1630103290
  7.7378115654 -0.1411836445 2.6340737343 -0.4518742859 -0.7070260644 -0.4228187501
  0.0000002682 6.3036537170 0.0000014305 0.1417303532 0.5017644763 0.8520908952
  0.0000000000 7.2933082581 0.0000007153 -0.9149270058 0.0301174317 0.1107460856
  -7.0111351013 1.1081296206 3.4398818016 -0.6345728040 0.5241736770 0.3277447224
  -0.0000002980 5.9885449409 -0.0000019670 0.0345608518 -0.5841553807 -0.8109037280
  -0.0000001788 6.1728172302 0.0000010133 -0.8834968209 0.0390538611 -0.0128345480
  7.0427541733 1.1081300974 3.4398791790 -0.6074671149 -0.5818794370 -0.3011507690
  0.0000003427 5.9885430336 0.0000020564 0.1499530077 0.6123847365 0.7737687230
  -0.0000004172 6.1728162766 -0.0000003874 -0.8739953637 -0.0020649645 0.1192924157
}

frame 1 {
  0.0000000000 0.0000000000 3.0000000000 0.7071068287 -0.0000000000 -0.0000000000
  -3.7223646641 -12.3311691284 -0.0158074014 0.4671885073 0.5308064222 0.4671740830
  0.0158069842 0.7253775597 -4.2293052673 0.6815125346 0.1885222644 -0.6815126538
  -0.0000008630 1.0023914576 -2.2860670090 0.0017860413 -0.1392700672 -0.9902114868
  0.0000000186 5.2951145172 0.0000010470 0.2254210114 -0.0006151896 -0.0189660601
  -0.0000000745 5.5872893333 0.0000000093 -0.0596027188 0.0129381157 -0.0220407732
  0.0000000012 5.4236168861 0.0000017501 -0.0135931941 0.0000108447 0.0001583671
  0.0158079267 2.6921288967 -2.7244758606 0.6544492841 0.2681083977 -0.6542789936
  0.0000000006 5.6076002121 0.0000001038 0.0470711924 -0.0000002426 0.0002662317
  0.0159386713 3.2198209763 -1.4872385263 0.5946652889 0.3823361099 -0.5947990417
  -0.0000000002 4.9625763893 0.0000004635 -0.0142947892 0.0012143411 0.0219454896
  0.0159972683 -0.3164615631 2.4960210323 -0.2007845193 -0.0000060544 0.0000528367
  0.0000000205 3.9519109726 0.0000013607 0.0949734598 0.0000017011 0.0000322001
  -0.0000000047 3.2605521679 0.0000005167 0.0810815692 0.0009655541 0.0001424990
  -5.7047095299 2.7340459824 -2.3252055645 0.6987988949 -0.7152209878 0.0022471321
  -4.9808621407 4.7616004944 -1.6856459379 -0.5616764426 0.8254736662 -0.0105947591
  -4.1405067444 6.8342170715 -0.9228317142 0.5536530614 -0.8290354013 -0.0782902539
  5.7367138863 2.7340440750 -2.3251941204 -0.4867381752 -0.5081037879 0.5014085770
  5.0128650665 4.7615981102 -1.6856364012 0.5539450049 0.8213630915 0.0934752002
  4.1725087166 6.8342161179 -0.9228221178 -0.5568271875 -0.8277297020 -0.0510361940
  -8.6595220566 -0.8033446074 2.2397117615 -0.2789229155 0.8205424547 0.4651502371
  0.0000012773 7.2231283188 -0.0000002384 0.0916915238 -0.5216374397 -0.8458683491
  0.0000003576 11.4308462143 0.0000000000 -0.9662787318 -0.0016635129 0.0374113023
  8.6910638809 -0.8040108085 2.2397751808 -0.2764703631 -0.8317458630 -0.4490963817
  -0.0000009872 7.2231283188 -0.0000009537 0.1649682522 0.5351846814 0.8283367753
  0.0000001639 11.4308490753 0.0000009537 -0.9703393579 -0.0258788075 0.0284014177
  -7.7061948776 -0.1411822289 2.6340734959 -0.5282372832 0.6328431368 0.3820573986
  0.0000001192 6.3036546707 0.0000004619 -0.1698579937 0.4776602983 0.8613394499
  -0.0000002384 7.2933101654 0.0000005960 -0.9165437222 0.0534446090 -0.1546289474
  7.7378101349 -0.1411832124 2.6340742111 -0.4417940080 -0.7328264117 -0.4056325853
  -0.0000007749 6.3036546707 0.0000010133 0.1523215622 0.5076119304 0.8454008102
  0.0000000000 7.2933096886 -0.0000004768 -0.9159002900 0.0738946646 0.0860260651
  -7.0111351013 1.1081296206 3.4398815632 -0.6621699929 0.4900172353 0.3153331280
  0.0000000298 5.9885406494 0.0000008345 -0.0125734108 0.5771355033 0.8159323931
  0.0000003725 6.1728177071 0.0000005960 -0.8884139061 0.0681070760 0.0143778855
  7.0427541733 1.1081292629 3.4398777485 -0.5894017220 -0.6252583861 -0.2884853780
  -0.0000000894 5.9885416031 0.0000003427 0.1664027870 0.6314080954 0.7517697215
  0.0000002384 6.1728200912 0.0000008345 -0.8746264577 0.0206882898 0.1346904039
}

frame 2 {
  0.0000000000 0.0000000000 3.0000000000 0.7071068287 -0.0000000000 -0.0000000000
  -3.7222650051 -12.0902328491 -0.0158074200 0.4684799016 0.5296853781 0.4684519470
  0.0158069823 0.7253777981 -4.2293033600 0.6815125346 0.1885222644 -0.6815125942
  -0.0000008648 1.0023915768 -2.2860672474 -0.0042637726 0.1712386459 0.9851580858
  0.0000000000 5.2951149940 0.0000009548 0.2817222178 -0.0010583112 -0.0416767597
  0.0000001788 5.5872888565 0.0000008820 -0.0893758088 0.0239794776 -0.0313000269
  -0.0000000048 5.4236159325 -0.0000014437 -0.0288888812 0.0000264725 0.0001159337
  0.0158079248 2.6921284199 -2.7244765759 0.6549396515 0.2670181692 -0.6547152996
  0.0000000084 5.6075997353 0.0000026088 0.0518882163 0.0000015769 0.0009286563
  0.0159386732 3.2198209763 -1.4872406721 0.5940285325 0.3832436204 -0.5942103267
  0.0000000041 4.9625759125 -0.0000001569 -0.0174894780 0.0028151441 0.0424943417
  0.0159971099 -0.3164620697 2.4960181713 -0.2078402936 -0.0000110952 0.0001063203
  -0.0000002589 3.9519093037 -0.0000011846 0.1174468324 0.0000035193 0.0000834725
  -0.0000000931 3.2605552673 -0.0000006566 0.0826041549 0.0018825741 0.0002830580
  -5.7047100067 2.7340443134 -2.3252060413 0.6987987757 -0.7152211666 0.0022484185
  -4.9808626175 4.7615990639 -1.6856471300 -0.5616764426 0.8254737258 -0.0105947591
  -4.1405067444 6.8342137337 -0.9228309989 0.5536530614 -0.8290354013 -0.0782902613
  5.7367143631 2.7340428829 -2.3251943588 -0.4867382050 -0.5081037879 0.5014085174
  5.0128660202 4.7615981102 -1.6856374741 0.5539451241 0.8213630319 0.0934752151
  4.1725087166 6.8342142105 -0.9228224158 -0.5568271279 -0.8277298212 -0.0510362014
  -8.6595220566 -0.8033451438 2.2397110462 -0.2784294188 0.8412494659 0.4297509193
  -0.0000002403 7.2231283188 -0.0000026226 0.0903508812 -0.5394074321 -0.8346465826
  0.0000014305 11.4308452606 -0.0000004768 -0.9647049308 -0.0129728559 0.0387887172
  8.6910600662 -0.8040120602 2.2397742271 -0.2746441066 -0.8603787422 -0.3974844217
  -0.0000002608 7.2231283188 -0.0000014305 0.1617813259 0.5635521412 0.8099180460
  0.0000004768 11.4308500290 0.0000019073 -0.9717420936 -0.0138971685 0.0273047611
  -7.7061958313 -0.1411820501 2.6340754032 -0.5555199981 0.6183036566 0.3620076478
  -0.0000003427 6.3036551476 0.0000006519 -0.1527327746 0.4793931842 0.8615098596
  0.0000001192 7.2933082581 -0.0000003576 -0.9212087989 0.0698585883 -0.1475961804
  7.7378115654 -0.1411831826 2.6340751648 -0.4320626855 -0.7598682642 -0.3823156953
  0.0000001788 6.3036541939 0.0000003576 0.1612362564 0.5166680813 0.8364031911
  0.0000007153 7.2933096886 0.0000009537 -0.9149813056 0.1133905426 0.0600392036
  -7.0111360550 1.1081291437 3.4398791790 -0.6924045086 0.4558374882 0.2996989489
  0.0000002384 5.9885425568 0.0000010729 0.0090311235 0.5726925731 0.8167747259
  0.0000005960 6.1728200912 -0.0000004768 -0.8932273984 0.1007386148 0.0404811427
  7.0427541733 1.1081290245 3.4398770332 -0.6336724162 -0.5227195024 -0.3059500456
  0.0000000158 5.9885439873 -0.0000006557 0.1277666241 0.5407612324 0.8312765360
  0.0000002086 6.1728162766 0.0000005467 -0.8981798887 -0.0146782640 0.1244630516
}

frame 3 {
  0.0000000000 0.0000000000 3.0000000000 0.7071068287 -0.0000000000 -0.0000000000
  -3.7221183777 -11.9031143188 -0.0158074349 0.4694837034 0.5288100839 0.4694452286
  0.0158069804 0.7253775597 -4.2293043137 0.6815124750 0.1885222793 -0.6815125942
  -0.0000008627 1.0023916960 -2.2860696316 -0.0054106782 0.1812680066 0.9833550453
  -0.0000000075 5.2951159477 -0.0000036081 0.2989123762 -0.0012306549 -0.0518499836
  0.0000001192 5.5872874260 -0.0000016261 -0.0985215157 0.0283200238 -0.0338537581
  -0.0000000015 5.4236159325 -0.0000021073 -0.0363259688 0.0000443995 -0.0001013537
  0.0158079267 2.6921286583 -2.7244777679 0.6548477411 0.2672230303 -0.6546335816
  -0.0000000122 5.6076011658 -0.0000049997 0.0462043025 0.0000029952 0.0018372446
  0.0159386676 3.2198204994 -1.4872405529 0.5941482186 0.3830733001 -0.5943210125
  0.0000000001 4.9625768661 -0.0000012212 -0.0150200725 0.0046589961 0.0582192689
  0.0159971938 -0.3164633811 2.4960205555 -0.2120655179 -0.0000137879 0.0001447952
  -0.0000001192 3.9519083500 -0.0000003520 0.1320952624 0.0000049361 0.0001313931
  0.0000002012 3.2605519295 0.0000006724 0.0853276923 0.0025963669 0.0004036943
  -5.7047100067 2.7340435982 -2.3252055645 0.6987987757 -0.7152211070 0.0022484192
  -4.9808626175 4.7615976334 -1.6856452227 -0.5616764426 0.8254737258 -0.0105942152
  -4.1405067444 6.8342146873 -0.9228300452 0.5536530614 -0.8290354013 -0.0782902688
  5.7367124557 2.7340421677 -2.3251924515 -0.4867381752 -0.5081038475 0.5014085174
  5.0128645897 4.7615957260 -1.6856347322 0.5539451241 0.8213630915 0.0934752077
  4.1725082397 6.8342137337 -0.9228209257 -0.5568271279 -0.8277298212 -0.0510365181
  -8.6595249176 -0.8033447862 2.2397108078 -0.2780078650 0.8566086888 0.4008790851
  0.0000008717 7.2231278419 0.0000000000 0.0890246108 -0.5530664325 -0.8257216811
  -0.0000001192 11.4308452606 -0.0000004768 -0.9623759985 -0.0232818294 0.0400797315
  8.6910638809 -0.8040115833 2.2397732735 -0.2727297843 -0.8806539774 -0.3557136953
  0.0000003949 7.2231283188 -0.0000014305 0.1587659121 0.5861356854 0.7943190336
  -0.0000000596 11.4308490753 0.0000011921 -0.9715277553 -0.0037513154 0.0257810969
  -7.7061953545 -0.1411821842 2.6340734959 -0.5330268145 0.7031005621 0.2988419831
  0.0000003129 6.3036537170 0.0000005066 -0.1830473095 0.4711766839 0.8627599478
  -0.0000007413 7.2933096886 0.0000004768 -0.9530779123 0.0264995173 -0.0823395848
  7.7378101349 -0.1411830038 2.6340742111 -0.4204796851 -0.7827202082 -0.3622821867
  -0.0000001192 6.3036565781 -0.0000003576 0.1687147468 0.5273779631 0.8259360194
  -0.0000002384 7.2933087349 0.0000002384 -0.9106557965 0.1449680328 0.0334291905
  -7.0111346245 1.1081292629 3.4398789406 -0.7022668719 0.4432716966 0.2942992151
  -0.0000002384 5.9885435104 0.0000021458 0.0167051591 0.5710664392 0.8164568543
  -0.0000006557 6.1728172302 0.0000004768 -0.8929247856 0.1390524805 0.0121398317
  7.0427536964 1.1081290245 3.4398765564 -0.6948878169 -0.4302397370 -0.2801173627
  -0.0000003669 5.9885406494 -0.0000002384 -0.0733673275 -0.5270426869 -0.8435363770
  0.0000001192 6.1728162766 -0.0000004768 -0.9063017964 -0.0562004782 0.0994603708
}

frame 4 {
  0.0000000000 0.0000000000 3.0000000000 0.7071068287 -0.0000000000 -0.0000000000
  -3.7220883369 -11.8365135193 -0.0158074386 0.4698396623 0.5284988284 0.4697974324
  0.0158069842 0.7253780365 -4.2293043137 0.6815124154 0.1885223091 -0.6815126538
  -0.0000008620 1.0023921728 -2.2860677242 0.0033454315 -0.1699753404 -0.9854023457
  0.0000000000 5.2951154709 0.0000024170 0.2804381251 -0.0008396996 -0.0327909701
  -0.0000000298 5.5872874260 -0.0000014659 -0.0884016231 0.0231663492 -0.0313576534
  -0.0000000001 5.4236168861 0.0000005768 -0.0377824306 0.0000527150 -0.0002406168
  0.0158079248 2.6921286583 -2.7244777679 0.6545752883 0.2678286731 -0.6543912888
  0.0000000084 5.6076002121 0.0000039475 0.0416424684 0.0000034972 0.0022922910
  0.0159386639 3.2198221684 -1.4872412682 0.5945020318 0.3825690448 -0.5946481228
  -0.0000000042 4.9625768661 -0.0000002614 -0.0127881253 0.0055042203 0.0637054443
  0.0159969293 -0.3164614141 2.4960176945 -0.2133746296 -0.0000145116 0.0001578261
  0.0000001006 3.9519095421 -0.0000010692 0.1368744820 0.0000054395 0.0001496797
  0.0000001378 3.2605521679 -0.0000000242 0.0865162164 0.0028493968 0.0004488444
  -5.7047100067 2.7340438366 -2.3252062798 0.6987989545 -0.7152209878 0.0022484188
  -4.9808626175 4.7615985870 -1.6856477261 -0.5616764426 0.8254737258 -0.0105944872
  -4.1405072212 6.8342142105 -0.9228315353 0.5536530614 -0.8290354013 -0.0782902613
  5.7367129326 2.7340426445 -2.3251941204 -0.4867381454 -0.5081037879 0.5014085770
  5.0128645897 4.7615981102 -1.6856366396 0.5539450049 0.8213632107 0.0934749171
  4.1725077629 6.8342146873 -0.9228234291 -0.5568271875 -0.8277297616 -0.0510365069
  -8.6595249176 -0.8033437133 2.2397108078 -0.2778820395 0.8619129658 0.3902609348
  0.0000015600 7.2231283188 0.0000011921 0.0884746462 -0.5577807426 -0.8225877881
  -0.0000001192 11.4308481216 0.0000004768 -0.9612772465 -0.0273247622 0.0405951031
  8.6910610199 -0.8040109873 2.2397742271 -0.2719565630 -0.8874698877 -0.3403862119
  0.0000011623 7.2231268883 0.0000004768 0.1575607061 0.5941848755 0.7885539532
  0.0000004172 11.4308490753 -0.0000007153 -0.9711642861 0.0000750231 0.0250558518
  -7.7061944008 -0.1411824524 2.6340734959 -0.4777852893 0.8046286702 0.2147395909
  -0.0000001788 6.3036551476 0.0000014901 0.2174966782 -0.5261529684 -0.8186216950
  -0.0000009537 7.2933082581 0.0000014305 -0.9562007189 -0.0611353219 -0.0427057259
  7.7378106117 -0.1411833912 2.6340730190 -0.4595621228 -0.7310554981 -0.3867357671
  0.0000002384 6.3036532402 0.0000005364 0.1441892982 0.4815880358 0.8632171154
  0.0000001192 7.2933092117 -0.0000007153 -0.9297769666 0.0838045552 0.0710588917
  -7.0111351013 1.1081300974 3.4398791790 -0.7085177302 0.4284979403 0.2937457561
  0.0000007153 5.9885425568 -0.0000015497 0.0238375440 0.5722861886 0.8138974905
  0.0000001788 6.1728181839 0.0000014305 -0.8857697248 0.1734977216 -0.0167274810
  7.0427546501 1.1081298590 3.4398767948 -0.7696871758 -0.3517652154 -0.2355044782
  0.0000005364 5.9885425568 0.0000000000 -0.0201273356 -0.5912155509 -0.7884886861
  -0.0000004768 6.1728177071 0.0000007153 -0.8940894604 -0.1025688499 0.0918390825
}

frame 5 {
  0.0000000000 0.0000000000 3.0000000000 0.7071068287 -0.0000000000 -0.0000000000
  -3.7221183777 -11.9031143188 -0.0158074349 0.4694837034 0.5288100839 0.4694452286
  0.0158069804 0.7253775597 -4.2293043137 0.6815124750 0.1885222793 -0.6815127134
  -0.0000008630 1.0023916960 -2.2860696316 -0.0004142206 -0.1260976940 -0.9920140505
  0.0000000056 5.2951159477 -0.0000023342 0.2042487413 0.0001670253 0.0045999466
  0.0000000037 5.5872888565 0.0000006648 -0.0474152677 0.0099324696 -0.0167065859
  -0.0000000017 5.4236159325 -0.0000021073 -0.0363259688 0.0000443995 -0.0001013537
  0.0158079248 2.6921286583 -2.7244777679 0.6541589499 0.2687509954 -0.6540207863
  -0.0000000127 5.6076011658 -0.0000049997 0.0462043025 0.0000029952 0.0018372446
  0.0159386676 3.2198204994 -1.4872405529 0.5950402021 0.3818002641 -0.5951456428
  -0.0000000006 4.9625768661 -0.0000012212 -0.0150200725 0.0046589957 0.0582192689
  0.0159972049 -0.3164633811 2.4960205555 -0.2120655179 -0.0000137890 0.0001448070
  -0.0000002384 3.9519083500 -0.0000003558 0.1320952624 0.0000049388 0.0001314008
  -0.0000000633 3.2605519295 0.0000006706 0.0853276923 0.0025963699 0.0004036695
  -5.7047100067 2.7340435982 -2.3252055645 0.6987988353 -0.7152211666 0.0022484194
  -4.9808626175 4.7615976334 -1.6856452227 -0.5616764426 0.8254737258 -0.0105942152
  -4.1405067444 6.8342146873 -0.9228300452 0.5536530614 -0.8290354013 -0.0782902688
  5.7367124557 2.7340421677 -2.3251924515 -0.4867381752 -0.5081038475 0.5014085174
  5.0128645897 4.7615957260 -1.6856347322 0.5539451241 0.8213630915 0.0934752077
  4.1725082397 6.8342137337 -0.9228209257 -0.5568270087 -0.8277298808 -0.0510365143
  -8.6595249176 -0.8033447862 2.2397108078 -0.2780078650 0.8566086888 0.4008790851
  0.0000008717 7.2231278419 0.0000000000 0.0890246108 -0.5530664325 -0.8257216811
  -0.0000001192 11.4308452606 -0.0000004768 -0.9623759985 -0.0232818294 0.0400797278
  8.6910638809 -0.8040115833 2.2397732735 -0.2727297843 -0.8806539774 -0.3557136953
  0.0000003949 7.2231283188 -0.0000014305 0.1587659121 0.5861356854 0.7943190336
  -0.0000000596 11.4308490753 0.0000011921 -0.9715277553 -0.0037513115 0.0257810969
  -7.7061953545 -0.1411821842 2.6340734959 -0.4672541022 0.7699627280 0.3004365861
  0.0000002831 6.3036541939 0.0000001788 0.2114621699 -0.5958332419 -0.7698338032
  -0.0000001192 7.2933092117 0.0000007153 -0.9057801962 -0.1044024155 0.0712616071
  7.7378101349 -0.1411830038 2.6340742111 -0.4964334667 -0.6818764806 -0.3945308626
  0.0000000000 6.3036551476 0.0000008941 -0.1127548739 -0.4642244577 -0.8784078956
  -0.0000001490 7.2933092117 -0.0000008345 -0.9343943000 0.0144436536 0.1005599722
  -7.0111346245 1.1081292629 3.4398789406 -0.6594858766 0.4593912959 0.3307502568
  0.0000002980 5.9885430336 0.0000008345 -0.0050874301 0.5212602615 0.8517111540
  0.0000002831 6.1728181839 0.0000009537 -0.8828642964 0.1425538957 0.0599528514
  7.0427536964 1.1081290245 3.4398765564 -0.7359616756 -0.3867095113 -0.2537350953
  0.0000003576 5.9885416031 0.0000000000 -0.0417258777 -0.5628259182 -0.8160663843
  -0.0000004768 6.1728181839 -0.0000011921 -0.8997918963 -0.0881310403 0.0808197558
}

frame 6 {
  0.0000000000 0.0000000000 3.0000000000 0.7071068287 -0.0000000000 -0.0000000000
  -3.7222650051 -12.0902328491 -0.0158074200 0.4684799016 0.5296853781 0.4684519470
  0.0158069823 0.7253777981 -4.2293033600 0.6815125346 0.1885222644 -0.6815125942
  -0.0000008650 1.0023915768 -2.2860672474 0.0007082817 -0.0184940342 -0.9992287755
  0.0000000149 5.2951140404 0.0000000512 0.0030205899 0.0010720916 0.0006640850
  0.0000000149 5.5872888565 -0.0000010653 0.0550579280 -0.0010833308 0.0206387956
  -0.0000000051 5.4236159325 -0.0000014437 -0.0288888812 0.0000264724 0.0001159337
  0.0158079248 2.6921284199 -2.7244765759 0.6536850929 0.2697964311 -0.6535990238
  0.0000000078 5.6075997353 0.0000026088 0.0518882163 0.0000015769 0.0009286561
  0.0159386713 3.2198209763 -1.4872406721 0.5956493020 0.3809274137 -0.5957086086
  0.0000000041 4.9625759125 -0.0000001569 -0.0174894780 0.0028151441 0.0424943417
  0.0159971137 -0.3164620697 2.4960181713 -0.2078402936 -0.0000110952 0.0001063203
  -0.0000002589 3.9519093037 -0.0000011846 0.1174468324 0.0000035190 0.0000834727
  -0.0000000931 3.2605552673 -0.0000006557 0.0826041549 0.0018825745 0.0002830580
  -5.7047104836 2.7340443134 -2.3252060413 0.6987987757 -0.7152211666 0.0022484185
  -4.9808630943 4.7615990639 -1.6856471300 -0.5616764426 0.8254737258 -0.0105947591
  -4.1405067444 6.8342137337 -0.9228309989 0.5536530614 -0.8290354013 -0.0782902613
  5.7367143631 2.7340428829 -2.3251943588 -0.4867382050 -0.5081037879 0.5014085174
  5.0128655434 4.7615981102 -1.6856373549 0.5539451241 0.8213630319 0.0934752151
  4.1725082397 6.8342137337 -0.9228224158 -0.5568270683 -0.8277298212 -0.0510361940
  -8.6595220566 -0.8033451438 2.2397110462 -0.2784294188 0.8412494659 0.4297509193
  -0.0000002403 7.2231283188 -0.0000026226 0.0903508812 -0.5394074321 -0.8346465826
  0.0000014305 11.4308452606 -0.0000004768 -0.9647048116 -0.0129728587 0.0387887023
  8.6910600662 -0.8040120602 2.2397742271 -0.2746441066 -0.8603787422 -0.3974844217
  -0.0000002608 7.2231283188 -0.0000014305 0.1617813259 0.5635521412 0.8099180460
  0.0000004768 11.4308500290 0.0000019073 -0.9717420936 -0.0138971685 0.0273047611
  -7.7061958313 -0.1411820501 2.6340754032 -0.4721677899 0.7484089732 0.3265792429
  -0.0000003129 6.3036537170 0.0000016093 0.2108104676 -0.5707142353 -0.7901031375
  -0.0000004768 7.2933120728 -0.0000004768 -0.9143870473 -0.0804481208 0.0083094137
  7.7378115654 -0.1411831826 2.6340751648 -0.5381531119 -0.6377661228 -0.3879379332
  0.0000005960 6.3036556244 -0.0000001416 -0.0797893479 -0.4782074690 -0.8713153005
  -0.0000001788 7.2933092117 -0.0000010431 -0.9249603748 -0.0553105138 0.1285111457
  -7.0111360550 1.1081291437 3.4398791790 -0.5778965950 0.5258483291 0.3832024634
  0.0000006557 5.9885416031 0.0000009835 0.0619714409 -0.4903700054 -0.8688486814
  -0.0000004768 6.1728186607 -0.0000001788 -0.8689507842 0.0815120488 0.0497172959
  7.0427541733 1.1081290245 3.4398770332 -0.7015448213 -0.4198842347 -0.2770808637
  -0.0000001462 5.9885430336 0.0000007153 -0.0652200952 -0.5489652753 -0.8293289542
  -0.0000004768 6.1728181839 -0.0000011921 -0.8979489803 -0.0693444982 0.0733871683
}

frame 7 {
  0.0000000000 0.0000000000 3.0000000000 0.7071068287 -0.0000000000 -0.0000000000
  -3.7223646641 -12.3311691284 -0.0158074014 0.4671885073 0.5308064222 0.4671740830
  0.0158069823 0.7253775597 -4.2293052673 0.6815125346 0.1885222644 -0.6815125942
  -0.0000008647 1.0023914576 -2.2860670090 0.0009320039 -0.0172047634 -0.9988144636
  -0.0000000149 5.2951145172 -0.0000025650 0.0032766487 0.0014126709 0.0009367493
  -0.0000001788 5.5872888565 -0.0000008621 0.0565762892 -0.0046738875 0.0346434638
  -0.0000000004 5.4236168861 0.0000017501 -0.0135931941 0.0000108447 0.0001583671
  0.0158079267 2.6921288967 -2.7244758606 0.6532657743 0.2707174718 -0.6532255411
  -0.0000000004 5.6076002121 0.0000001038 0.0470711924 -0.0000002426 0.0002662316
  0.0159386694 3.2198209763 -1.4872385263 0.5961851478 0.3801570237 -0.5962038636
  0.0000000006 4.9625763893 0.0000004635 -0.0142947892 0.0012143414 0.0219454896
  0.0159973204 -0.3164615631 2.4960210323 -0.2007845193 -0.0000060532 0.0000528368
  0.0000000307 3.9519109726 0.0000013597 0.0949734524 0.0000017021 0.0000322021
  0.0000000773 3.2605531216 0.0000005153 0.0810815692 0.0009655396 0.0001424412
  -5.7047095299 2.7340459824 -2.3252055645 0.6987988949 -0.7152209878 0.0022471321
  -4.9808621407 4.7616004944 -1.6856459379 -0.5616764426 0.8254736662 -0.0105947591
  -4.1405067444 6.8342170715 -0.9228317142 0.5536530614 -0.8290354013 -0.0782902539
  5.7367134094 2.7340440750 -2.3251941204 -0.4867381752 -0.5081037879 0.5014085770
  5.0128650665 4.7615981102 -1.6856364012 0.5539450049 0.8213630915 0.0934752002
  4.1725087166 6.8342161179 -0.9228221178 -0.5568271875 -0.8277297020 -0.0510361940
  -8.6595220566 -0.8033446074 2.2397117615 -0.2789229155 0.8205424547 0.4651502371
  0.0000012773 7.2231283188 -0.0000002384 0.0916915238 -0.5216374397 -0.8458683491
  0.0000003576 11.4308462143 0.0000000000 -0.9662787318 -0.0016635129 0.0374113023
  8.6910638809 -0.8040108085 2.2397751808 -0.2764703929 -0.8317460418 -0.4490963817
  -0.0000004321 7.2231292725 0.0000004768 0.1649710983 0.5351847410 0.8283362985
  -0.0000000894 11.4308490753 0.0000004768 -0.9703393579 -0.0258788653 0.0284014288
  -7.7061948776 -0.1411822289 2.6340734959 -0.4758384526 0.7216380835 0.3577541113
  -0.0000000894 6.3036551476 -0.0000000596 0.2090326548 -0.5455738306 -0.8092512488
  0.0000001788 7.2933092117 0.0000007153 -0.9166254401 -0.0480296277 -0.0541653149
  7.7378101349 -0.1411832124 2.6340742111 -0.5094209909 -0.6522389650 -0.4070092142
  -0.0000004172 6.3036551476 0.0000012517 -0.0970911682 -0.4768713117 -0.8726784587
  0.0000007153 7.2933106422 -0.0000001192 -0.9210332632 -0.0395125225 0.1299470663
  -7.0111351013 1.1081296206 3.4398815632 -0.5416501164 0.5674195290 0.3981754780
  0.0000003129 5.9885416031 0.0000000596 0.0915419459 -0.5050225854 -0.8551863432
  0.0000000000 6.1728177071 0.0000004023 -0.8340061903 0.0716753304 0.1033633575
  7.0427541733 1.1081292629 3.4398777485 -0.6698877811 -0.4551310837 -0.2973281443
  -0.0000001788 5.9885420799 0.0000000000 -0.0888511389 -0.5509634018 -0.8288255334
  0.0000002384 6.1728153229 -0.0000014305 -0.8908604980 -0.0531803444 0.0706477761
}

frame 8 {
  0.0000000000 0.0000000000 3.0000000000 0.7071068287 -0.0000000000 -0.0000000000
  -3.7222235203 -12.5204906464 -0.0158073884 0.4661808908 0.5316774249 0.4661770165
  0.0158069823 0.7253775597 -4.2293043137 0.6815124750 0.1885222793 -0.6815127134
  -0.0000008624 1.0023920536 -2.2860677242 0.0004899426 -0.0191849675 -0.9995256066
  0.0000000075 5.2951145172 0.0000016676 0.0031238974 0.0007460751 0.0004803745
  -0.0000000373 5.5872888565 -0.0000014270 0.0544711277 -0.0027469839 0.0151128564
  -0.0000000013 5.4236164093 0.0000010218 0.0045822249 0.0000023802 0.0000679366
  0.0158079267 2.6921286583 -2.7244760990 0.6529898643 0.2713217139 -0.6529796720
  0.0000000037 5.6076006889 0.0000015967 0.0302297231 -0.0000016592 0.0000134659
  0.0159386676 3.2198214531 -1.4872398376 0.5965361595 0.3796510696 -0.5965282917
  0.0000000001 4.9625768661 -0.0000006796 -0.0049787951 0.0003116592 0.0057779369
  0.0159972068 -0.3164627850 2.4960186481 -0.1930427402 -0.0000004027 0.0000066835
  -0.0000000087 3.9519078732 -0.0000015537 0.0724252164 0.0000002886 0.0000031049
  -0.0000000105 3.2605552673 -0.0000024233 0.0826313198 0.0002510191 0.0000459535
  -5.7047100067 2.7340433598 -2.3252065182 0.6987986565 -0.7152212858 0.0022497061
  -4.9808630943 4.7615976334 -1.6856472492 -0.5616764426 0.8254737854 -0.0105944881
  -4.1405062675 6.8342151642 -0.9228323698 0.5536530614 -0.8290354013 -0.0782902613
  5.7367138863 2.7340428829 -2.3251953125 -0.4867381752 -0.5081037879 0.5014085174
  5.0128655434 4.7615971565 -1.6856372356 0.5539450049 0.8213630319 0.0934752077
  4.1725091934 6.8342132568 -0.9228238463 -0.5568271875 -0.8277297616 -0.0510368310
  -8.6595230103 -0.8033442497 2.2397089005 -0.2791941464 0.8041277528 0.4908976257
  0.0000010803 7.2231283188 0.0000000000 0.0924828798 -0.5081396699 -0.8540907502
  0.0000002384 11.4308471680 0.0000000000 -0.9660663009 0.0046553803 0.0368312970
  8.6910619736 -0.8040121198 2.2397725582 -0.2773777843 -0.8077562451 -0.4873838723
  -0.0000012591 7.2231273651 0.0000009537 0.1669621468 0.5141233802 0.8412023783
  -0.0000004359 11.4308481216 -0.0000007153 -0.9674422741 -0.0335484892 0.0283731353
  -7.7061963081 -0.1411822289 2.6340739727 -0.4795219600 0.6937243342 0.3858309984
  0.0000000745 6.3036541939 0.0000023842 0.2057115436 -0.5216581821 -0.8266552091
  -0.0000011591 7.2933111191 -0.0000007153 -0.9136702418 -0.0114275385 -0.1142207608
  7.7378115654 -0.1411833763 2.6340746880 -0.4848393500 -0.6675231457 -0.4221782684
  0.0000003129 6.3036527634 0.0000020266 -0.1140236780 -0.4841567576 -0.8674919605
  0.0000002384 7.2933092117 0.0000010729 -0.9164992571 -0.0268715676 0.1325283051
  -7.0111351013 1.1081298590 3.4398808479 -0.5750451684 0.5627374053 0.3691817224
  0.0000003874 5.9885416031 0.0000015199 0.0745661333 -0.5456702709 -0.8330621123
  0.0000000596 6.1728167534 0.0000001006 -0.8609300256 0.0397804752 0.0332869627
  7.0427541733 1.1081296206 3.4398782253 -0.6443869472 -0.4957766831 -0.3070129156
  -0.0000005364 5.9885420799 0.0000017881 -0.1109537780 -0.5679301620 -0.8155599833
  0.0000008047 6.1728162766 0.0000000596 -0.8827448487 -0.0438193865 0.0709790513
}

frame 9 {
  0.0000000000 0.0000000000 3.0000000000 0.7071068287 -0.0000000000 -0.0000000000
  -3.7220883369 -12.5883541107 -0.0158073828 0.4658228457 0.5319861770 0.4658226967
  0.0158069823 0.7253785133 -4.2293028831 0.6815124154 0.1885223836 -0.6815125942
  -0.0000008617 1.0023922920 -2.2860708237 -0.0000003339 -0.0596591383 -0.9982188940
  -0.0000000019 5.2951154709 -0.0000011549 0.0778663382 -0.0000000109 -0.0000000499
  0.0000000004 5.5872883797 -0.0000026296 0.0159746297 -0.0008258538 -0.0016855245
  -0.0000000006 5.4236173630 -0.0000002651 0.0149992863 0.0000001215 0.0000066861
  0.0158079229 2.6921286583 -2.7244753838 0.6528964639 0.2715258300 -0.6528963447
  -0.0000000099 5.6076006889 -0.0000076852 0.0158991050 -0.0000021648 -0.0000141621
  0.0159386694 3.2198212147 -1.4872409105 0.5966547728 0.3794799745 -0.5966377258
  -0.0000000003 4.9625763893 -0.0000003027 0.0027123436 0.0000020262 0.0000075238
  0.0159972087 -0.3164615035 2.4960215092 -0.1893826276 0.0000019855 -0.0000106667
  -0.0000000000 3.9519095421 -0.0000009537 0.0623686314 -0.0000001979 -0.0000048601
  -0.0000000001 3.2605543137 -0.0000000000 0.0842993855 -0.0000026878 0.0000155230
  -5.7047100067 2.7340440750 -2.3252067566 0.6987988353 -0.7152211070 0.0022484192
  -4.9808630943 4.7615995407 -1.6856468916 -0.5616765022 0.8254736662 -0.0105944872
  -4.1405067444 6.8342151642 -0.9228305817 0.5536530614 -0.8290354013 -0.0782902539
  5.7367134094 2.7340435982 -2.3251936436 -0.4867382050 -0.5081037879 0.5014085174
  5.0128645897 4.7615985870 -1.6856365204 0.5539450049 0.8213630319 0.0934750587
  4.1725082397 6.8342142105 -0.9228211641 -0.5568270683 -0.8277298808 -0.0510365181
  -8.6595191956 -0.8033440709 2.2397098541 -0.2792904079 0.7988021970 0.4988404214
  0.0000009537 7.2231273651 -0.0000011921 0.0926814750 -0.5036417246 -0.8567792773
  0.0000004768 11.4308471680 0.0000000000 -0.9652017355 0.0051276246 0.0370711982
  8.6910629272 -0.8040110469 2.2397735119 -0.2776048779 -0.7994378209 -0.4997758567
  0.0000007004 7.2231273651 0.0000002384 0.1675368547 0.5071466565 0.8453222513
  -0.0000015255 11.4308490753 -0.0000007153 -0.9655116200 -0.0348808579 0.0278073251
  -7.7061948776 -0.1411825866 2.6340723038 -0.4845006168 0.6715583205 0.4026100338
  -0.0000000969 6.3036537170 0.0000022054 0.2013418376 -0.5005795956 -0.8413342834
  -0.0000004768 7.2933106422 -0.0000002384 -0.9073533416 0.0195241254 -0.1706053466
  7.7378120422 -0.1411832273 2.6340725422 -0.4643265903 -0.6897549033 -0.4257112443
  0.0000004742 6.3036575317 -0.0000006557 0.1303757578 0.5009827018 0.8552054167
  0.0000002980 7.2933092117 -0.0000005960 -0.9134213328 -0.0079661300 0.1343721896
  -7.0111346245 1.1081303358 3.4398810863 -0.6126219034 0.5615827441 0.3317726552
  -0.0000003576 5.9885425568 0.0000001490 0.0563720949 -0.5975181460 -0.7991784215
  -0.0000002980 6.1728167534 -0.0000002384 -0.8802542090 0.0119904038 -0.0398213603
  7.0427546501 1.1081300974 3.4398784637 -0.6268337965 -0.5410783887 -0.3040692806
  -0.0000002920 5.9885425568 0.0000005960 0.1305487305 0.5976402760 0.7904580832
  -0.0000003666 6.1728177071 0.0000000149 -0.8764793277 -0.0377676561 0.0699694902
}

