# Blender MTL File: 'spiker.blend'
# Material Count: 1

newmtl models/buildables/spiker/spiker
Ns 96.078431
Ka 0.000000 0.000000 0.000000
Kd 0.640000 0.640000 0.640000
Ks 0.500000 0.500000 0.500000
Ni 1.000000
d 1.000000
illum 2
map_Bump /data/vlad/3d/unvanquished/spiker/texture/Spiker_normal.tga
map_Kd /data/vlad/3d/unvanquished/spiker/texture/Spiker_color.tga
map_Ke /data/vlad/3d/unvanquished/spiker/texture/Spiker_glow.tga
map_Ns /data/vlad/3d/unvanquished/spiker/texture/Spiker_specular.tga
