MD5Version 10
commandline ""

numFrames 14
numJoints 85
frameRate 60
numAnimatedComponents 510

hierarchy {
  "origin" -1 63 0 //
  "hips" 0 63 6 //
  "spine" 1 63 12 //
  "ribs" 2 63 18 //
  "neck" 3 63 24 //
  "neckcontol" 4 63 30 //
  "head" 4 63 36 //
  "jaw" 6 63 42 //
  "lower_lip0" 7 63 48 //
  "lip.003" 8 63 54 //
  "lip.002" 9 63 60 //
  "lip.001" 10 63 66 //
  "lip" 11 63 72 //
  "eye.L" 6 63 78 //
  "eye.R" 6 63 84 //
  "upper_lip0" 6 63 90 //
  "lip.004" 15 63 96 //
  "lip.005" 16 63 102 //
  "lip.006" 17 63 108 //
  "lip.007" 18 63 114 //
  "eyelidIK3.L" 6 63 120 //
  "eyelid2.L" 20 63 126 //
  "eyelid3.L" 21 63 132 //
  "eyelidIK2.L" 6 63 138 //
  "eyelid1.L" 23 63 144 //
  "eyelid.L" 24 63 150 //
  "eyelidIK3.R" 6 63 156 //
  "eyelid2.R" 26 63 162 //
  "eyelid3.R" 27 63 168 //
  "eyelidIK2.R" 6 63 174 //
  "eyelid1.R" 29 63 180 //
  "eyelid.R" 30 63 186 //
  "head_tag" 4 63 192 //
  "shoulder.R" 3 63 198 //
  "upper_arm.R" 33 63 204 //
  "forearm.R" 34 63 210 //
  "hand.R" 35 63 216 //
  "finger_index.01.R" 36 63 222 //
  "finger_index.02.R" 37 63 228 //
  "finger_index.03.R" 38 63 234 //
  "thumb.01.R" 36 63 240 //
  "thumb.02.R" 40 63 246 //
  "thumb.03.R" 41 63 252 //
  "tag_weapon" 36 63 258 //
  "finger_middle.01.R" 36 63 264 //
  "finger_middle.02.R" 44 63 270 //
  "finger_middle.03.R" 45 63 276 //
  "finger_ring.01.R" 36 63 282 //
  "finger_ring.02.R" 47 63 288 //
  "finger_ring.03.R" 48 63 294 //
  "finger_pinky.01.R" 36 63 300 //
  "finger_pinky.02.R" 50 63 306 //
  "finger_pinky.03.R" 51 63 312 //
  "hand_armor.R" 35 63 318 //
  "tag_gear" 3 63 324 //
  "shoulder.L" 3 63 330 //
  "upper_arm.L" 55 63 336 //
  "forearm.L" 56 63 342 //
  "hand_armor.L" 57 63 348 //
  "hand.L" 57 63 354 //
  "finger_index.01.L" 59 63 360 //
  "finger_index.02.L" 60 63 366 //
  "finger_index.03.L" 61 63 372 //
  "thumb.01.L" 59 63 378 //
  "thumb.02.L" 63 63 384 //
  "thumb.03.L" 64 63 390 //
  "finger_middle.01.L" 59 63 396 //
  "finger_middle.02.L" 66 63 402 //
  "finger_middle.03.L" 67 63 408 //
  "finger_ring.01.L" 59 63 414 //
  "finger_ring.02.L" 69 63 420 //
  "finger_ring.03.L" 70 63 426 //
  "finger_pinky.01.L" 59 63 432 //
  "finger_pinky.02.L" 72 63 438 //
  "finger_pinky.03.L" 73 63 444 //
  "thigh.R" 1 63 450 //
  "shin.R" 75 63 456 //
  "thigh.L" 1 63 462 //
  "shin.L" 77 63 468 //
  "ankle.R" 0 63 474 //
  "foot.R" 79 63 480 //
  "toe.R" 79 63 486 //
  "ankle.L" 0 63 492 //
  "toe.L" 82 63 498 //
  "foot.L" 82 63 504 //
}

bounds {
  ( -1.945048 -2.728561 -0.049552 ) ( 5.336554 2.008111 12.966467 )
  ( -1.945048 -2.731656 -0.049552 ) ( 5.353734 2.008111 12.964627 )
  ( -1.945048 -2.738348 -0.049552 ) ( 5.401855 2.008111 12.958921 )
  ( -1.945048 -2.744407 -0.049552 ) ( 5.468879 2.008111 12.949478 )
  ( -1.945048 -2.736842 -0.049552 ) ( 5.538761 2.008111 12.937671 )
  ( -1.945048 -2.735904 -0.049552 ) ( 5.604801 2.008111 12.926332 )
  ( -1.945048 -2.740062 -0.049552 ) ( 5.677251 2.008111 12.918460 )
  ( -1.945048 -2.743266 -0.049552 ) ( 5.733698 2.008111 12.915711 )
  ( -1.945048 -2.744124 -0.049552 ) ( 5.753724 2.008111 12.919444 )
  ( -1.945048 -2.743279 -0.049552 ) ( 5.720334 2.008111 12.929841 )
  ( -1.945048 -2.740257 -0.049552 ) ( 5.621450 2.008111 12.943722 )
  ( -1.945048 -2.735303 -0.049552 ) ( 5.486770 2.008111 12.956154 )
  ( -1.945048 -2.730536 -0.049552 ) ( 5.376717 2.008111 12.963951 )
  ( -1.945048 -2.728561 -0.049552 ) ( 5.336554 2.008111 12.966467 )
}

baseframe {
  ( 0.000000 0.000000 0.000000 ) ( 0.000000 -0.707107 -0.707107 )
  ( 0.184526 6.906084 -0.013687 ) ( -0.063425 -0.704162 0.063709 )
  ( -0.000000 1.240110 0.000000 ) ( 0.191587 0.001295 -0.009840 )
  ( -0.000000 1.426178 -0.000000 ) ( -0.063779 -0.002332 0.012698 )
  ( -0.000000 1.821084 0.000000 ) ( -0.145265 -0.001328 -0.001879 )
  ( 0.000000 0.808121 0.000000 ) ( 0.001844 -0.515148 -0.857099 )
  ( -0.002195 0.809023 0.000794 ) ( 0.040325 0.000217 -0.001349 )
  ( -0.003138 0.224356 0.163703 ) ( -0.591717 0.381594 0.595702 )
  ( -0.263320 0.555491 -0.218415 ) ( -0.002580 0.003661 -0.873876 )
  ( 0.000000 0.017501 -0.000000 ) ( 0.220569 0.655870 0.690904 )
  ( 0.000000 0.135389 -0.000001 ) ( 0.037467 -0.018190 0.200649 )
  ( 0.000000 0.113742 0.000000 ) ( -0.125321 0.000000 0.210707 )
  ( 0.000000 0.113741 -0.000000 ) ( 0.037467 0.018190 0.200649 )
  ( 0.262165 0.811893 0.662538 ) ( -0.000000 -0.752543 -0.658544 )
  ( -0.244069 0.811856 0.663658 ) ( -0.000000 -0.752542 -0.658544 )
  ( 0.225828 0.266057 0.774515 ) ( 0.047000 0.705543 -0.047000 )
  ( -0.000000 0.017501 -0.000000 ) ( 0.186223 0.743981 0.598525 )
  ( -0.000000 0.145787 -0.000001 ) ( 0.114298 0.017382 0.174281 )
  ( -0.000000 0.112094 0.000000 ) ( -0.001650 -0.003770 0.248557 )
  ( -0.000000 0.111594 0.000000 ) ( 0.099455 -0.020017 0.173948 )
  ( 0.361090 0.810247 0.681599 ) ( 0.046999 0.705543 -0.046999 )
  ( -0.000000 0.011231 0.000000 ) ( 0.138551 0.777593 0.585011 )
  ( 0.000000 0.112704 0.000001 ) ( 0.248666 0.003044 0.385872 )
  ( 0.360328 0.777492 0.684141 ) ( 0.046999 0.705543 -0.046999 )
  ( -0.000000 0.010076 -0.000000 ) ( -0.135461 0.512721 0.787661 )
  ( -0.000000 0.108887 -0.000001 ) ( -0.349590 0.371748 0.224171 )
  ( -0.137678 0.812980 0.691455 ) ( 0.046999 0.705543 -0.046999 )
  ( -0.000000 0.011230 0.000000 ) ( 0.069059 0.752863 0.649633 )
  ( 0.000000 0.131865 -0.000000 ) ( 0.201215 -0.007965 0.324740 )
  ( -0.136810 0.780376 0.690930 ) ( 0.046999 0.705543 -0.046999 )
  ( -0.000000 0.010076 0.000000 ) ( 0.085597 0.645822 0.755134 )
  ( -0.000000 0.128464 -0.000001 ) ( -0.122912 -0.007699 0.282440 )
  ( -0.002195 0.809023 0.000794 ) ( 0.040325 0.000217 -0.001349 )
  ( -0.014833 1.825302 -0.071422 ) ( 0.548058 -0.398517 -0.527101 )
  ( 0.000000 1.493901 0.000000 ) ( 0.337192 0.599744 -0.369520 )
  ( 0.000000 2.103016 0.000000 ) ( -0.166080 0.071882 0.080628 )
  ( 0.000001 1.823368 0.000000 ) ( 0.026122 0.716524 0.005963 )
  ( 0.288927 0.945606 -0.016979 ) ( -0.100840 -0.682277 -0.030495 )
  ( 0.000000 0.310931 0.000000 ) ( -0.001887 -0.003346 -0.140544 )
  ( -0.000000 0.255058 0.000000 ) ( 0.014527 -0.020137 -0.079928 )
  ( 0.182657 0.102359 0.122068 ) ( 0.068809 0.469953 0.338161 )
  ( -0.000000 0.450617 0.000000 ) ( -0.099065 0.025937 0.025593 )
  ( 0.000000 0.295731 -0.000001 ) ( 0.108671 0.022517 0.026610 )
  ( 0.586577 1.443575 0.291631 ) ( 0.494772 0.504178 0.517254 )
  ( 0.081677 0.956433 -0.018380 ) ( -0.107088 -0.736173 -0.098262 )
  ( 0.000000 0.323707 0.000000 ) ( -0.004845 -0.051318 -0.175658 )
  ( 0.000000 0.229679 -0.000000 ) ( 0.016195 -0.015133 -0.050692 )
  ( -0.151893 0.951490 -0.015787 ) ( -0.155854 -0.744157 -0.130418 )
  ( -0.000001 0.298948 -0.000000 ) ( 0.022449 -0.039879 -0.150750 )
  ( -0.000000 0.222754 0.000000 ) ( 0.017543 -0.013115 -0.049400 )
  ( -0.332551 0.872253 0.059175 ) ( -0.270536 -0.079021 -0.029623 )
  ( 0.000000 0.247823 -0.000000 ) ( -0.085055 0.000243 0.004201 )
  ( 0.000000 0.155400 0.000000 ) ( -0.148243 -0.000940 -0.003131 )
  ( 0.531379 1.351308 -0.004340 ) ( 0.015885 0.004080 0.999865 )
  ( 0.002183 1.423120 -0.451181 ) ( 0.675237 0.001866 -0.002772 )
  ( 0.014634 1.825497 -0.071451 ) ( 0.552755 0.408370 0.515946 )
  ( 0.000000 1.493901 0.000000 ) ( 0.498017 -0.047311 0.047143 )
  ( 0.000000 2.103018 -0.000001 ) ( -0.075532 0.079375 0.168458 )
  ( 0.093228 1.351308 0.523154 ) ( 0.654641 0.002699 0.755929 )
  ( 0.000000 1.823368 -0.000000 ) ( -0.025836 0.094228 -0.007102 )
  ( 0.286576 1.006395 -0.107107 ) ( 0.072174 0.602406 -0.086389 )
  ( 0.000000 0.249955 0.000000 ) ( -0.000083 -0.010683 -0.125485 )
  ( -0.000000 0.254363 -0.000000 ) ( -0.016009 0.049143 -0.075943 )
  ( 0.120542 0.102358 -0.183667 ) ( 0.017564 -0.626009 0.348850 )
  ( -0.000000 0.445150 0.000000 ) ( 0.067621 -0.024966 0.008198 )
  ( 0.000000 0.302324 0.000000 ) ( -0.058338 0.684439 0.061834 )
  ( 0.073565 1.013167 -0.024132 ) ( 0.119028 -0.795213 0.100389 )
  ( -0.000000 0.266205 0.000000 ) ( 0.003820 0.009027 0.165078 )
  ( -0.000000 0.229740 -0.000000 ) ( -0.004806 0.012921 0.052363 )
  ( -0.127263 1.003840 0.060605 ) ( 0.184529 -0.779480 0.128005 )
  ( -0.000000 0.246800 0.000000 ) ( -0.001225 -0.003214 0.130582 )
  ( 0.000000 0.222126 -0.000000 ) ( 0.002051 0.007113 0.050428 )
  ( -0.358085 0.893698 0.063869 ) ( 0.227228 -0.775272 0.133791 )
  ( 0.000000 0.221431 -0.000000 ) ( -0.006730 0.001955 0.092569 )
  ( -0.000000 0.154458 0.000000 ) ( -0.003598 -0.015304 0.148050 )
  ( -0.810392 0.550812 -0.372493 ) ( -0.984551 0.027405 -0.000267 )
  ( 0.000000 3.626385 -0.000000 ) ( -0.211921 0.002430 0.007077 )
  ( 0.782400 0.551416 -0.372917 ) ( -0.984498 -0.026294 0.009171 )
  ( -0.000000 3.626384 0.000000 ) ( -0.211935 -0.017722 -0.006644 )
  ( -0.305859 0.828940 1.124649 ) ( -0.552637 0.176065 -0.801670 )
  ( -0.090614 0.138320 1.006144 ) ( 0.752092 0.018236 0.046746 )
  ( -0.090614 0.138320 1.006144 ) ( -0.854351 0.076975 -0.055594 )
  ( -0.305858 0.828940 -1.124649 ) ( 0.585870 -0.181993 -0.777713 )
  ( -0.005721 0.138319 -1.010200 ) ( -0.046568 0.515226 -0.854890 )
  ( -0.005721 0.138319 -1.010200 ) ( -0.753536 -0.000864 0.003278 )
}

frame 0 {
  -0.000000 0.000000 -0.009903 -0.707107 -0.000000 -0.000000
  0.309123 6.437504 -0.106869 -0.075371 -0.540867 0.048998
  0.000000 1.240110 -0.000000 0.052507 -0.000062 -0.047498
  0.000000 1.426179 -0.000000 -0.184318 -0.000420 0.040287
  0.000000 1.821082 0.000000 -0.059450 -0.193375 -0.058793
  0.000000 0.808121 -0.000000 0.001844 -0.515148 -0.857099
  -0.044148 0.766293 0.024775 0.045046 0.018595 0.043682
  -0.003138 0.224357 0.163702 -0.582226 0.395844 0.586146
  -0.259541 0.557510 -0.217253 0.917771 -0.378686 0.089287
  0.000000 0.017501 -0.000000 0.766855 -0.164101 -0.216398
  0.000000 0.135389 0.000001 0.077406 -0.083308 0.226103
  -0.000000 0.113742 0.000001 -0.176718 -0.042501 0.164695
  -0.000000 0.113742 -0.000000 -0.031558 -0.009163 0.230041
  0.262164 0.811892 0.662537 0.061118 0.848054 0.523650
  -0.244069 0.811855 0.663658 0.073789 0.846507 0.523270
  0.224683 0.261798 0.775026 0.064377 -0.710294 0.225210
  -0.000000 0.017499 0.000000 0.694299 -0.191224 -0.199823
  0.000000 0.145787 0.000002 0.140073 -0.029166 0.201370
  0.000000 0.112094 0.000001 -0.076060 -0.067477 0.233263
  0.000000 0.111594 -0.000000 0.024045 -0.043243 0.223826
  0.365934 0.793585 0.683418 0.046999 0.705543 -0.046999
  -0.000000 0.011231 0.000000 0.125932 0.784485 0.580794
  -0.000000 0.112704 -0.000001 0.249001 -0.023430 0.387489
  0.360328 0.777494 0.684140 0.046999 0.705543 -0.046999
  -0.000000 0.010075 0.000000 -0.099297 0.457441 0.813067
  -0.000001 0.108887 0.000001 -0.431279 0.352683 0.307498
  -0.136625 0.803881 0.692455 0.046999 0.705543 -0.046999
  0.000000 0.011230 0.000000 -0.008426 0.730560 0.661906
  0.000000 0.131865 0.000001 0.067457 -0.083498 0.375702
  -0.136810 0.780377 0.690930 0.046999 0.705543 -0.046999
  -0.000000 0.010076 -0.000000 0.062122 0.627371 0.752991
  0.000000 0.128464 -0.000001 -0.209364 -0.078930 0.364853
  -0.002195 0.809022 0.000794 0.040325 0.000217 -0.001349
  -0.014832 1.825300 -0.071422 0.540264 -0.451656 -0.436753
  -0.000000 1.493901 -0.000001 0.337302 0.677339 -0.544359
  0.000000 2.103015 -0.000001 -0.738085 0.041813 0.358324
  -0.000001 1.823368 0.000000 -0.246739 0.435745 0.063124
  0.288927 0.945606 -0.016980 -0.086101 -0.662918 -0.096529
  -0.000000 0.310931 -0.000002 0.058015 0.002221 -0.497332
  0.000000 0.255058 -0.000002 -0.080849 0.012366 -0.239603
  0.182658 0.102358 0.122067 0.006694 0.810311 0.450603
  0.000001 0.450618 0.000000 -0.528808 -0.099827 -0.027476
  -0.000000 0.295730 0.000000 0.219193 -0.276757 0.060325
  0.025108 1.448908 0.285964 0.494772 0.504178 0.517254
  0.081677 0.956432 -0.018380 -0.046749 -0.719113 -0.126382
  0.000000 0.323706 0.000001 0.045451 -0.040644 -0.458907
  0.000000 0.229678 0.000000 0.034365 0.095566 -0.292551
  -0.151892 0.951490 -0.015788 -0.126933 -0.733812 -0.153607
  -0.000000 0.298948 -0.000001 0.088295 -0.034341 -0.361513
  -0.000000 0.222753 -0.000001 0.019056 0.079162 -0.311585
  -0.332551 0.872253 0.059175 0.063690 -0.067212 -0.078576
  0.000001 0.247823 -0.000000 -0.389306 -0.000458 0.092402
  0.000001 0.155400 -0.000000 -0.220136 0.028702 -0.116910
  0.531377 1.351308 -0.004339 0.015907 0.004104 0.999865
  0.002183 1.423119 -0.451180 0.675237 0.001866 -0.002772
  0.014634 1.825496 -0.071451 0.297168 0.620304 0.574690
  0.000000 1.493902 -0.000000 0.531232 0.160308 0.319760
  0.000001 2.103017 -0.000000 0.073123 0.458368 0.611986
  0.093227 1.351308 0.523155 0.654645 0.002695 0.755925
  0.000000 1.823369 -0.000000 0.046821 0.484283 -0.318049
  0.286576 1.006395 -0.107110 0.348126 0.496271 -0.452239
  0.000001 0.249955 -0.000000 0.001699 -0.008901 -0.495669
  -0.000000 0.254362 0.000000 -0.007281 0.044764 -0.460087
  0.120542 0.102358 -0.183670 -0.196522 -0.496474 0.467247
  0.000000 0.445150 -0.000000 0.421781 -0.020611 0.244826
  -0.000000 0.302323 0.000000 -0.286951 0.593415 0.135055
  0.073566 1.013166 -0.024134 0.442168 -0.650241 0.377667
  -0.000000 0.266205 0.000001 -0.007397 0.013462 0.458387
  0.000000 0.229739 -0.000000 0.007397 0.005326 0.427137
  -0.127263 1.003840 0.060602 0.466208 -0.626169 0.387598
  -0.000001 0.246799 -0.000001 -0.014510 0.000132 0.266943
  -0.000000 0.222127 -0.000000 0.038690 0.041525 0.536874
  -0.358085 0.893698 0.063867 0.358440 -0.692820 0.305709
  -0.000000 0.221430 0.000001 -0.038809 0.004069 0.245072
  0.000000 0.154458 0.000000 0.039138 0.041421 0.644414
  -0.810392 0.550811 -0.372493 -0.966435 0.110867 -0.082632
  0.000000 3.626384 0.000000 -0.373016 0.002306 0.012456
  0.782400 0.551415 -0.372917 -0.932379 -0.100583 0.052530
  0.000000 3.626384 -0.000001 -0.302329 -0.017285 -0.009478
  -1.406109 0.838118 1.299208 -0.369178 0.203943 -0.901430
  -0.090614 0.138320 1.006144 0.752092 0.018236 0.046746
  -0.090614 0.138320 1.006144 -0.852404 0.078746 -0.052999
  2.241435 0.812477 -1.543512 0.711378 -0.142690 -0.667010
  -0.005721 0.138320 -1.010200 -0.025764 -0.537679 0.842437
  -0.005721 0.138320 -1.010200 -0.753536 -0.000863 0.003278
}

frame 1 {
  -0.000000 0.000000 -0.009903 -0.707107 -0.000000 -0.000000
  0.309123 6.437504 -0.106869 -0.075371 -0.540867 0.048998
  0.000000 1.240110 -0.000000 0.051323 0.000062 -0.046967
  0.000000 1.426179 -0.000000 -0.184982 -0.000306 0.040573
  0.000000 1.821084 -0.000000 -0.056963 -0.194045 -0.059210
  -0.000000 0.808122 -0.000000 0.001844 -0.515148 -0.857099
  -0.044148 0.766293 0.024775 0.045493 0.018465 0.043687
  -0.003138 0.224356 0.163703 -0.582226 0.395844 0.586146
  -0.259542 0.557511 -0.217253 0.917383 -0.379626 0.089205
  0.000000 0.017501 -0.000000 0.766526 -0.164288 -0.216411
  0.000000 0.135389 0.000000 0.077862 -0.083076 0.225874
  -0.000000 0.113741 -0.000000 -0.176407 -0.042629 0.165052
  -0.000000 0.113742 -0.000001 -0.031135 -0.009382 0.230095
  0.262165 0.811891 0.662539 0.060966 0.847565 0.524472
  -0.244069 0.811854 0.663660 0.073644 0.846023 0.524088
  0.224683 0.261798 0.775027 0.063649 -0.710360 0.224530
  -0.000000 0.017499 0.000000 0.693949 -0.191291 -0.199675
  0.000000 0.145787 0.000001 0.140414 -0.028998 0.201095
  -0.000000 0.112093 -0.000000 -0.075506 -0.067507 0.233333
  -0.000000 0.111594 0.000001 0.024387 -0.043501 0.223807
  0.365934 0.793584 0.683419 0.046999 0.705543 -0.046999
  -0.000000 0.011231 -0.000000 0.125929 0.784490 0.580789
  0.000000 0.112704 -0.000000 0.249010 -0.023435 0.387487
  0.360328 0.777493 0.684141 0.046999 0.705543 -0.046999
  -0.000000 0.010076 0.000000 -0.099298 0.457444 0.813065
  -0.000001 0.108888 -0.000001 -0.431283 0.352681 0.307498
  -0.136626 0.803882 0.692455 0.046999 0.705543 -0.046999
  -0.000000 0.011231 -0.000000 -0.007745 0.730728 0.661918
  0.000000 0.131865 0.000000 0.068156 -0.083669 0.375576
  -0.136810 0.780376 0.690930 0.046999 0.705543 -0.046999
  0.000000 0.010076 -0.000000 0.062951 0.627582 0.752920
  0.000000 0.128464 -0.000001 -0.208636 -0.079128 0.365269
  -0.002195 0.809023 0.000794 0.040325 0.000217 -0.001349
  -0.014833 1.825301 -0.071422 0.540264 -0.451656 -0.436753
  0.000000 1.493901 0.000001 0.333556 0.676232 -0.547382
  -0.000000 2.103016 -0.000001 -0.733592 0.042333 0.356143
  0.000000 1.823368 -0.000001 -0.247443 0.437145 0.067189
  0.288929 0.945606 -0.016979 -0.086093 -0.662917 -0.096534
  -0.000001 0.310931 -0.000000 0.058022 0.002221 -0.497299
  0.000000 0.255058 0.000001 -0.080857 0.012377 -0.239642
  0.182658 0.102358 0.122067 0.006684 0.810321 0.450579
  0.000002 0.450618 0.000000 -0.528782 -0.099829 -0.027477
  0.000000 0.295730 -0.000001 0.219191 -0.276746 0.060324
  0.025108 1.448908 0.285964 0.494772 0.504178 0.517254
  0.081679 0.956433 -0.018380 -0.046743 -0.719111 -0.126385
  0.000000 0.323706 0.000001 0.045454 -0.040644 -0.458866
  -0.000000 0.229678 -0.000000 0.034359 0.095577 -0.292596
  -0.151891 0.951490 -0.015788 -0.126926 -0.733809 -0.153614
  -0.000000 0.298947 -0.000001 0.088292 -0.034341 -0.361466
  0.000000 0.222753 -0.000000 0.019051 0.079172 -0.311633
  -0.332549 0.872253 0.059175 0.063669 -0.067209 -0.078565
  0.000000 0.247823 0.000000 -0.389206 -0.000457 0.092347
  0.000000 0.155400 0.000000 -0.220218 0.028728 -0.116861
  0.531378 1.351308 -0.004341 0.015881 0.004098 0.999865
  0.002183 1.423119 -0.451181 0.675237 0.001866 -0.002772
  0.014634 1.825495 -0.071451 0.297168 0.620304 0.574690
  0.000000 1.493901 -0.000001 0.528326 0.161143 0.321584
  -0.000000 2.103017 0.000000 0.072082 0.462319 0.603276
  0.093227 1.351308 0.523154 0.654647 0.002695 0.755924
  -0.000001 1.823368 -0.000000 0.054379 0.483930 -0.314830
  0.286576 1.006395 -0.107108 0.348092 0.496315 -0.452153
  0.000000 0.249956 -0.000000 0.001713 -0.008897 -0.495755
  -0.000000 0.254362 -0.000000 -0.007275 0.044801 -0.460104
  0.120542 0.102358 -0.183669 -0.196489 -0.496500 0.467254
  -0.000001 0.445149 -0.000000 0.421720 -0.020613 0.244660
  -0.000000 0.302323 -0.000000 -0.286818 0.593446 0.135144
  0.073565 1.013167 -0.024132 0.442088 -0.650282 0.377635
  -0.000000 0.266204 -0.000000 -0.007409 0.013465 0.458474
  -0.000000 0.229739 0.000000 0.007392 0.005362 0.427148
  -0.127263 1.003840 0.060604 0.466133 -0.626214 0.387562
  0.000000 0.246799 -0.000000 -0.014523 0.000133 0.267044
  -0.000000 0.222126 -0.000000 0.038690 0.041560 0.536879
  -0.358085 0.893699 0.063867 0.358397 -0.692830 0.305706
  -0.000000 0.221431 0.000000 -0.038815 0.004071 0.245016
  -0.000000 0.154458 -0.000000 0.039139 0.041459 0.644494
  -0.810392 0.550811 -0.372493 -0.966435 0.110867 -0.082632
  0.000000 3.626384 0.000000 -0.373016 0.002306 0.012456
  0.782400 0.551415 -0.372917 -0.932379 -0.100583 0.052530
  0.000000 3.626384 -0.000001 -0.302329 -0.017285 -0.009478
  -1.406109 0.838118 1.299208 -0.369178 0.203943 -0.901430
  -0.090614 0.138320 1.006144 0.752092 0.018236 0.046746
  -0.090614 0.138320 1.006144 -0.852404 0.078746 -0.052999
  2.241435 0.812477 -1.543512 0.711378 -0.142690 -0.667010
  -0.005721 0.138320 -1.010200 -0.025764 -0.537679 0.842437
  -0.005721 0.138320 -1.010200 -0.753536 -0.000863 0.003278
}

frame 2 {
  -0.000000 0.000000 -0.009903 -0.707107 -0.000000 -0.000000
  0.309123 6.437504 -0.106869 -0.075371 -0.540867 0.048998
  0.000000 1.240110 -0.000000 0.047818 0.000429 -0.045396
  -0.000000 1.426177 -0.000000 -0.186946 0.000034 0.041419
  0.000000 1.821083 -0.000000 -0.049600 -0.196021 -0.060440
  0.000000 0.808121 0.000000 0.001844 -0.515148 -0.857099
  -0.044148 0.766294 0.024775 0.046818 0.018083 0.043702
  -0.003138 0.224356 0.163703 -0.582226 0.395844 0.586146
  -0.259541 0.557511 -0.217253 0.916228 -0.382406 0.088963
  0.000000 0.017501 0.000000 0.765554 -0.164837 -0.216446
  -0.000000 0.135389 -0.000000 0.079190 -0.082389 0.225190
  -0.000000 0.113742 0.000000 -0.175463 -0.043004 0.166102
  -0.000000 0.113741 0.000001 -0.029889 -0.010036 0.230250
  0.262165 0.811892 0.662538 0.060518 0.846118 0.526895
  -0.244069 0.811855 0.663659 0.073214 0.844590 0.526501
  0.224683 0.261799 0.775027 0.061495 -0.710549 0.222516
  -0.000000 0.017499 0.000000 0.692921 -0.191484 -0.199236
  -0.000000 0.145788 0.000000 0.141413 -0.028505 0.200276
  0.000000 0.112094 0.000001 -0.073856 -0.067596 0.233529
  0.000000 0.111594 -0.000001 0.025381 -0.044265 0.223746
  0.365934 0.793585 0.683419 0.046999 0.705543 -0.046999
  -0.000000 0.011230 -0.000000 0.125931 0.784490 0.580787
  0.000000 0.112704 0.000001 0.249014 -0.023437 0.387488
  0.360328 0.777493 0.684141 0.046999 0.705543 -0.046999
  -0.000000 0.010074 0.000000 -0.099297 0.457443 0.813065
  0.000001 0.108888 -0.000000 -0.431284 0.352682 0.307498
  -0.136626 0.803881 0.692455 0.046999 0.705543 -0.046999
  0.000000 0.011232 0.000000 -0.005733 0.731236 0.661934
  0.000000 0.131865 0.000000 0.070242 -0.084163 0.375196
  -0.136810 0.780377 0.690930 0.046999 0.705543 -0.046999
  -0.000000 0.010076 0.000000 0.065406 0.628190 0.752711
  0.000000 0.128464 -0.000000 -0.206487 -0.079717 0.366487
  -0.002195 0.809022 0.000794 0.040325 0.000217 -0.001349
  -0.014833 1.825301 -0.071422 0.540264 -0.451656 -0.436753
  -0.000000 1.493901 0.000001 0.323563 0.672949 -0.555604
  0.000000 2.103016 0.000000 -0.722165 0.043612 0.350595
  -0.000000 1.823369 0.000001 -0.248457 0.440761 0.076532
  0.288928 0.945606 -0.016979 -0.086069 -0.662914 -0.096537
  0.000000 0.310931 0.000000 0.058040 0.002223 -0.497228
  0.000000 0.255058 -0.000000 -0.080876 0.012406 -0.239735
  0.182657 0.102358 0.122067 0.006660 0.810340 0.450520
  0.000000 0.450617 -0.000000 -0.528726 -0.099830 -0.027483
  0.000000 0.295730 0.000000 0.219189 -0.276715 0.060325
  0.025107 1.448908 0.285964 0.494772 0.504178 0.517254
  0.081679 0.956433 -0.018380 -0.046725 -0.719109 -0.126389
  0.000000 0.323706 0.000001 0.045462 -0.040646 -0.458773
  0.000000 0.229678 -0.000000 0.034345 0.095603 -0.292705
  -0.151893 0.951490 -0.015787 -0.126906 -0.733806 -0.153622
  -0.000000 0.298947 -0.000001 0.088287 -0.034341 -0.361368
  0.000000 0.222753 0.000000 0.019045 0.079193 -0.311741
  -0.332550 0.872253 0.059175 0.063623 -0.067204 -0.078542
  0.000002 0.247823 0.000000 -0.388964 -0.000456 0.092232
  -0.000000 0.155400 0.000000 -0.220424 0.028786 -0.116757
  0.531378 1.351308 -0.004340 0.015886 0.004065 0.999865
  0.002183 1.423120 -0.451181 0.675237 0.001866 -0.002772
  0.014634 1.825496 -0.071451 0.297168 0.620304 0.574690
  0.000000 1.493901 -0.000001 0.520570 0.164692 0.326423
  0.000000 2.103016 0.000000 0.069300 0.472445 0.579999
  0.093228 1.351308 0.523154 0.654641 0.002704 0.755929
  -0.000000 1.823368 0.000001 0.073664 0.482615 -0.307587
  0.286576 1.006395 -0.107108 0.348067 0.496344 -0.452096
  0.000000 0.249957 -0.000001 0.001722 -0.008895 -0.495813
  -0.000000 0.254362 -0.000001 -0.007270 0.044825 -0.460115
  0.120542 0.102358 -0.183667 -0.196463 -0.496520 0.467258
  0.000002 0.445149 0.000000 0.421673 -0.020616 0.244549
  0.000001 0.302324 -0.000000 -0.286729 0.593467 0.135200
  0.073565 1.013167 -0.024133 0.442040 -0.650308 0.377614
  0.000000 0.266203 0.000000 -0.007415 0.013466 0.458523
  -0.000000 0.229741 -0.000000 0.007387 0.005384 0.427159
  -0.127263 1.003840 0.060603 0.466089 -0.626239 0.387544
  -0.000002 0.246799 -0.000001 -0.014531 0.000135 0.267093
  -0.000000 0.222126 -0.000000 0.038690 0.041584 0.536890
  -0.358086 0.893699 0.063868 0.358376 -0.692832 0.305712
  0.000000 0.221431 0.000000 -0.038816 0.004072 0.244957
  0.000000 0.154458 -0.000001 0.039139 0.041483 0.644555
  -0.810392 0.550811 -0.372493 -0.966435 0.110867 -0.082632
  0.000000 3.626384 0.000000 -0.373016 0.002306 0.012456
  0.782400 0.551415 -0.372917 -0.932379 -0.100583 0.052530
  0.000000 3.626384 -0.000001 -0.302329 -0.017285 -0.009478
  -1.406109 0.838118 1.299208 -0.369178 0.203943 -0.901430
  -0.090614 0.138320 1.006144 0.752092 0.018236 0.046746
  -0.090614 0.138320 1.006144 -0.852404 0.078746 -0.052999
  2.241435 0.812477 -1.543512 0.711378 -0.142690 -0.667010
  -0.005721 0.138320 -1.010200 -0.025764 -0.537679 0.842437
  -0.005721 0.138320 -1.010200 -0.753536 -0.000863 0.003278
}

frame 3 {
  -0.000000 0.000000 -0.009903 -0.707107 -0.000000 -0.000000
  0.309123 6.437504 -0.106869 -0.075371 -0.540867 0.048998
  0.000000 1.240110 -0.000000 0.042476 0.000989 -0.043000
  0.000000 1.426177 0.000000 -0.189937 0.000552 0.042708
  0.000000 1.821084 -0.000000 -0.038373 -0.199009 -0.062308
  0.000000 0.808121 -0.000000 0.001844 -0.515148 -0.857099
  -0.044148 0.766292 0.024775 0.048836 0.017500 0.043726
  -0.003138 0.224356 0.163703 -0.582226 0.395844 0.586146
  -0.259541 0.557511 -0.217253 0.914450 -0.386637 0.088593
  0.000000 0.017501 -0.000000 0.764066 -0.165669 -0.216484
  -0.000000 0.135389 0.000002 0.081217 -0.081338 0.224133
  -0.000000 0.113741 0.000000 -0.174012 -0.043577 0.167695
  -0.000000 0.113741 0.000001 -0.027998 -0.011034 0.230473
  0.262165 0.811893 0.662538 0.059835 0.843909 0.530562
  -0.244069 0.811856 0.663659 0.072560 0.842401 0.530154
  0.224683 0.261799 0.775027 0.058210 -0.710826 0.219441
  -0.000000 0.017499 0.000000 0.691354 -0.191764 -0.198555
  -0.000000 0.145787 0.000000 0.142925 -0.027754 0.199013
  0.000000 0.112094 -0.000001 -0.071339 -0.067724 0.233815
  -0.000000 0.111594 -0.000001 0.026909 -0.045427 0.223642
  0.365935 0.793585 0.683419 0.046999 0.705543 -0.046999
  -0.000000 0.011230 0.000000 0.125930 0.784489 0.580789
  0.000000 0.112704 0.000000 0.249008 -0.023434 0.387488
  0.360328 0.777493 0.684141 0.046999 0.705543 -0.046999
  0.000000 0.010076 0.000000 -0.099298 0.457444 0.813065
  -0.000000 0.108888 -0.000001 -0.431282 0.352683 0.307497
  -0.136625 0.803881 0.692455 0.046999 0.705543 -0.046999
  -0.000000 0.011231 -0.000000 -0.002668 0.731990 0.661954
  0.000000 0.131865 -0.000002 0.073409 -0.084904 0.374586
  -0.136810 0.780377 0.690930 0.046999 0.705543 -0.046999
  -0.000000 0.010075 0.000000 0.069139 0.629105 0.752377
  -0.000000 0.128464 -0.000001 -0.203203 -0.080604 0.368319
  -0.002195 0.809021 0.000794 0.040325 0.000217 -0.001349
  -0.014833 1.825301 -0.071422 0.540264 -0.451656 -0.436753
  0.000001 1.493901 -0.000000 0.308977 0.668030 -0.567458
  -0.000001 2.103016 -0.000001 -0.705052 0.045426 0.342287
  0.000000 1.823368 0.000001 -0.249588 0.445878 0.090312
  0.288928 0.945606 -0.016979 -0.086032 -0.662908 -0.096553
  -0.000000 0.310931 0.000001 0.058073 0.002225 -0.497105
  0.000000 0.255059 -0.000000 -0.080913 0.012457 -0.239884
  0.182656 0.102358 0.122067 0.006620 0.810375 0.450427
  0.000000 0.450618 -0.000001 -0.528634 -0.099836 -0.027490
  0.000000 0.295730 -0.000000 0.219188 -0.276672 0.060325
  0.025106 1.448908 0.285964 0.494772 0.504178 0.517254
  0.081678 0.956433 -0.018380 -0.046698 -0.719104 -0.126402
  -0.000000 0.323706 -0.000000 0.045477 -0.040648 -0.458620
  -0.000000 0.229678 0.000000 0.034318 0.095648 -0.292876
  -0.151892 0.951490 -0.015787 -0.126876 -0.733797 -0.153645
  -0.000001 0.298947 -0.000002 0.088281 -0.034341 -0.361198
  0.000000 0.222753 0.000002 0.019027 0.079233 -0.311920
  -0.332551 0.872254 0.059175 0.063546 -0.067195 -0.078501
  -0.000001 0.247823 -0.000000 -0.388579 -0.000455 0.092030
  0.000000 0.155400 -0.000000 -0.220747 0.028886 -0.116576
  0.531378 1.351308 -0.004340 0.015886 0.004102 0.999865
  0.002183 1.423119 -0.451181 0.675237 0.001866 -0.002772
  0.014634 1.825496 -0.071451 0.297168 0.620304 0.574690
  -0.000001 1.493901 0.000000 0.508749 0.170519 0.333814
  -0.000001 2.103015 0.000001 0.065033 0.486830 0.544282
  0.093227 1.351308 0.523154 0.654644 0.002699 0.755926
  -0.000002 1.823368 0.000001 0.102126 0.480242 -0.297328
  0.286576 1.006395 -0.107108 0.348015 0.496404 -0.451978
  -0.000000 0.249956 0.000000 0.001738 -0.008891 -0.495943
  0.000000 0.254362 -0.000001 -0.007260 0.044871 -0.460130
  0.120542 0.102358 -0.183669 -0.196429 -0.496550 0.467271
  -0.000001 0.445150 0.000000 0.421611 -0.020619 0.244319
  0.000000 0.302324 0.000000 -0.286552 0.593507 0.135334
  0.073565 1.013167 -0.024133 0.441934 -0.650365 0.377567
  0.000000 0.266205 0.000000 -0.007430 0.013468 0.458648
  -0.000000 0.229739 -0.000000 0.007379 0.005429 0.427169
  -0.127263 1.003841 0.060604 0.465974 -0.626311 0.387483
  0.000000 0.246800 0.000000 -0.014551 0.000137 0.267277
  -0.000000 0.222126 0.000000 0.038691 0.041633 0.536875
  -0.358085 0.893699 0.063867 0.358298 -0.692861 0.305682
  -0.000000 0.221431 -0.000000 -0.038835 0.004073 0.244966
  0.000000 0.154457 -0.000000 0.039141 0.041536 0.644625
  -0.810392 0.550811 -0.372493 -0.966435 0.110867 -0.082632
  0.000000 3.626384 0.000000 -0.373016 0.002306 0.012456
  0.782400 0.551415 -0.372917 -0.932379 -0.100583 0.052530
  0.000000 3.626384 -0.000001 -0.302329 -0.017285 -0.009478
  -1.406109 0.838118 1.299208 -0.369178 0.203943 -0.901430
  -0.090614 0.138320 1.006144 0.752092 0.018236 0.046746
  -0.090614 0.138320 1.006144 -0.852404 0.078746 -0.052999
  2.241435 0.812477 -1.543512 0.711378 -0.142690 -0.667010
  -0.005721 0.138320 -1.010200 -0.025764 -0.537679 0.842437
  -0.005721 0.138320 -1.010200 -0.753536 -0.000863 0.003278
}

frame 4 {
  -0.000000 0.000000 -0.009903 -0.707107 -0.000000 -0.000000
  0.309123 6.437504 -0.106869 -0.075371 -0.540867 0.048998
  0.000000 1.240110 -0.000000 0.036415 0.001624 -0.040280
  0.000000 1.426176 0.000000 -0.193327 0.001139 0.044170
  0.000000 1.821083 0.000000 -0.025631 -0.202365 -0.064416
  0.000000 0.808120 0.000000 0.001844 -0.515148 -0.857099
  -0.044147 0.766293 0.024775 0.051124 0.016839 0.043753
  -0.003138 0.224357 0.163704 -0.582226 0.395844 0.586146
  -0.259541 0.557511 -0.217253 0.912410 -0.391428 0.088171
  0.000000 0.017501 -0.000000 0.762375 -0.166600 -0.216503
  -0.000000 0.135389 0.000000 0.083505 -0.080140 0.222912
  0.000000 0.113742 0.000000 -0.172352 -0.044219 0.169485
  -0.000000 0.113741 0.000001 -0.025842 -0.012166 0.230708
  0.262165 0.811895 0.662538 0.059067 0.841400 0.534682
  -0.244068 0.811857 0.663659 0.071825 0.839915 0.534259
  0.224683 0.261800 0.775027 0.054481 -0.711122 0.215947
  0.000000 0.017499 0.000000 0.689574 -0.192065 -0.197767
  0.000000 0.145787 0.000001 0.144633 -0.026908 0.197566
  0.000000 0.112094 0.000001 -0.068474 -0.067862 0.234109
  0.000000 0.111594 0.000000 0.028638 -0.046743 0.223509
  0.365934 0.793585 0.683420 0.046999 0.705543 -0.046999
  -0.000000 0.011231 -0.000000 0.125929 0.784491 0.580786
  -0.000000 0.112704 -0.000002 0.249015 -0.023438 0.387486
  0.360328 0.777494 0.684141 0.046999 0.705543 -0.046999
  -0.000000 0.010075 0.000000 -0.099298 0.457443 0.813066
  0.000001 0.108888 0.000000 -0.431282 0.352683 0.307496
  -0.136625 0.803882 0.692456 0.046999 0.705543 -0.046999
  -0.000000 0.011231 0.000000 0.000808 0.732829 0.661957
  -0.000000 0.131865 -0.000000 0.077010 -0.085728 0.373863
  -0.136810 0.780377 0.690931 0.046999 0.705543 -0.046999
  -0.000000 0.010073 0.000000 0.073364 0.630121 0.751977
  -0.000000 0.128465 -0.000001 -0.199462 -0.081600 0.370360
  -0.002195 0.809022 0.000794 0.040325 0.000217 -0.001349
  -0.014832 1.825301 -0.071422 0.540264 -0.451656 -0.436753
  -0.000000 1.493901 -0.000002 0.289526 0.663772 -0.581822
  0.000000 2.103017 0.000000 -0.682168 0.047679 0.331177
  0.000000 1.823368 -0.000000 -0.249306 0.452747 0.111751
  0.288928 0.945606 -0.016979 -0.086100 -0.662927 -0.096490
  -0.000000 0.310931 -0.000000 0.057997 0.002219 -0.497400
  0.000000 0.255058 -0.000001 -0.080823 0.012335 -0.239554
  0.182656 0.102358 0.122067 0.006717 0.810288 0.450624
  0.000002 0.450617 -0.000000 -0.528842 -0.099810 -0.027483
  -0.000001 0.295730 -0.000001 0.219191 -0.276743 0.060333
  0.025107 1.448908 0.285964 0.494772 0.504178 0.517254
  0.081677 0.956432 -0.018380 -0.046746 -0.719121 -0.126346
  0.000000 0.323706 0.000000 0.045437 -0.040644 -0.458984
  -0.000000 0.229678 0.000000 0.034393 0.095533 -0.292494
  -0.151893 0.951491 -0.015788 -0.126932 -0.733824 -0.153564
  -0.000001 0.298947 -0.000001 0.088293 -0.034341 -0.361605
  0.000000 0.222754 0.000001 0.019080 0.079132 -0.311520
  -0.332550 0.872253 0.059175 0.063719 -0.067224 -0.078602
  -0.000001 0.247823 0.000001 -0.389387 -0.000459 0.092568
  -0.000001 0.155400 -0.000000 -0.220083 0.028629 -0.117047
  0.531379 1.351308 -0.004340 0.015880 0.004109 0.999865
  0.002183 1.423120 -0.451181 0.675237 0.001866 -0.002772
  0.014634 1.825496 -0.071451 0.297168 0.620304 0.574690
  0.000000 1.493901 0.000000 0.495193 0.178597 0.341744
  -0.000001 2.103016 -0.000000 0.059383 0.503907 0.497000
  0.093227 1.351308 0.523153 0.654643 0.002690 0.755927
  -0.000001 1.823368 -0.000000 0.139945 0.474734 -0.285607
  0.286576 1.006395 -0.107109 0.348032 0.496383 -0.452019
  0.000000 0.249956 -0.000000 0.001732 -0.008893 -0.495894
  -0.000000 0.254363 0.000000 -0.007263 0.044854 -0.460129
  0.120543 0.102358 -0.183668 -0.196436 -0.496542 0.467265
  -0.000001 0.445150 0.000000 0.421627 -0.020618 0.244398
  -0.000001 0.302324 0.000000 -0.286613 0.593493 0.135285
  0.073565 1.013167 -0.024132 0.441973 -0.650345 0.377583
  0.000001 0.266205 0.000001 -0.007424 0.013467 0.458595
  0.000000 0.229739 0.000000 0.007382 0.005411 0.427173
  -0.127263 1.003840 0.060604 0.466017 -0.626284 0.387507
  -0.000000 0.246800 -0.000001 -0.014543 0.000136 0.267196
  0.000000 0.222126 0.000000 0.038690 0.041614 0.536890
  -0.358086 0.893699 0.063868 0.358331 -0.692847 0.305698
  0.000001 0.221431 0.000000 -0.038824 0.004072 0.244935
  -0.000000 0.154458 0.000000 0.039139 0.041515 0.644615
  -0.810392 0.550811 -0.372493 -0.966435 0.110867 -0.082632
  0.000000 3.626384 0.000000 -0.373016 0.002306 0.012456
  0.782400 0.551415 -0.372917 -0.932379 -0.100583 0.052530
  0.000000 3.626384 -0.000001 -0.302329 -0.017285 -0.009478
  -1.406109 0.838118 1.299208 -0.369178 0.203943 -0.901430
  -0.090614 0.138320 1.006144 0.752092 0.018236 0.046746
  -0.090614 0.138320 1.006144 -0.852404 0.078746 -0.052999
  2.241435 0.812477 -1.543512 0.711378 -0.142690 -0.667010
  -0.005721 0.138320 -1.010200 -0.025764 -0.537679 0.842437
  -0.005721 0.138320 -1.010200 -0.753536 -0.000863 0.003278
}

frame 5 {
  -0.000000 0.000000 -0.009903 -0.707107 -0.000000 -0.000000
  0.309123 6.437504 -0.106869 -0.075371 -0.540867 0.048998
  0.000000 1.240110 -0.000000 0.031071 0.002183 -0.037881
  -0.000000 1.426177 -0.000000 -0.196313 0.001657 0.045458
  -0.000000 1.821083 0.000000 -0.014395 -0.205294 -0.066265
  -0.000000 0.808123 -0.000000 0.001844 -0.515148 -0.857099
  -0.044148 0.766294 0.024775 0.053142 0.016256 0.043776
  -0.003138 0.224356 0.163702 -0.582226 0.395844 0.586146
  -0.259540 0.557511 -0.217253 0.910591 -0.395641 0.087797
  0.000000 0.017501 -0.000000 0.760882 -0.167410 -0.216500
  -0.000000 0.135389 -0.000001 0.085507 -0.079079 0.221816
  -0.000000 0.113742 -0.000000 -0.170873 -0.044783 0.171053
  0.000000 0.113741 0.000000 -0.023942 -0.013166 0.230895
  0.262165 0.811894 0.662537 0.058391 0.839188 0.538278
  -0.244069 0.811856 0.663658 0.071178 0.837723 0.537842
  0.224683 0.261799 0.775026 0.051194 -0.711366 0.212862
  0.000000 0.017499 0.000000 0.688007 -0.192312 -0.197057
  0.000000 0.145787 -0.000001 0.146126 -0.026165 0.196273
  0.000000 0.112094 0.000000 -0.065942 -0.067975 0.234347
  -0.000000 0.111594 -0.000001 0.030163 -0.047899 0.223378
  0.365934 0.793584 0.683419 0.046999 0.705543 -0.046999
  -0.000001 0.011231 0.000000 0.125929 0.784490 0.580787
  0.000000 0.112704 0.000001 0.249012 -0.023437 0.387487
  0.360328 0.777493 0.684140 0.046999 0.705543 -0.046999
  0.000000 0.010074 -0.000000 -0.099298 0.457443 0.813066
  0.000000 0.108887 -0.000000 -0.431282 0.352683 0.307497
  -0.136626 0.803880 0.692454 0.046999 0.705543 -0.046999
  0.000000 0.011231 -0.000000 0.003873 0.733545 0.661951
  -0.000000 0.131865 0.000000 0.080170 -0.086442 0.373197
  -0.136810 0.780376 0.690930 0.046999 0.705543 -0.046999
  0.000000 0.010074 0.000000 0.077077 0.630997 0.751607
  -0.000000 0.128464 -0.000000 -0.196152 -0.082470 0.372122
  -0.002195 0.809024 0.000794 0.040325 0.000217 -0.001349
  -0.014833 1.825301 -0.071422 0.540264 -0.451656 -0.436753
  -0.000000 1.493901 -0.000000 0.274401 0.657438 -0.594054
  -0.000001 2.103016 0.000000 -0.664713 0.049281 0.322704
  -0.000000 1.823368 0.000001 -0.248552 0.457140 0.123186
  0.288928 0.945606 -0.016980 -0.086076 -0.662923 -0.096502
  0.000000 0.310931 0.000001 0.058020 0.002220 -0.497316
  0.000000 0.255058 -0.000000 -0.080848 0.012370 -0.239656
  0.182657 0.102358 0.122067 0.006690 0.810312 0.450562
  0.000001 0.450618 -0.000000 -0.528781 -0.099815 -0.027487
  -0.000001 0.295730 0.000000 0.219192 -0.276715 0.060333
  0.025108 1.448908 0.285964 0.494772 0.504178 0.517254
  0.081678 0.956433 -0.018380 -0.046729 -0.719117 -0.126358
  -0.000000 0.323706 -0.000000 0.045448 -0.040645 -0.458878
  0.000000 0.229679 -0.000001 0.034373 0.095565 -0.292612
  -0.151890 0.951490 -0.015788 -0.126910 -0.733818 -0.153580
  0.000000 0.298947 -0.000001 0.088290 -0.034341 -0.361491
  -0.000000 0.222753 0.000000 0.019066 0.079162 -0.311641
  -0.332549 0.872253 0.059175 0.063668 -0.067217 -0.078574
  0.000000 0.247823 -0.000000 -0.389132 -0.000458 0.092426
  -0.000000 0.155400 -0.000000 -0.220296 0.028699 -0.116920
  0.531378 1.351308 -0.004340 0.015897 0.004117 0.999865
  0.002183 1.423119 -0.451180 0.675237 0.001866 -0.002772
  0.014634 1.825495 -0.071451 0.297168 0.620304 0.574690
  0.000001 1.493901 -0.000001 0.482828 0.190591 0.350115
  0.000000 2.103019 -0.000000 0.054310 0.517500 0.454539
  0.093227 1.351308 0.523155 0.654642 0.002695 0.755928
  0.000001 1.823368 -0.000000 0.168845 0.467960 -0.279139
  0.286576 1.006395 -0.107108 0.348032 0.496382 -0.452023
  0.000001 0.249955 0.000000 0.001730 -0.008893 -0.495889
  0.000000 0.254363 -0.000000 -0.007264 0.044850 -0.460131
  0.120542 0.102358 -0.183667 -0.196436 -0.496542 0.467265
  -0.000001 0.445150 0.000001 0.421631 -0.020618 0.244399
  0.000000 0.302323 0.000000 -0.286618 0.593491 0.135285
  0.073565 1.013167 -0.024133 0.441975 -0.650345 0.377583
  -0.000001 0.266204 -0.000000 -0.007424 0.013467 0.458591
  0.000000 0.229740 -0.000000 0.007382 0.005409 0.427175
  -0.127263 1.003840 0.060604 0.466020 -0.626282 0.387508
  0.000000 0.246800 -0.000000 -0.014542 0.000136 0.267187
  0.000000 0.222126 -0.000000 0.038690 0.041612 0.536894
  -0.358086 0.893699 0.063867 0.358333 -0.692847 0.305698
  -0.000000 0.221431 0.000000 -0.038822 0.004072 0.244929
  -0.000000 0.154458 0.000000 0.039138 0.041512 0.644618
  -0.810392 0.550811 -0.372493 -0.966435 0.110867 -0.082632
  0.000000 3.626384 0.000000 -0.373016 0.002306 0.012456
  0.782400 0.551415 -0.372917 -0.932379 -0.100583 0.052530
  0.000000 3.626384 -0.000001 -0.302329 -0.017285 -0.009478
  -1.406109 0.838118 1.299208 -0.369178 0.203943 -0.901430
  -0.090614 0.138320 1.006144 0.752092 0.018236 0.046746
  -0.090614 0.138320 1.006144 -0.852404 0.078746 -0.052999
  2.241435 0.812477 -1.543512 0.711378 -0.142690 -0.667010
  -0.005721 0.138320 -1.010200 -0.025764 -0.537679 0.842437
  -0.005721 0.138320 -1.010200 -0.753536 -0.000863 0.003278
}

frame 6 {
  -0.000000 0.000000 -0.009903 -0.707107 -0.000000 -0.000000
  0.309123 6.437504 -0.106869 -0.075371 -0.540867 0.048998
  0.000000 1.240110 -0.000000 0.027563 0.002551 -0.036306
  0.000000 1.426177 0.000000 -0.198272 0.001997 0.046303
  -0.000000 1.821084 0.000000 -0.007021 -0.207200 -0.067473
  -0.000000 0.808121 -0.000000 0.001844 -0.515148 -0.857099
  -0.044148 0.766294 0.024775 0.054465 0.015873 0.043791
  -0.003138 0.224356 0.163703 -0.582226 0.395844 0.586146
  -0.259540 0.557511 -0.217254 0.909387 -0.398400 0.087551
  0.000000 0.017501 -0.000000 0.759901 -0.167936 -0.216489
  0.000000 0.135389 -0.000001 0.086816 -0.078381 0.221090
  0.000000 0.113741 -0.000001 -0.169893 -0.045151 0.172073
  0.000000 0.113741 -0.000000 -0.022695 -0.013822 0.231010
  0.262165 0.811894 0.662539 0.057948 0.837736 0.540618
  -0.244069 0.811857 0.663659 0.070756 0.836285 0.540174
  0.224683 0.261799 0.775027 0.049037 -0.711518 0.210836
  0.000000 0.017499 0.000000 0.686977 -0.192467 -0.196584
  0.000000 0.145787 -0.000000 0.147104 -0.025680 0.195418
  -0.000000 0.112094 0.000000 -0.064279 -0.068046 0.234490
  0.000000 0.111594 0.000000 0.031160 -0.048656 0.223286
  0.365934 0.793585 0.683419 0.046999 0.705543 -0.046999
  -0.000000 0.011230 -0.000000 0.125930 0.784488 0.580791
  -0.000000 0.112704 0.000000 0.249008 -0.023434 0.387487
  0.360328 0.777494 0.684141 0.046999 0.705543 -0.046999
  -0.000000 0.010073 0.000000 -0.099297 0.457442 0.813066
  -0.000000 0.108888 0.000000 -0.431280 0.352683 0.307497
  -0.136625 0.803881 0.692455 0.046999 0.705543 -0.046999
  0.000000 0.011231 0.000000 0.005881 0.734012 0.661932
  -0.000000 0.131865 0.000001 0.082257 -0.086901 0.372744
  -0.136810 0.780377 0.690930 0.046999 0.705543 -0.046999
  0.000000 0.010075 -0.000000 0.079507 0.631562 0.751354
  0.000000 0.128465 -0.000001 -0.193979 -0.083033 0.373262
  -0.002195 0.809022 0.000794 0.040325 0.000217 -0.001349
  -0.014833 1.825301 -0.071421 0.540264 -0.451656 -0.436753
  0.000000 1.493902 0.000002 0.260586 0.649588 -0.605646
  0.000000 2.103017 -0.000000 -0.650857 0.050490 0.315977
  0.000001 1.823368 0.000000 -0.246209 0.460399 0.127679
  0.288926 0.945606 -0.016980 -0.086057 -0.662917 -0.096518
  -0.000001 0.310931 0.000000 0.058040 0.002222 -0.497240
  -0.000000 0.255058 -0.000000 -0.080872 0.012402 -0.239743
  0.182657 0.102358 0.122067 0.006663 0.810336 0.450508
  0.000000 0.450618 0.000000 -0.528725 -0.099822 -0.027489
  0.000000 0.295730 -0.000000 0.219192 -0.276696 0.060331
  0.025107 1.448908 0.285964 0.494772 0.504178 0.517254
  0.081676 0.956432 -0.018380 -0.046715 -0.719113 -0.126371
  -0.000000 0.323706 0.000001 0.045459 -0.040646 -0.458783
  0.000000 0.229678 -0.000000 0.034353 0.095596 -0.292712
  -0.151894 0.951490 -0.015788 -0.126894 -0.733812 -0.153599
  0.000000 0.298947 -0.000000 0.088287 -0.034341 -0.361388
  0.000000 0.222753 -0.000001 0.019053 0.079187 -0.311744
  -0.332552 0.872253 0.059175 0.063623 -0.067209 -0.078547
  -0.000001 0.247823 -0.000000 -0.388916 -0.000457 0.092282
  -0.000000 0.155400 -0.000000 -0.220474 0.028768 -0.116794
  0.531379 1.351308 -0.004340 0.015880 0.004082 0.999865
  0.002183 1.423119 -0.451180 0.675237 0.001866 -0.002772
  0.014634 1.825496 -0.071451 0.297168 0.620304 0.574690
  -0.000000 1.493901 -0.000002 0.473310 0.210845 0.357694
  -0.000001 2.103017 0.000000 0.049304 0.529427 0.412639
  0.093227 1.351308 0.523154 0.654643 0.002690 0.755927
  -0.000001 1.823368 0.000000 0.192380 0.455326 -0.279894
  0.286576 1.006395 -0.107108 0.347999 0.496422 -0.451943
  -0.000000 0.249955 -0.000001 0.001743 -0.008890 -0.495984
  0.000000 0.254363 0.000000 -0.007258 0.044883 -0.460133
  0.120542 0.102358 -0.183667 -0.196417 -0.496560 0.467274
  -0.000001 0.445150 0.000000 0.421589 -0.020620 0.244254
  0.000001 0.302324 -0.000000 -0.286502 0.593519 0.135369
  0.073565 1.013167 -0.024131 0.441906 -0.650381 0.377554
  0.000001 0.266205 0.000001 -0.007434 0.013469 0.458679
  -0.000000 0.229740 -0.000000 0.007377 0.005440 0.427175
  -0.127263 1.003840 0.060604 0.465943 -0.626331 0.387466
  -0.000001 0.246800 -0.000000 -0.014556 0.000137 0.267325
  -0.000000 0.222127 -0.000001 0.038690 0.041645 0.536873
  -0.358085 0.893699 0.063869 0.358280 -0.692866 0.305679
  0.000001 0.221430 0.000001 -0.038838 0.004073 0.244950
  0.000000 0.154458 -0.000000 0.039142 0.041551 0.644654
  -0.810392 0.550811 -0.372493 -0.966435 0.110867 -0.082632
  0.000000 3.626384 0.000000 -0.373016 0.002306 0.012456
  0.782400 0.551415 -0.372917 -0.932379 -0.100583 0.052530
  0.000000 3.626384 -0.000001 -0.302329 -0.017285 -0.009478
  -1.406109 0.838118 1.299208 -0.369178 0.203943 -0.901430
  -0.090614 0.138320 1.006144 0.752092 0.018236 0.046746
  -0.090614 0.138320 1.006144 -0.852404 0.078746 -0.052999
  2.241435 0.812477 -1.543512 0.711378 -0.142690 -0.667010
  -0.005721 0.138320 -1.010200 -0.025764 -0.537679 0.842437
  -0.005721 0.138320 -1.010200 -0.753536 -0.000863 0.003278
}

frame 7 {
  -0.000000 0.000000 -0.009903 -0.707107 -0.000000 -0.000000
  0.309123 6.437504 -0.106869 -0.075371 -0.540867 0.048998
  0.000000 1.240110 -0.000000 0.026377 0.002675 -0.035773
  0.000000 1.426178 -0.000000 -0.198933 0.002112 0.046589
  0.000000 1.821083 -0.000000 -0.004529 -0.207841 -0.067881
  0.000000 0.808123 0.000000 0.001844 -0.515148 -0.857099
  -0.044148 0.766295 0.024776 0.054913 0.015744 0.043796
  -0.003137 0.224357 0.163702 -0.582226 0.395844 0.586146
  -0.259541 0.557512 -0.217254 0.908979 -0.399331 0.087467
  0.000000 0.017501 -0.000000 0.759572 -0.168113 -0.216484
  0.000000 0.135389 0.000001 0.087256 -0.078146 0.220841
  -0.000000 0.113741 0.000000 -0.169566 -0.045274 0.172416
  0.000000 0.113741 -0.000000 -0.022267 -0.014044 0.231048
  0.262165 0.811895 0.662537 0.057801 0.837246 0.541406
  -0.244068 0.811858 0.663657 0.070614 0.835799 0.540958
  0.224683 0.261799 0.775026 0.048308 -0.711568 0.210152
  0.000000 0.017499 0.000000 0.686631 -0.192517 -0.196424
  0.000000 0.145788 0.000001 0.147427 -0.025517 0.195128
  0.000000 0.112093 0.000000 -0.063717 -0.068067 0.234537
  0.000000 0.111594 -0.000001 0.031504 -0.048911 0.223254
  0.365935 0.793586 0.683418 0.046999 0.705543 -0.046999
  0.000000 0.011231 -0.000000 0.125930 0.784489 0.580789
  0.000000 0.112704 0.000001 0.249012 -0.023436 0.387487
  0.360328 0.777495 0.684141 0.046999 0.705543 -0.046999
  0.000000 0.010074 -0.000000 -0.099297 0.457443 0.813065
  0.000001 0.108887 0.000000 -0.431281 0.352682 0.307498
  -0.136625 0.803883 0.692454 0.046999 0.705543 -0.046999
  0.000000 0.011230 0.000000 0.006561 0.734162 0.661932
  -0.000000 0.131865 -0.000000 0.082949 -0.087057 0.372588
  -0.136810 0.780378 0.690930 0.046999 0.705543 -0.046999
  0.000000 0.010074 0.000000 0.080327 0.631754 0.751265
  -0.000000 0.128464 -0.000001 -0.193239 -0.083221 0.373645
  -0.002195 0.809024 0.000794 0.040325 0.000217 -0.001349
  -0.014832 1.825301 -0.071422 0.540264 -0.451656 -0.436753
  -0.000000 1.493901 -0.000001 0.249910 0.643418 -0.614243
  -0.000001 2.103017 0.000001 -0.640540 0.051354 0.310968
  -0.000001 1.823368 -0.000000 -0.243981 0.462596 0.130480
  0.288926 0.945606 -0.016980 -0.086043 -0.662915 -0.096527
  0.000000 0.310931 0.000001 0.058053 0.002223 -0.497179
  0.000000 0.255058 0.000000 -0.080887 0.012424 -0.239813
  0.182657 0.102358 0.122067 0.006644 0.810353 0.450466
  -0.000001 0.450618 -0.000000 -0.528681 -0.099826 -0.027491
  0.000000 0.295730 -0.000001 0.219191 -0.276678 0.060330
  0.025107 1.448908 0.285964 0.494772 0.504178 0.517254
  0.081678 0.956432 -0.018380 -0.046704 -0.719110 -0.126381
  -0.000000 0.323706 0.000000 0.045466 -0.040647 -0.458707
  0.000000 0.229678 0.000000 0.034339 0.095618 -0.292794
  -0.151894 0.951490 -0.015787 -0.126883 -0.733806 -0.153615
  0.000000 0.298947 0.000000 0.088283 -0.034341 -0.361300
  0.000000 0.222754 -0.000002 0.019044 0.079207 -0.311831
  -0.332551 0.872253 0.059175 0.063586 -0.067205 -0.078528
  0.000000 0.247823 0.000000 -0.388743 -0.000456 0.092181
  0.000001 0.155400 -0.000000 -0.220616 0.028817 -0.116705
  0.531378 1.351308 -0.004341 0.015875 0.004081 0.999866
  0.002183 1.423120 -0.451181 0.675237 0.001866 -0.002772
  0.014634 1.825496 -0.071452 0.297168 0.620304 0.574690
  -0.000000 1.493901 -0.000001 0.467082 0.230445 0.363069
  0.000001 2.103016 0.000001 0.045150 0.538272 0.377875
  0.093228 1.351308 0.523154 0.654648 0.002690 0.755922
  0.000000 1.823369 0.000000 0.210109 0.441534 -0.282681
  0.286575 1.006395 -0.107109 0.348008 0.496411 -0.451965
  -0.000000 0.249955 -0.000001 0.001739 -0.008890 -0.495955
  0.000000 0.254362 -0.000000 -0.007260 0.044873 -0.460136
  0.120541 0.102358 -0.183668 -0.196421 -0.496555 0.467272
  0.000001 0.445150 0.000000 0.421603 -0.020620 0.244292
  0.000001 0.302324 0.000001 -0.286535 0.593510 0.135349
  0.073565 1.013167 -0.024132 0.441923 -0.650373 0.377560
  0.000001 0.266205 -0.000000 -0.007431 0.013468 0.458658
  0.000000 0.229739 -0.000001 0.007379 0.005430 0.427175
  -0.127264 1.003840 0.060604 0.465964 -0.626319 0.387476
  -0.000001 0.246800 -0.000001 -0.014552 0.000137 0.267286
  -0.000000 0.222127 -0.000000 0.038690 0.041634 0.536881
  -0.358086 0.893698 0.063867 0.358295 -0.692861 0.305683
  -0.000001 0.221430 -0.000000 -0.038833 0.004073 0.244940
  0.000000 0.154458 -0.000001 0.039140 0.041538 0.644648
  -0.810392 0.550811 -0.372493 -0.966435 0.110867 -0.082632
  0.000000 3.626384 0.000000 -0.373016 0.002306 0.012456
  0.782400 0.551415 -0.372917 -0.932379 -0.100583 0.052530
  0.000000 3.626384 -0.000001 -0.302329 -0.017285 -0.009478
  -1.406109 0.838118 1.299208 -0.369178 0.203943 -0.901430
  -0.090614 0.138320 1.006144 0.752092 0.018236 0.046746
  -0.090614 0.138320 1.006144 -0.852404 0.078746 -0.052999
  2.241435 0.812477 -1.543512 0.711378 -0.142690 -0.667010
  -0.005721 0.138320 -1.010200 -0.025764 -0.537679 0.842437
  -0.005721 0.138320 -1.010200 -0.753536 -0.000863 0.003278
}

frame 8 {
  -0.000000 0.000000 -0.009903 -0.707107 -0.000000 -0.000000
  0.309123 6.437504 -0.106869 -0.075371 -0.540867 0.048998
  0.000000 1.240110 -0.000000 0.027992 0.002506 -0.036498
  0.000000 1.426178 0.000000 -0.198032 0.001955 0.046200
  0.000000 1.821084 0.000000 -0.007923 -0.206968 -0.067326
  -0.000000 0.808121 -0.000001 0.001844 -0.515148 -0.857099
  -0.044148 0.766294 0.024774 0.054304 0.015920 0.043789
  -0.003138 0.224356 0.163703 -0.582226 0.395844 0.586146
  -0.259541 0.557510 -0.217253 0.909535 -0.398063 0.087581
  0.000000 0.017501 -0.000000 0.760022 -0.167872 -0.216492
  0.000000 0.135389 0.000000 0.086656 -0.078467 0.221179
  -0.000000 0.113742 0.000000 -0.170011 -0.045107 0.171948
  0.000000 0.113741 0.000001 -0.022852 -0.013742 0.230998
  0.262165 0.811894 0.662537 0.058003 0.837913 0.540333
  -0.244069 0.811857 0.663658 0.070808 0.836460 0.539890
  0.224683 0.261798 0.775027 0.049300 -0.711500 0.211084
  0.000000 0.017499 0.000000 0.687104 -0.192448 -0.196643
  0.000000 0.145788 0.000001 0.146980 -0.025739 0.195523
  -0.000000 0.112093 -0.000001 -0.064480 -0.068037 0.234474
  -0.000000 0.111594 0.000000 0.031038 -0.048563 0.223297
  0.365934 0.793584 0.683419 0.046999 0.705543 -0.046999
  0.000000 0.011231 0.000000 0.125930 0.784490 0.580788
  -0.000000 0.112704 0.000000 0.249010 -0.023435 0.387488
  0.360328 0.777493 0.684141 0.046999 0.705543 -0.046999
  -0.000000 0.010075 0.000000 -0.099298 0.457443 0.813066
  -0.000000 0.108887 0.000001 -0.431280 0.352683 0.307497
  -0.136625 0.803881 0.692455 0.046999 0.705543 -0.046999
  -0.000000 0.011231 -0.000000 0.005636 0.733952 0.661939
  -0.000000 0.131865 -0.000001 0.081989 -0.086843 0.372800
  -0.136810 0.780377 0.690931 0.046999 0.705543 -0.046999
  -0.000000 0.010075 0.000000 0.079211 0.631493 0.751385
  -0.000000 0.128464 -0.000001 -0.194242 -0.082965 0.373124
  -0.002195 0.809023 0.000793 0.040325 0.000217 -0.001349
  -0.014832 1.825302 -0.071422 0.540264 -0.451656 -0.436753
  -0.000001 1.493901 -0.000002 0.245456 0.641491 -0.617276
  0.000001 2.103015 0.000000 -0.636284 0.051703 0.308902
  0.000000 1.823368 -0.000000 -0.242973 0.463210 0.132420
  0.288928 0.945606 -0.016980 -0.086032 -0.662912 -0.096532
  0.000000 0.310930 -0.000000 0.058064 0.002224 -0.497152
  -0.000000 0.255058 -0.000001 -0.080900 0.012440 -0.239845
  0.182657 0.102359 0.122067 0.006633 0.810362 0.450446
  -0.000001 0.450618 -0.000000 -0.528661 -0.099829 -0.027492
  0.000001 0.295730 0.000000 0.219192 -0.276671 0.060329
  0.025106 1.448908 0.285964 0.494772 0.504178 0.517254
  0.081676 0.956433 -0.018380 -0.046694 -0.719108 -0.126385
  -0.000000 0.323706 -0.000001 0.045472 -0.040648 -0.458675
  -0.000000 0.229678 -0.000001 0.034329 0.095633 -0.292831
  -0.151894 0.951491 -0.015788 -0.126874 -0.733805 -0.153619
  -0.000000 0.298947 -0.000001 0.088284 -0.034341 -0.361265
  -0.000000 0.222753 0.000001 0.019037 0.079217 -0.311868
  -0.332551 0.872254 0.059175 0.063575 -0.067200 -0.078518
  0.000000 0.247823 0.000000 -0.388669 -0.000456 0.092118
  -0.000000 0.155400 -0.000000 -0.220682 0.028847 -0.116649
  0.531378 1.351308 -0.004341 0.015880 0.004070 0.999865
  0.002183 1.423120 -0.451181 0.675237 0.001866 -0.002772
  0.014634 1.825497 -0.071451 0.297168 0.620304 0.574690
  -0.000002 1.493901 0.000001 0.466695 0.240791 0.364244
  -0.000001 2.103016 -0.000000 0.043443 0.541642 0.363589
  0.093227 1.351308 0.523154 0.654643 0.002695 0.755927
  -0.000000 1.823368 -0.000001 0.216830 0.432653 -0.285525
  0.286575 1.006395 -0.107109 0.347996 0.496424 -0.451939
  0.000001 0.249955 0.000000 0.001742 -0.008890 -0.495989
  -0.000000 0.254363 0.000000 -0.007257 0.044883 -0.460134
  0.120541 0.102358 -0.183668 -0.196415 -0.496561 0.467274
  0.000001 0.445151 -0.000000 0.421589 -0.020620 0.244247
  -0.000000 0.302324 0.000000 -0.286498 0.593519 0.135374
  0.073564 1.013167 -0.024132 0.441900 -0.650385 0.377549
  -0.000000 0.266205 -0.000001 -0.007434 0.013469 0.458691
  0.000000 0.229740 -0.000000 0.007376 0.005440 0.427170
  -0.127264 1.003840 0.060604 0.465936 -0.626336 0.387461
  -0.000001 0.246800 -0.000001 -0.014557 0.000138 0.267340
  0.000000 0.222126 0.000000 0.038690 0.041646 0.536869
  -0.358085 0.893699 0.063868 0.358280 -0.692866 0.305680
  0.000001 0.221432 0.000000 -0.038837 0.004073 0.244942
  0.000000 0.154458 -0.000001 0.039141 0.041551 0.644659
  -0.810392 0.550811 -0.372493 -0.966435 0.110867 -0.082632
  0.000000 3.626384 0.000000 -0.373016 0.002306 0.012456
  0.782400 0.551415 -0.372917 -0.932379 -0.100583 0.052530
  0.000000 3.626384 -0.000001 -0.302329 -0.017285 -0.009478
  -1.406109 0.838118 1.299208 -0.369178 0.203943 -0.901430
  -0.090614 0.138320 1.006144 0.752092 0.018236 0.046746
  -0.090614 0.138320 1.006144 -0.852404 0.078746 -0.052999
  2.241435 0.812477 -1.543512 0.711378 -0.142690 -0.667010
  -0.005721 0.138320 -1.010200 -0.025764 -0.537679 0.842437
  -0.005721 0.138320 -1.010200 -0.753536 -0.000863 0.003278
}

frame 9 {
  -0.000000 0.000000 -0.009903 -0.707107 -0.000000 -0.000000
  0.309123 6.437504 -0.106869 -0.075371 -0.540867 0.048998
  0.000000 1.240110 -0.000000 0.032691 0.002014 -0.038608
  0.000000 1.426177 -0.000000 -0.195408 0.001500 0.045068
  0.000000 1.821084 -0.000000 -0.017801 -0.204409 -0.065705
  -0.000000 0.808122 -0.000000 0.001844 -0.515148 -0.857099
  -0.044148 0.766295 0.024774 0.052530 0.016433 0.043769
  -0.003138 0.224357 0.163703 -0.582226 0.395844 0.586146
  -0.259540 0.557512 -0.217253 0.911144 -0.394365 0.087910
  0.000000 0.017501 -0.000000 0.761335 -0.167166 -0.216504
  0.000000 0.135389 -0.000000 0.084899 -0.079401 0.222151
  0.000000 0.113742 0.000001 -0.171316 -0.044614 0.170581
  0.000000 0.113741 -0.000001 -0.024520 -0.012864 0.230837
  0.262164 0.811895 0.662538 0.058594 0.839858 0.537192
  -0.244069 0.811857 0.663658 0.071374 0.838387 0.536760
  0.224683 0.261800 0.775027 0.052190 -0.711293 0.213797
  0.000000 0.017499 0.000000 0.688481 -0.192239 -0.197273
  -0.000000 0.145787 0.000000 0.145673 -0.026389 0.196666
  -0.000000 0.112094 0.000001 -0.066705 -0.067942 0.234279
  -0.000000 0.111594 0.000000 0.029697 -0.047550 0.223418
  0.365934 0.793586 0.683419 0.046999 0.705543 -0.046999
  -0.000000 0.011231 -0.000000 0.125929 0.784492 0.580786
  -0.000000 0.112704 0.000001 0.249011 -0.023436 0.387488
  0.360328 0.777495 0.684141 0.046999 0.705543 -0.046999
  0.000001 0.010075 0.000000 -0.099297 0.457443 0.813065
  0.000000 0.108887 0.000000 -0.431284 0.352682 0.307498
  -0.136626 0.803882 0.692455 0.046999 0.705543 -0.046999
  -0.000000 0.011232 -0.000000 0.002944 0.733332 0.661952
  0.000000 0.131865 -0.000001 0.079218 -0.086227 0.373401
  -0.136810 0.780378 0.690930 0.046999 0.705543 -0.046999
  0.000000 0.010074 0.000000 0.075954 0.630732 0.751721
  0.000000 0.128464 -0.000000 -0.197157 -0.082207 0.371592
  -0.002196 0.809023 0.000793 0.040325 0.000217 -0.001349
  -0.014832 1.825302 -0.071422 0.540264 -0.451656 -0.436753
  -0.000000 1.493901 -0.000000 0.252661 0.646183 -0.610999
  0.000000 2.103015 0.000000 -0.647157 0.050803 0.314180
  0.000000 1.823368 -0.000000 -0.241549 0.461240 0.125978
  0.288926 0.945606 -0.016979 -0.086047 -0.662916 -0.096520
  0.000000 0.310931 -0.000000 0.058049 0.002223 -0.497223
  0.000000 0.255058 -0.000000 -0.080882 0.012416 -0.239765
  0.182655 0.102358 0.122068 0.006656 0.810342 0.450493
  -0.000000 0.450619 0.000000 -0.528712 -0.099824 -0.027490
  0.000000 0.295730 0.000001 0.219195 -0.276688 0.060332
  0.025105 1.448908 0.285964 0.494772 0.504178 0.517254
  0.081676 0.956432 -0.018380 -0.046706 -0.719111 -0.126372
  -0.000000 0.323706 -0.000002 0.045464 -0.040646 -0.458763
  -0.000000 0.229678 0.000001 0.034345 0.095607 -0.292738
  -0.151894 0.951491 -0.015787 -0.126885 -0.733810 -0.153604
  0.000000 0.298947 -0.000002 0.088290 -0.034341 -0.361362
  0.000000 0.222753 0.000000 0.019044 0.079199 -0.311773
  -0.332553 0.872253 0.059175 0.063618 -0.067206 -0.078541
  0.000001 0.247823 0.000000 -0.388867 -0.000456 0.092233
  0.000000 0.155400 0.000000 -0.220520 0.028791 -0.116750
  0.531378 1.351308 -0.004341 0.015896 0.004104 0.999865
  0.002183 1.423120 -0.451181 0.675237 0.001866 -0.002772
  0.014634 1.825496 -0.071451 0.297168 0.620304 0.574690
  0.000001 1.493901 -0.000002 0.478234 0.235610 0.356616
  -0.000000 2.103016 0.000000 0.047129 0.534172 0.394442
  0.093228 1.351308 0.523155 0.654645 0.002695 0.755925
  0.000000 1.823369 0.000001 0.197967 0.434924 -0.293368
  0.286575 1.006395 -0.107108 0.348015 0.496400 -0.451987
  0.000000 0.249955 0.000000 0.001735 -0.008891 -0.495928
  0.000001 0.254363 0.000000 -0.007261 0.044863 -0.460137
  0.120540 0.102358 -0.183667 -0.196426 -0.496551 0.467269
  -0.000001 0.445151 -0.000000 0.421614 -0.020619 0.244329
  -0.000000 0.302323 -0.000000 -0.286565 0.593503 0.135328
  0.073564 1.013166 -0.024133 0.441942 -0.650363 0.377567
  -0.000000 0.266205 0.000000 -0.007427 0.013468 0.458632
  0.000000 0.229739 0.000000 0.007379 0.005421 0.427177
  -0.127265 1.003840 0.060604 0.465985 -0.626306 0.387487
  0.000000 0.246800 -0.000000 -0.014548 0.000136 0.267246
  -0.000000 0.222128 -0.000000 0.038689 0.041624 0.536889
  -0.358087 0.893698 0.063868 0.358314 -0.692853 0.305693
  -0.000001 0.221430 -0.000000 -0.038825 0.004073 0.244913
  0.000000 0.154458 0.000000 0.039138 0.041525 0.644649
  -0.810392 0.550811 -0.372493 -0.966435 0.110867 -0.082632
  0.000000 3.626384 0.000000 -0.373016 0.002306 0.012456
  0.782400 0.551415 -0.372917 -0.932379 -0.100583 0.052530
  0.000000 3.626384 -0.000001 -0.302329 -0.017285 -0.009478
  -1.406109 0.838118 1.299208 -0.369178 0.203943 -0.901430
  -0.090614 0.138320 1.006144 0.752092 0.018236 0.046746
  -0.090614 0.138320 1.006144 -0.852404 0.078746 -0.052999
  2.241435 0.812477 -1.543512 0.711378 -0.142690 -0.667010
  -0.005721 0.138320 -1.010200 -0.025764 -0.537679 0.842437
  -0.005721 0.138320 -1.010200 -0.753536 -0.000863 0.003278
}

frame 10 {
  -0.000000 0.000000 -0.009903 -0.707107 -0.000000 -0.000000
  0.309123 6.437504 -0.106869 -0.075371 -0.540867 0.048998
  0.000000 1.240110 -0.000000 0.039446 0.001306 -0.041640
  0.000000 1.426177 -0.000000 -0.191632 0.000846 0.043439
  -0.000000 1.821084 -0.000000 -0.032002 -0.200691 -0.063363
  -0.000000 0.808122 0.000000 0.001844 -0.515148 -0.857099
  -0.044148 0.766295 0.024775 0.049980 0.017169 0.043739
  -0.003137 0.224358 0.163702 -0.582226 0.395844 0.586146
  -0.259543 0.557511 -0.217253 0.913433 -0.389034 0.088382
  0.000000 0.017501 -0.000000 0.763222 -0.166135 -0.216497
  -0.000000 0.135389 0.000001 0.082361 -0.080740 0.223525
  -0.000000 0.113741 0.000001 -0.173181 -0.043899 0.168592
  -0.000000 0.113741 0.000001 -0.026923 -0.011601 0.230593
  0.262165 0.811895 0.662537 0.059451 0.842655 0.532627
  -0.244068 0.811857 0.663658 0.072193 0.841158 0.532212
  0.224683 0.261799 0.775026 0.056346 -0.710976 0.217695
  0.000000 0.017499 0.000000 0.690463 -0.191917 -0.198162
  0.000000 0.145787 0.000000 0.143782 -0.027329 0.198290
  -0.000000 0.112094 -0.000000 -0.069905 -0.067794 0.233967
  -0.000000 0.111594 -0.000000 0.027771 -0.046086 0.223578
  0.365935 0.793586 0.683418 0.046999 0.705543 -0.046999
  -0.000000 0.011231 0.000000 0.125931 0.784488 0.580790
  0.000000 0.112704 -0.000001 0.249008 -0.023434 0.387489
  0.360328 0.777495 0.684141 0.046999 0.705543 -0.046999
  0.000000 0.010076 -0.000000 -0.099298 0.457441 0.813067
  -0.000000 0.108887 -0.000000 -0.431282 0.352684 0.307497
  -0.136625 0.803882 0.692455 0.046999 0.705543 -0.046999
  -0.000000 0.011232 0.000000 -0.000930 0.732411 0.661959
  0.000000 0.131865 0.000000 0.075205 -0.085317 0.374229
  -0.136810 0.780377 0.690930 0.046999 0.705543 -0.046999
  0.000000 0.010076 -0.000000 0.071252 0.629616 0.752180
  -0.000000 0.128464 -0.000001 -0.201334 -0.081103 0.369344
  -0.002195 0.809023 0.000794 0.040325 0.000217 -0.001349
  -0.014833 1.825302 -0.071422 0.540264 -0.451656 -0.436753
  -0.000001 1.493901 -0.000001 0.274557 0.657244 -0.593395
  0.000001 2.103015 0.000001 -0.675634 0.048290 0.328006
  -0.000000 1.823368 -0.000000 -0.240007 0.455648 0.107706
  0.288928 0.945606 -0.016980 -0.086088 -0.662925 -0.096495
  -0.000000 0.310931 -0.000001 0.058010 0.002220 -0.497382
  0.000000 0.255058 0.000001 -0.080837 0.012353 -0.239580
  0.182657 0.102358 0.122067 0.006707 0.810298 0.450606
  0.000001 0.450618 0.000000 -0.528831 -0.099815 -0.027484
  0.000000 0.295730 -0.000000 0.219202 -0.276737 0.060336
  0.025107 1.448908 0.285964 0.494772 0.504178 0.517254
  0.081675 0.956433 -0.018380 -0.046734 -0.719118 -0.126351
  0.000000 0.323706 0.000001 0.045446 -0.040644 -0.458961
  0.000000 0.229678 -0.000000 0.034378 0.095552 -0.292524
  -0.151893 0.951490 -0.015788 -0.126918 -0.733822 -0.153568
  0.000000 0.298947 -0.000000 0.088301 -0.034341 -0.361584
  0.000000 0.222753 -0.000001 0.019066 0.079149 -0.311550
  -0.332551 0.872254 0.059175 0.063715 -0.067218 -0.078593
  -0.000001 0.247823 0.000000 -0.389330 -0.000458 0.092499
  0.000001 0.155400 0.000000 -0.220136 0.028662 -0.116985
  0.531378 1.351308 -0.004340 0.015864 0.004065 0.999866
  0.002183 1.423120 -0.451181 0.675237 0.001866 -0.002772
  0.014634 1.825497 -0.071451 0.297168 0.620304 0.574690
  0.000001 1.493901 0.000000 0.499047 0.213808 0.341987
  -0.000000 2.103015 -0.000001 0.055968 0.513231 0.468413
  0.093227 1.351308 0.523154 0.654642 0.002704 0.755928
  -0.000002 1.823368 -0.000000 0.151698 0.449728 -0.304980
  0.286576 1.006395 -0.107106 0.348108 0.496292 -0.452198
  0.000000 0.249956 -0.000000 0.001705 -0.008900 -0.495675
  -0.000000 0.254363 -0.000001 -0.007279 0.044780 -0.460127
  0.120543 0.102358 -0.183666 -0.196481 -0.496501 0.467247
  -0.000001 0.445151 -0.000000 0.421725 -0.020613 0.244724
  0.000001 0.302323 0.000000 -0.286878 0.593428 0.135101
  0.073565 1.013167 -0.024131 0.442130 -0.650262 0.377650
  0.000000 0.266205 0.000000 -0.007401 0.013463 0.458389
  -0.000001 0.229740 -0.000000 0.007394 0.005340 0.427179
  -0.127263 1.003840 0.060606 0.466189 -0.626178 0.387595
  -0.000000 0.246800 -0.000000 -0.014511 0.000132 0.266899
  0.000000 0.222127 -0.000001 0.038689 0.041536 0.536931
  -0.358085 0.893698 0.063870 0.358455 -0.692801 0.305746
  -0.000000 0.221430 -0.000001 -0.038784 0.004070 0.244867
  -0.000000 0.154458 -0.000000 0.039129 0.041422 0.644545
  -0.810392 0.550811 -0.372493 -0.966435 0.110867 -0.082632
  0.000000 3.626384 0.000000 -0.373016 0.002306 0.012456
  0.782400 0.551415 -0.372917 -0.932379 -0.100583 0.052530
  0.000000 3.626384 -0.000001 -0.302329 -0.017285 -0.009478
  -1.406109 0.838118 1.299208 -0.369178 0.203943 -0.901430
  -0.090614 0.138320 1.006144 0.752092 0.018236 0.046746
  -0.090614 0.138320 1.006144 -0.852404 0.078746 -0.052999
  2.241435 0.812477 -1.543512 0.711378 -0.142690 -0.667010
  -0.005721 0.138320 -1.010200 -0.025764 -0.537679 0.842437
  -0.005721 0.138320 -1.010200 -0.753536 -0.000863 0.003278
}

frame 11 {
  -0.000000 0.000000 -0.009903 -0.707107 -0.000000 -0.000000
  0.309123 6.437504 -0.106869 -0.075371 -0.540867 0.048998
  0.000000 1.240110 -0.000000 0.046199 0.000599 -0.044670
  0.000000 1.426177 0.000000 -0.187853 0.000191 0.041810
  0.000000 1.821083 -0.000000 -0.046197 -0.196929 -0.061007
  -0.000000 0.808121 0.000000 0.001844 -0.515148 -0.857099
  -0.044148 0.766293 0.024775 0.047429 0.017906 0.043710
  -0.003138 0.224358 0.163703 -0.582226 0.395844 0.586146
  -0.259541 0.557511 -0.217254 0.915691 -0.383689 0.088851
  0.000000 0.017501 -0.000000 0.765102 -0.165091 -0.216459
  -0.000000 0.135389 -0.000000 0.079806 -0.082070 0.224870
  0.000000 0.113742 -0.000002 -0.175022 -0.043179 0.166588
  -0.000000 0.113741 -0.000000 -0.029320 -0.010338 0.230319
  0.262165 0.811896 0.662537 0.060312 0.845448 0.528010
  -0.244068 0.811858 0.663657 0.073017 0.843926 0.527612
  0.224683 0.261799 0.775026 0.060500 -0.710635 0.221585
  -0.000000 0.017499 0.000000 0.692444 -0.191571 -0.199030
  -0.000000 0.145788 -0.000000 0.141876 -0.028276 0.199894
  0.000000 0.112093 0.000000 -0.073091 -0.067636 0.233618
  -0.000000 0.111594 0.000001 0.025843 -0.044619 0.223716
  0.365934 0.793586 0.683418 0.046999 0.705543 -0.046999
  -0.000000 0.011231 0.000000 0.125930 0.784486 0.580793
  0.000000 0.112704 0.000000 0.249003 -0.023431 0.387487
  0.360328 0.777495 0.684141 0.046999 0.705543 -0.046999
  0.000000 0.010073 0.000000 -0.099298 0.457442 0.813066
  -0.000000 0.108888 0.000001 -0.431282 0.352683 0.307497
  -0.136626 0.803883 0.692455 0.046999 0.705543 -0.046999
  0.000000 0.011231 0.000000 -0.004805 0.731466 0.661942
  0.000000 0.131865 -0.000000 0.071203 -0.084388 0.375012
  -0.136810 0.780378 0.690930 0.046999 0.705543 -0.046999
  -0.000001 0.010075 0.000000 0.066539 0.628468 0.752613
  0.000000 0.128464 -0.000001 -0.205496 -0.079987 0.367045
  -0.002195 0.809022 0.000794 0.040325 0.000217 -0.001349
  -0.014832 1.825302 -0.071422 0.540264 -0.451656 -0.436753
  0.000001 1.493901 0.000001 0.304062 0.668728 -0.570086
  0.000000 2.103016 0.000000 -0.708141 0.045107 0.343787
  0.000001 1.823368 0.000000 -0.241229 0.447054 0.085444
  0.288927 0.945606 -0.016980 -0.086039 -0.662909 -0.096550
  0.000000 0.310931 -0.000000 0.058066 0.002225 -0.497127
  0.000000 0.255059 -0.000000 -0.080905 0.012447 -0.239857
  0.182656 0.102358 0.122067 0.006628 0.810368 0.450444
  -0.000001 0.450618 0.000000 -0.528652 -0.099835 -0.027489
  -0.000000 0.295730 -0.000001 0.219190 -0.276680 0.060325
  0.025106 1.448908 0.285964 0.494772 0.504178 0.517254
  0.081676 0.956432 -0.018380 -0.046702 -0.719105 -0.126400
  0.000000 0.323706 0.000002 0.045474 -0.040648 -0.458648
  0.000000 0.229678 0.000002 0.034323 0.095640 -0.292845
  -0.151892 0.951490 -0.015787 -0.126881 -0.733799 -0.153640
  -0.000000 0.298947 0.000001 0.088282 -0.034341 -0.361230
  0.000000 0.222754 0.000000 0.019030 0.079225 -0.311886
  -0.332552 0.872253 0.059175 0.063563 -0.067196 -0.078509
  -0.000002 0.247823 0.000000 -0.388656 -0.000455 0.092065
  0.000001 0.155400 -0.000000 -0.220683 0.028868 -0.116608
  0.531379 1.351308 -0.004340 0.015881 0.004078 0.999865
  0.002183 1.423120 -0.451181 0.675237 0.001866 -0.002772
  0.014634 1.825495 -0.071451 0.297168 0.620304 0.574690
  0.000001 1.493901 -0.000003 0.517624 0.186805 0.328946
  -0.000001 2.103016 0.000000 0.065157 0.486429 0.545323
  0.093228 1.351308 0.523154 0.654651 0.002695 0.755921
  0.000000 1.823369 0.000000 0.098688 0.467695 -0.313503
  0.286577 1.006395 -0.107109 0.348014 0.496403 -0.451981
  0.000000 0.249957 -0.000000 0.001736 -0.008891 -0.495943
  -0.000001 0.254363 -0.000001 -0.007261 0.044866 -0.460128
  0.120542 0.102358 -0.183667 -0.196430 -0.496549 0.467270
  0.000001 0.445151 -0.000000 0.421615 -0.020619 0.244326
  0.000001 0.302324 0.000000 -0.286559 0.593505 0.135331
  0.073565 1.013167 -0.024132 0.441937 -0.650366 0.377565
  0.000000 0.266206 -0.000000 -0.007428 0.013468 0.458649
  -0.000000 0.229740 -0.000000 0.007379 0.005424 0.427166
  -0.127263 1.003840 0.060603 0.465974 -0.626313 0.387481
  -0.000000 0.246799 0.000001 -0.014551 0.000137 0.267283
  -0.000000 0.222127 -0.000001 0.038690 0.041630 0.536871
  -0.358085 0.893698 0.063868 0.358298 -0.692861 0.305681
  -0.000001 0.221430 -0.000000 -0.038835 0.004073 0.244967
  0.000000 0.154457 0.000001 0.039142 0.041535 0.644624
  -0.810392 0.550811 -0.372493 -0.966435 0.110867 -0.082632
  0.000000 3.626384 0.000000 -0.373016 0.002306 0.012456
  0.782400 0.551415 -0.372917 -0.932379 -0.100583 0.052530
  0.000000 3.626384 -0.000001 -0.302329 -0.017285 -0.009478
  -1.406109 0.838118 1.299208 -0.369178 0.203943 -0.901430
  -0.090614 0.138320 1.006144 0.752092 0.018236 0.046746
  -0.090614 0.138320 1.006144 -0.852404 0.078746 -0.052999
  2.241435 0.812477 -1.543512 0.711378 -0.142690 -0.667010
  -0.005721 0.138320 -1.010200 -0.025764 -0.537679 0.842437
  -0.005721 0.138320 -1.010200 -0.753536 -0.000863 0.003278
}

frame 12 {
  -0.000000 0.000000 -0.009903 -0.707107 -0.000000 -0.000000
  0.309123 6.437504 -0.106869 -0.075371 -0.540867 0.048998
  0.000000 1.240110 -0.000000 0.050894 0.000107 -0.046775
  0.000000 1.426178 -0.000000 -0.185222 -0.000264 0.040677
  -0.000000 1.821083 0.000000 -0.056063 -0.194287 -0.059360
  0.000000 0.808121 -0.000000 0.001844 -0.515148 -0.857099
  -0.044148 0.766293 0.024775 0.045655 0.018419 0.043689
  -0.003137 0.224357 0.163702 -0.582226 0.395844 0.586146
  -0.259542 0.557510 -0.217253 0.917242 -0.379966 0.089175
  0.000000 0.017501 -0.000000 0.766406 -0.164356 -0.216416
  0.000000 0.135389 -0.000000 0.078026 -0.082992 0.225790
  -0.000000 0.113741 0.000001 -0.176289 -0.042676 0.165181
  -0.000000 0.113741 0.000000 -0.030988 -0.009463 0.230115
  0.262165 0.811895 0.662537 0.060912 0.847388 0.524769
  -0.244068 0.811857 0.663657 0.073592 0.845848 0.524384
  0.224683 0.261800 0.775026 0.063386 -0.710383 0.224284
  -0.000000 0.017499 0.000000 0.693825 -0.191315 -0.199622
  -0.000000 0.145788 -0.000001 0.140538 -0.028939 0.200995
  -0.000000 0.112094 0.000001 -0.075302 -0.067520 0.233357
  -0.000000 0.111594 0.000000 0.024501 -0.043595 0.223799
  0.365934 0.793585 0.683418 0.046999 0.705543 -0.046999
  -0.000000 0.011231 0.000000 0.125929 0.784492 0.580785
  0.000000 0.112704 0.000001 0.249012 -0.023436 0.387489
  0.360328 0.777494 0.684140 0.046999 0.705543 -0.046999
  -0.000000 0.010074 -0.000000 -0.099298 0.457445 0.813064
  -0.000001 0.108887 0.000001 -0.431277 0.352682 0.307497
  -0.136625 0.803883 0.692455 0.046999 0.705543 -0.046999
  -0.000000 0.011231 0.000000 -0.007499 0.730793 0.661918
  0.000000 0.131865 0.000001 0.068415 -0.083729 0.375530
  -0.136810 0.780378 0.690930 0.046999 0.705543 -0.046999
  -0.000000 0.010075 0.000000 0.063252 0.627656 0.752895
  -0.000000 0.128465 0.000000 -0.208374 -0.079201 0.365420
  -0.002195 0.809022 0.000794 0.040325 0.000217 -0.001349
  -0.014833 1.825301 -0.071422 0.540264 -0.451656 -0.436753
  -0.000000 1.493901 0.000001 0.328330 0.675456 -0.551237
  0.000000 2.103014 0.000000 -0.730631 0.042670 0.354706
  0.000000 1.823368 0.000001 -0.244835 0.438965 0.068884
  0.288927 0.945606 -0.016979 -0.086085 -0.662916 -0.096533
  0.000000 0.310931 -0.000001 0.058028 0.002222 -0.497286
  -0.000000 0.255058 -0.000000 -0.080863 0.012386 -0.239662
  0.182657 0.102358 0.122067 0.006677 0.810326 0.450564
  -0.000001 0.450618 0.000001 -0.528771 -0.099830 -0.027479
  -0.000000 0.295730 -0.000000 0.219193 -0.276739 0.060325
  0.025106 1.448908 0.285964 0.494772 0.504178 0.517254
  0.081676 0.956432 -0.018380 -0.046737 -0.719111 -0.126385
  0.000000 0.323706 0.000001 0.045457 -0.040645 -0.458848
  0.000000 0.229678 -0.000000 0.034354 0.095584 -0.292619
  -0.151892 0.951491 -0.015787 -0.126919 -0.733809 -0.153614
  0.000000 0.298947 0.000001 0.088293 -0.034341 -0.361448
  0.000000 0.222753 0.000001 0.019048 0.079178 -0.311656
  -0.332551 0.872254 0.059175 0.063661 -0.067207 -0.078559
  -0.000000 0.247822 0.000000 -0.389151 -0.000457 0.092314
  0.000000 0.155400 0.000000 -0.220267 0.028745 -0.116831
  0.531378 1.351308 -0.004340 0.015886 0.004070 0.999865
  0.002183 1.423120 -0.451181 0.675237 0.001866 -0.002772
  0.014634 1.825496 -0.071451 0.297168 0.620304 0.574690
  -0.000001 1.493901 -0.000001 0.528130 0.167058 0.321790
  0.000000 2.103015 -0.000000 0.071171 0.465704 0.595653
  0.093227 1.351308 0.523154 0.654634 0.002704 0.755935
  -0.000001 1.823368 -0.000001 0.060165 0.480180 -0.317194
  0.286577 1.006395 -0.107108 0.348084 0.496323 -0.452137
  0.000001 0.249955 0.000001 0.001715 -0.008897 -0.495771
  0.000000 0.254364 -0.000000 -0.007273 0.044808 -0.460108
  0.120541 0.102358 -0.183667 -0.196481 -0.496506 0.467255
  0.000001 0.445150 0.000000 0.421706 -0.020614 0.244623
  -0.000000 0.302323 0.000000 -0.286789 0.593452 0.135164
  0.073565 1.013167 -0.024132 0.442074 -0.650291 0.377628
  0.000001 0.266204 0.000000 -0.007410 0.013465 0.458489
  -0.000000 0.229739 -0.000000 0.007390 0.005367 0.427152
  -0.127263 1.003841 0.060604 0.466117 -0.626225 0.387553
  0.000000 0.246800 0.000001 -0.014526 0.000134 0.267069
  0.000000 0.222126 -0.000000 0.038690 0.041567 0.536878
  -0.358085 0.893698 0.063867 0.358394 -0.692828 0.305711
  0.000000 0.221432 -0.000001 -0.038813 0.004071 0.244986
  -0.000000 0.154458 -0.000001 0.039138 0.041465 0.644518
  -0.810392 0.550811 -0.372493 -0.966435 0.110867 -0.082632
  0.000000 3.626384 0.000000 -0.373016 0.002306 0.012456
  0.782400 0.551415 -0.372917 -0.932379 -0.100583 0.052530
  0.000000 3.626384 -0.000001 -0.302329 -0.017285 -0.009478
  -1.406109 0.838118 1.299208 -0.369178 0.203943 -0.901430
  -0.090614 0.138320 1.006144 0.752092 0.018236 0.046746
  -0.090614 0.138320 1.006144 -0.852404 0.078746 -0.052999
  2.241435 0.812477 -1.543512 0.711378 -0.142690 -0.667010
  -0.005721 0.138320 -1.010200 -0.025764 -0.537679 0.842437
  -0.005721 0.138320 -1.010200 -0.753536 -0.000863 0.003278
}

frame 13 {
  -0.000000 0.000000 -0.009903 -0.707107 -0.000000 -0.000000
  0.309123 6.437504 -0.106869 -0.075371 -0.540867 0.048998
  0.000000 1.240110 -0.000000 0.052507 -0.000062 -0.047498
  0.000000 1.426179 -0.000000 -0.184318 -0.000420 0.040287
  0.000000 1.821082 0.000000 -0.059450 -0.193375 -0.058793
  0.000000 0.808121 -0.000000 0.001844 -0.515148 -0.857099
  -0.044148 0.766293 0.024775 0.045046 0.018595 0.043682
  -0.003138 0.224357 0.163702 -0.582226 0.395844 0.586146
  -0.259541 0.557510 -0.217253 0.917771 -0.378686 0.089287
  0.000000 0.017501 -0.000000 0.766855 -0.164101 -0.216398
  0.000000 0.135389 0.000001 0.077406 -0.083308 0.226103
  -0.000000 0.113742 0.000001 -0.176718 -0.042501 0.164695
  -0.000000 0.113742 -0.000000 -0.031558 -0.009163 0.230041
  0.262164 0.811892 0.662537 0.061118 0.848054 0.523650
  -0.244069 0.811855 0.663658 0.073789 0.846507 0.523270
  0.224683 0.261798 0.775026 0.064377 -0.710294 0.225210
  -0.000000 0.017499 0.000000 0.694299 -0.191224 -0.199823
  0.000000 0.145787 0.000002 0.140073 -0.029166 0.201370
  0.000000 0.112094 0.000001 -0.076060 -0.067477 0.233263
  0.000000 0.111594 -0.000000 0.024045 -0.043243 0.223826
  0.365934 0.793585 0.683418 0.046999 0.705543 -0.046999
  -0.000000 0.011231 0.000000 0.125932 0.784485 0.580794
  -0.000000 0.112704 -0.000001 0.249001 -0.023430 0.387489
  0.360328 0.777494 0.684140 0.046999 0.705543 -0.046999
  -0.000000 0.010075 0.000000 -0.099297 0.457441 0.813067
  -0.000001 0.108887 0.000001 -0.431279 0.352683 0.307498
  -0.136625 0.803881 0.692455 0.046999 0.705543 -0.046999
  0.000000 0.011230 0.000000 -0.008426 0.730560 0.661906
  0.000000 0.131865 0.000001 0.067457 -0.083498 0.375702
  -0.136810 0.780377 0.690930 0.046999 0.705543 -0.046999
  -0.000000 0.010076 -0.000000 0.062122 0.627371 0.752991
  0.000000 0.128464 -0.000001 -0.209364 -0.078930 0.364853
  -0.002195 0.809022 0.000794 0.040325 0.000217 -0.001349
  -0.014832 1.825300 -0.071422 0.540264 -0.451656 -0.436753
  -0.000000 1.493901 -0.000001 0.337302 0.677339 -0.544359
  0.000000 2.103015 -0.000001 -0.738085 0.041813 0.358324
  -0.000001 1.823368 0.000000 -0.246739 0.435745 0.063124
  0.288927 0.945606 -0.016980 -0.086101 -0.662918 -0.096529
  -0.000000 0.310931 -0.000002 0.058015 0.002221 -0.497332
  0.000000 0.255058 -0.000002 -0.080849 0.012366 -0.239603
  0.182658 0.102358 0.122067 0.006694 0.810311 0.450603
  0.000001 0.450618 0.000000 -0.528808 -0.099827 -0.027476
  -0.000000 0.295730 0.000000 0.219193 -0.276757 0.060325
  0.025108 1.448908 0.285964 0.494772 0.504178 0.517254
  0.081677 0.956432 -0.018380 -0.046749 -0.719113 -0.126382
  0.000000 0.323706 0.000001 0.045451 -0.040644 -0.458907
  0.000000 0.229678 0.000000 0.034365 0.095566 -0.292551
  -0.151892 0.951490 -0.015788 -0.126933 -0.733812 -0.153607
  -0.000000 0.298948 -0.000001 0.088295 -0.034341 -0.361513
  -0.000000 0.222753 -0.000001 0.019056 0.079162 -0.311585
  -0.332551 0.872253 0.059175 0.063690 -0.067212 -0.078576
  0.000001 0.247823 -0.000000 -0.389306 -0.000458 0.092402
  0.000001 0.155400 -0.000000 -0.220136 0.028702 -0.116910
  0.531377 1.351308 -0.004339 0.015907 0.004104 0.999865
  0.002183 1.423119 -0.451180 0.675237 0.001866 -0.002772
  0.014634 1.825496 -0.071451 0.297168 0.620304 0.574690
  0.000000 1.493902 -0.000000 0.531232 0.160308 0.319760
  0.000001 2.103017 -0.000000 0.073123 0.458368 0.611986
  0.093227 1.351308 0.523155 0.654645 0.002695 0.755925
  0.000000 1.823369 -0.000000 0.046821 0.484283 -0.318049
  0.286576 1.006395 -0.107110 0.348126 0.496271 -0.452239
  0.000001 0.249955 -0.000000 0.001699 -0.008901 -0.495669
  -0.000000 0.254362 0.000000 -0.007281 0.044764 -0.460087
  0.120542 0.102358 -0.183670 -0.196522 -0.496474 0.467247
  0.000000 0.445150 -0.000000 0.421781 -0.020611 0.244826
  -0.000000 0.302323 0.000000 -0.286951 0.593415 0.135055
  0.073566 1.013166 -0.024134 0.442168 -0.650241 0.377667
  -0.000000 0.266205 0.000001 -0.007397 0.013462 0.458387
  0.000000 0.229739 -0.000000 0.007397 0.005326 0.427137
  -0.127263 1.003840 0.060602 0.466208 -0.626169 0.387598
  -0.000001 0.246799 -0.000001 -0.014510 0.000132 0.266943
  -0.000000 0.222127 -0.000000 0.038690 0.041525 0.536874
  -0.358085 0.893698 0.063867 0.358440 -0.692820 0.305709
  -0.000000 0.221430 0.000001 -0.038809 0.004069 0.245072
  0.000000 0.154458 0.000000 0.039138 0.041421 0.644414
  -0.810392 0.550811 -0.372493 -0.966435 0.110867 -0.082632
  0.000000 3.626384 0.000000 -0.373016 0.002306 0.012456
  0.782400 0.551415 -0.372917 -0.932379 -0.100583 0.052530
  0.000000 3.626384 -0.000001 -0.302329 -0.017285 -0.009478
  -1.406109 0.838118 1.299208 -0.369178 0.203943 -0.901430
  -0.090614 0.138320 1.006144 0.752092 0.018236 0.046746
  -0.090614 0.138320 1.006144 -0.852404 0.078746 -0.052999
  2.241435 0.812477 -1.543512 0.711378 -0.142690 -0.667010
  -0.005721 0.138320 -1.010200 -0.025764 -0.537679 0.842437
  -0.005721 0.138320 -1.010200 -0.753536 -0.000863 0.003278
}

