MD5Version 10 // Parameters used during export: Reorient: False; Scale: 1.0
commandline ""

numFrames 5
numJoints 57
frameRate 60
numAnimatedComponents 342

hierarchy {
  "origin" -1 63 0 //
  "bum" 0 63 6 //
  "spine" 1 63 12 //
  "spine1" 2 63 18 //
  "spine2" 3 63 24 //
  "neck" 4 63 30 //
  "head" 5 63 36 //
  "jaw" 6 63 42 //
  "tongue" 7 63 48 //
  "tongue1" 8 63 54 //
  "tongue2" 9 63 60 //
  "eye_h.R" 6 63 66 //
  "eye_h.L" 6 63 72 //
  "eye_m.L" 6 63 78 //
  "eye_l.L" 6 63 84 //
  "eye_l.R" 6 63 90 //
  "eye_m.R" 6 63 96 //
  "hand.L" 4 63 102 //
  "hand1.L" 17 63 108 //
  "hand2.L" 18 63 114 //
  "claw.L" 19 63 120 //
  "hand.R" 4 63 126 //
  "hand1.R" 21 63 132 //
  "hand2.R" 22 63 138 //
  "claw.R" 23 63 144 //
  "leg_m.L" 2 63 150 //
  "leg_m1.L" 25 63 156 //
  "leg_m2.L" 26 63 162 //
  "leg_m3.L" 27 63 168 //
  "leg_m4.L" 28 63 174 //
  "leg_m5.L" 29 63 180 //
  "leg_m6.L" 30 63 186 //
  "leg_m7.L" 31 63 192 //
  "leg_m.R" 2 63 198 //
  "leg_m1.R" 33 63 204 //
  "leg_m2.R" 34 63 210 //
  "leg_m3.R" 35 63 216 //
  "leg_m4.R" 36 63 222 //
  "leg_m5.R" 37 63 228 //
  "leg_m6.R" 38 63 234 //
  "leg_m7.R" 39 63 240 //
  "leg_b.R" 1 63 246 //
  "leg_b1.R" 41 63 252 //
  "leg_b2.R" 42 63 258 //
  "leg_b3.R" 43 63 264 //
  "leg_b4.R" 44 63 270 //
  "leg_b5.R" 45 63 276 //
  "leg_b6.R" 46 63 282 //
  "leg_b7.R" 47 63 288 //
  "leg_b.L" 1 63 294 //
  "leg_b1.L" 49 63 300 //
  "leg_b2.L" 50 63 306 //
  "leg_b3.L" 51 63 312 //
  "leg_b4.L" 52 63 318 //
  "leg_b5.L" 53 63 324 //
  "leg_b6.L" 54 63 330 //
  "leg_b7.L" 55 63 336 //
}

bounds {
  ( -3.2969334126 -2.7792966366 -1.2840423584 ) ( 5.9006543159 2.7917253971 4.6317472458 )
  ( -3.2188110352 -2.9163403511 -0.9223635197 ) ( 5.6499381065 2.7681083679 4.3795356750 )
  ( -3.7736551762 -3.3385357857 -0.1002764627 ) ( 5.0018916130 3.5122394562 4.3663253784 )
  ( -3.9760172367 -3.5710253716 -0.1253173202 ) ( 5.1797642708 3.6862859726 4.2488865852 )
  ( -4.0362048149 -3.6749229431 -0.1652691364 ) ( 5.8477315903 3.6614284515 4.5537967682 )
}

baseframe {
  ( 0.0394316874 0.0000000020 0.0592072010 ) ( -0.5000000596 -0.4999999106 -0.4999999702 )
  ( -0.0000001411 2.6987733841 -1.1423774958 ) ( -0.4868016541 -0.0000001477 -0.0000000239 )
  ( -0.0000000000 1.1012824774 0.0000000298 ) ( -0.1782261729 0.0000001655 -0.0000000468 )
  ( -0.0000000000 0.8576962948 0.0000001341 ) ( -0.0766745880 -0.0000000838 -0.0000000407 )
  ( 0.0000000000 0.7547031641 -0.0000000484 ) ( -0.1579704881 0.0000003091 -0.0000000052 )
  ( 0.0000000000 0.7010410428 0.0000001192 ) ( -0.0103682643 -0.0000001677 -0.0000000440 )
  ( 0.0000000000 0.6804279089 -0.0000003576 ) ( 0.1406286955 -0.0000000688 -0.0000001101 )
  ( 0.0000005599 0.2040011585 0.6939015388 ) ( -0.2583903074 0.0000002312 0.0000000204 )
  ( -0.0068010557 0.0107357549 -0.0928320885 ) ( -0.0022094338 0.9643049240 -0.2647846341 )
  ( -0.0000000035 0.3152523637 -0.0000001072 ) ( 0.2685210705 0.0006490230 -0.0022042519 )
  ( -0.0000000004 0.2971103191 0.0000001212 ) ( -0.2403444052 -0.0000001270 -0.0000001720 )
  ( -0.3204289675 0.7713125348 -0.1498028040 ) ( -0.0292316563 0.0017544779 -0.0562495738 )
  ( 0.3420011401 0.7806500196 -0.1344274282 ) ( -0.0132979192 -0.0005159070 0.0454386920 )
  ( 0.2881521285 0.9586443901 0.2346231788 ) ( 0.0000121254 -0.0014256162 0.0575119480 )
  ( 0.2232752740 0.9701764584 0.5488808751 ) ( -0.0040477486 -0.0001052944 0.0459355824 )
  ( -0.2098273188 0.9884817004 0.5430678725 ) ( -0.0000310447 0.0012714566 -0.0192017574 )
  ( -0.2806004286 0.9382220507 0.2304938287 ) ( 0.0115999393 0.0002612375 -0.0360925458 )
  ( 0.8006747961 0.2590179443 0.2732723355 ) ( -0.2479590327 -0.7518568635 -0.5249944925 )
  ( 0.0000000522 2.0237672329 0.0000000671 ) ( -0.4901499748 -0.1294724196 0.1208427399 )
  ( 0.0000000857 0.6780935526 0.0000000298 ) ( -0.7398542166 -0.0141632305 0.0414234772 )
  ( 0.0000003073 2.8945574760 -0.0000004172 ) ( -0.0795772523 -0.2772825956 0.9574622512 )
  ( -0.8006744385 0.2590177655 0.2732729912 ) ( -0.1551524401 0.7940080762 0.5594915152 )
  ( -0.0000001565 2.0237672329 0.0000001863 ) ( -0.5424422026 0.0218853075 -0.0124289617 )
  ( -0.0000002310 0.6532894373 0.0000002831 ) ( -0.7229030728 -0.0091123702 0.0027220382 )
  ( -0.0000001127 3.2158617973 -0.0000001192 ) ( -0.0173630714 0.2475914061 -0.9682898521 )
  ( 0.9979729652 0.7564489245 -0.0049598957 ) ( -0.5965774059 -0.4368536174 -0.5546603799 )
  ( -0.0000000109 2.0559282303 0.0000000768 ) ( -0.2565803528 0.0105074886 0.0313445032 )
  ( 0.0000000185 0.4029235840 -0.0000001192 ) ( -0.8645160198 -0.0368790366 -0.0082640685 )
  ( 0.0000000000 3.0829138756 0.0000003129 ) ( 0.0257761646 -0.3653048873 0.9305278659 )
  ( -0.0000000894 0.8658199310 0.0000003930 ) ( -0.1645587236 0.0001179682 -0.0192764774 )
  ( -0.0000000373 2.4563081264 0.0000001946 ) ( -0.0214483514 -0.9595368505 0.2806967795 )
  ( 0.0000000149 0.4304138720 0.0000001116 ) ( -0.3770001233 0.0699418262 0.0342849717 )
  ( 0.0000000116 0.3361915350 0.0000000000 ) ( 0.0103688622 0.9934747219 0.1134404615 )
  ( -0.9979729652 0.7564487457 -0.0049597402 ) ( -0.5948905349 0.4380100369 0.5564692616 )
  ( -0.0000000328 2.0559279919 0.0000000438 ) ( -0.2567023635 -0.0125506595 -0.0303289462 )
  ( -0.0000000260 0.4029234648 0.0000001220 ) ( -0.8644456267 0.0231608823 -0.0137862703 )
  ( -0.0000000745 3.0829141140 0.0000000969 ) ( 0.0320889801 -0.3591731191 0.9326092005 )
  ( 0.0000000447 0.8859066963 0.0000003353 ) ( -0.1556131393 -0.0116387252 0.0122773256 )
  ( 0.0000000298 2.4326870441 0.0000001984 ) ( -0.0310449433 0.9564498663 -0.2779875994 )
  ( -0.0000000224 0.4304141402 0.0000001017 ) ( -0.3779550493 -0.0234065633 -0.0213179588 )
  ( -0.0000000233 0.3361915946 0.0000000335 ) ( -0.1137772799 -0.0367629267 -0.0055973614 )
  ( -0.7640509605 0.4168766141 -0.0157421995 ) ( -0.8693304658 0.1308287531 0.3169678152 )
  ( 0.0000001043 1.7199563980 -0.0000000298 ) ( -0.1663205624 0.0320489481 -0.0083999028 )
  ( -0.0000000149 0.4365787804 -0.0000000298 ) ( -0.8794069290 -0.0192838665 0.0258252379 )
  ( 0.0000001788 2.5287609100 -0.0000000596 ) ( 0.0522552021 -0.5767936110 0.8152092695 )
  ( -0.0000002384 0.6678893566 0.0000001192 ) ( -0.3823826909 -0.0172876380 0.0003869358 )
  ( -0.0000000969 2.1936643124 0.0000000186 ) ( 0.2396831512 0.0094354264 0.0031378097 )
  ( 0.0000000857 0.3807584643 -0.0000001639 ) ( 0.3951185048 0.5769872665 -0.3701120317 )
  ( 0.0000000149 0.3010090888 0.0000002077 ) ( -0.0010645203 -0.0328153074 0.0109451106 )
  ( 0.7640510798 0.4168769121 -0.0157417487 ) ( -0.8391331434 -0.1607046127 -0.3899483085 )
  ( 0.0000000000 1.7199568748 -0.0000000447 ) ( -0.1659418792 0.0034947472 -0.0140134562 )
  ( -0.0000001192 0.4365784526 0.0000001192 ) ( -0.8772589564 0.0440410748 -0.0666367635 )
  ( 0.0000001192 2.5287604332 0.0000000596 ) ( 0.0141836163 0.5766255260 -0.8168635964 )
  ( 0.0000002682 0.6526256800 0.0000000000 ) ( -0.3792548478 0.0176066551 -0.0015836951 )
  ( 0.0000000969 2.2037844658 -0.0000001173 ) ( 0.2359418124 0.0242222846 -0.0222488418 )
  ( 0.0000002813 0.3807583749 -0.0000000894 ) ( 0.5353401303 0.0026925325 -0.0807001591 )
  ( 0.0000001569 0.3010086417 -0.0000000056 ) ( -0.0108817732 -0.0104970792 0.0015860461 )
}

frame 0 {
  0.0394316874 0.0000000020 0.0592072010 -0.5000000596 -0.4999999106 -0.4999999702
  -0.0000002137 2.8065562248 -1.3790718317 -0.4696432948 0.0068548615 0.0096835224
  0.0000000097 1.1012828350 0.0000003776 -0.2557889223 -0.0030832109 0.0024475940
  -0.0045894845 0.8573631644 -0.0234532040 -0.1020653099 0.0019348516 -0.0027079517
  -0.0000000140 0.7547031045 0.0000003223 -0.1756185144 -0.0000213386 0.0001223516
  0.0000000046 0.7010406852 0.0000000333 -0.0134852007 -0.0098675620 0.0061567319
  -0.0000000000 0.6804280281 -0.0000003576 0.1833647192 -0.0000000725 -0.0000001193
  0.0000005599 0.2040012181 0.6939014792 -0.2583903372 0.0000002312 0.0000000204
  -0.0068010557 0.0107356925 -0.0928319693 -0.0030745156 0.9643037915 -0.2647798061
  -0.0000000012 0.3152523041 -0.0000005167 0.2685052454 0.0003592320 -0.0033610980
  -0.0000000001 0.2971104383 0.0000000999 -0.2522441447 0.0002041382 0.0005592320
  -0.3204290271 0.7713125348 -0.1498029381 0.0447921976 0.0039210091 0.0122810546
  0.3420010805 0.7806504965 -0.1344274431 0.0469694100 -0.0024546878 -0.0148574840
  0.2881520987 0.9586446285 0.2346230000 0.0552251115 -0.0046071084 -0.0203987211
  0.2232752889 0.9701767564 0.5488806367 0.0394045599 -0.0019121903 -0.0012669478
  -0.2098273635 0.9884819388 0.5430681705 0.0409301408 0.0020564543 0.0069332714
  -0.2806003988 0.9382216930 0.2304937989 0.0547540151 0.0024626693 0.0193010401
  0.8006749153 0.2590178847 0.2732726634 -0.1929658502 -0.8799135089 -0.2629496157
  0.0000000894 2.0237672329 0.0000000000 -0.4578813612 -0.1429667771 0.1085551009
  0.0000001416 0.6780936718 0.0000001639 -0.5891017914 -0.0258687194 0.0401314460
  0.0000002086 2.8945577145 -0.0000004172 -0.0773898065 -0.3890590966 0.9056577086
  -0.8006743789 0.2590176761 0.2732733488 -0.1501913369 0.9354197979 0.2640896142
  -0.0000003017 2.0237672329 0.0000001788 -0.4820126891 0.0357476138 -0.0058124019
  -0.0000000782 0.6532891989 0.0000001546 -0.5352764130 -0.0007397217 -0.0064468449
  -0.0000000298 3.2158613205 -0.0000004768 -0.0223994814 0.3800590038 -0.9012123942
  0.9979729652 0.7564489841 -0.0049598664 -0.3585813046 -0.6877114177 -0.5686514378
  0.0000001639 2.0559282303 -0.0000000894 -0.0813485384 -0.1146161482 0.0500349030
  0.0000000149 0.4029232860 0.0000002086 -0.7753000855 -0.0237501245 0.2362269610
  -0.0000002980 3.0829141140 -0.0000005662 0.0220836606 -0.4270469844 0.9033207297
  0.0000001490 0.8658199310 -0.0000001341 -0.1103956029 0.0031108372 -0.0440442562
  0.0000000251 2.4563078880 -0.0000000605 -0.0174103361 -0.9588646293 0.2832858860
  0.0000000373 0.4304141700 0.0000007749 0.1573100686 0.0548236780 0.0337648168
  0.0000002533 0.3361916244 0.0000000522 -0.0073521268 -0.9913160205 0.1289243996
  -0.9979729652 0.7564488649 -0.0049597379 -0.4175941050 0.6962984800 0.5045302510
  -0.0000000913 2.0559284687 0.0000000298 0.0392578766 0.1269012690 -0.0632407591
  0.0000001043 0.4029235542 -0.0000003576 -0.7698370218 0.0531706177 -0.2975463867
  -0.0000006557 3.0829138756 -0.0000000848 -0.0357613675 0.4250018895 -0.9044162631
  0.0000002980 0.8859062195 0.0000002924 -0.0983403772 -0.0131601989 0.0302688815
  -0.0000001900 2.4326868057 -0.0000004042 -0.0270812511 0.9556583166 -0.2814988494
  0.0000000000 0.4304141402 0.0000006184 0.1262728274 -0.1475834697 -0.0634339005
  0.0000001192 0.3361915648 0.0000004171 -0.1137772724 -0.0367629491 -0.0055973474
  -0.7640508413 0.4168767929 -0.0157420281 -0.8255468011 0.2094420940 0.3409484923
  0.0000000484 1.7199562788 -0.0000000894 -0.0562716946 0.0715206116 -0.0489763618
  0.0000001863 0.4365786016 0.0000003129 -0.7899067402 -0.0051917462 0.2239734232
  0.0000004768 2.5287604332 -0.0000001565 0.0527375452 -0.5549926162 0.8298321962
  -0.0000002161 0.6678891182 -0.0000003427 -0.3902729452 -0.0117258541 -0.0146529665
  0.0000001872 2.1936638355 0.0000002272 0.2332805842 0.0088876272 0.0007532682
  -0.0000000373 0.3807584047 -0.0000001714 -0.1041040942 0.7020499110 -0.0479585454
  0.0000001043 0.3010084629 0.0000000447 -0.0010645222 -0.0328152888 0.0109451143
  0.7640511394 0.4168772399 -0.0157417320 -0.8077490926 -0.2292463183 -0.3686487675
  -0.0000001416 1.7199571133 -0.0000001192 -0.1075747833 0.0077617462 0.0078898072
  -0.0000001099 0.4365780354 -0.0000001788 -0.7561756968 -0.0051782462 -0.1499497443
  -0.0000001714 2.5287609100 -0.0000002980 0.0148314741 0.5448772311 -0.8378887177
  0.0000000596 0.6526256204 -0.0000003874 -0.3956157863 0.0109320832 0.0160546489
  0.0000002272 2.2037844658 0.0000000596 0.2284362018 0.0248895027 -0.0189726446
  0.0000002086 0.3807581067 -0.0000001490 -0.0206351392 0.1975713521 0.1965436935
  0.0000000000 0.3010083437 -0.0000002235 -0.0108817751 -0.0104970913 0.0015860512
}

frame 1 {
  0.0394316874 0.0000000020 0.0592072010 -0.5000000596 -0.4999999106 -0.4999999702
  -0.0000001994 2.4447963238 -1.3358070850 -0.4478028417 0.0028691513 0.0041117086
  -0.0000000005 1.1012828350 -0.0000001851 -0.2035618275 -0.0002105264 0.0019251978
  -0.0032918942 0.8569175005 0.0363884829 -0.1498823315 -0.0004853196 -0.0018857335
  0.0000000009 0.7547031641 0.0000001432 -0.1973226219 0.0000000216 -0.0000052033
  0.0000000012 0.7010408044 -0.0000000457 -0.0194996241 -0.0040340601 0.0029602521
  0.0000000000 0.6804279089 -0.0000001192 0.1774745435 -0.0000000720 -0.0000001181
  0.0000005599 0.2040015459 0.6939019561 -0.2583903372 0.0000002312 0.0000000204
  -0.0068010553 0.0107358117 -0.0928323269 -0.0028625650 0.9643026590 -0.2647866607
  0.0000000016 0.3152523041 -0.0000000101 0.2685063481 0.0003591608 -0.0033610526
  -0.0000000001 0.2971103191 0.0000004589 -0.2522449493 0.0002041920 0.0005592124
  -0.3204290569 0.7713125348 -0.1498026401 0.0710581318 0.0053757145 0.0130667267
  0.3420010805 0.7806505561 -0.1344272047 0.0730699748 -0.0036275564 -0.0158802811
  0.2881520987 0.9586445093 0.2346235365 0.0868413821 -0.0064251772 -0.0219805613
  0.2232753038 0.9701767564 0.5488809943 0.0619505160 -0.0029488879 -0.0012531051
  -0.2098273784 0.9884819984 0.5430679917 0.0640984699 0.0024998412 0.0073509668
  -0.2806004286 0.9382219315 0.2304941565 0.0862202719 0.0036170552 0.0208915509
  0.8006748557 0.2590177953 0.2732724845 -0.1967622042 -0.8839259744 -0.2541660666
  0.0000000596 2.0237669945 0.0000001490 -0.4665022492 -0.1414219588 0.1108987257
  0.0000000726 0.6780933738 -0.0000000335 -0.5945014358 -0.0251779780 0.0398973972
  0.0000003055 2.8945577145 -0.0000008941 -0.0719059035 -0.3473150730 0.9246321321
  -0.8006746173 0.2590177655 0.2732726038 -0.1568681747 0.9383288026 0.2558052838
  -0.0000000205 2.0237669945 0.0000002384 -0.4936655164 0.0344168656 -0.0064144670
  -0.0000000671 0.6532895565 0.0000001118 -0.5431515574 -0.0014927592 -0.0056668594
  -0.0000000298 3.2158610821 -0.0000004768 -0.0143051725 0.3399260044 -0.9222284555
  0.9979729056 0.7564489245 -0.0049599018 -0.4017291367 -0.6769105196 -0.5651974082
  -0.0000000447 2.0559279919 0.0000003576 -0.1309650242 -0.1310160905 0.0688001290
  0.0000000671 0.4029234648 -0.0000000596 -0.7751587629 -0.0080783684 0.2145687491
  0.0000001192 3.0829131603 -0.0000007749 0.0253411252 -0.4117644429 0.9108622670
  0.0000001788 0.8658199310 -0.0000004768 -0.1247764751 0.0013280681 -0.0270185843
  0.0000000969 2.4563078880 -0.0000004880 -0.0200931299 -0.9586395025 0.2838553190
  -0.0000000368 0.4304139614 0.0000003353 -0.1268179715 0.1105385348 -0.0652067438
  0.0000001490 0.3361913860 0.0000001937 -0.0073524266 -0.9913157821 0.1289257556
  -0.9979728460 0.7564487457 -0.0049598292 -0.4652336240 0.6948646903 0.4911839366
  -0.0000000373 2.0559287071 -0.0000002086 0.0475923233 0.1787071228 -0.0962112397
  -0.0000003278 0.4029233754 -0.0000000596 -0.8072909117 0.0379482880 -0.2405061871
  -0.0000001788 3.0829143524 -0.0000002682 0.0334310159 -0.3980304897 0.9167432785
  0.0000001192 0.8859064579 -0.0000000596 -0.1228758097 -0.0120272953 0.0178852398
  0.0000004210 2.4326875210 0.0000000708 -0.0295618828 0.9556581974 -0.2810345590
  -0.0000000666 0.4304141402 0.0000003893 -0.1964005381 -0.0459524356 -0.0095244646
  -0.0000001155 0.3361915946 0.0000000894 -0.1137772873 -0.0367629267 -0.0055973777
  -0.7640509009 0.4168767929 -0.0157427397 -0.8790053129 0.2338238358 0.2968394458
  0.0000003654 1.7199569941 0.0000002384 -0.2130372673 0.1770578772 -0.1382566243
  0.0000000224 0.4365784526 -0.0000001490 -0.7126157284 0.0832461864 0.3675237000
  0.0000001267 2.5287609100 -0.0000001192 0.0524752587 -0.5434736609 0.8374183774
  0.0000001341 0.6678896546 -0.0000007153 -0.4140562117 -0.0115786679 -0.0149854515
  -0.0000003092 2.1936638355 -0.0000002980 0.2353736311 0.0088681597 0.0007302944
  -0.0000003567 0.3807584047 -0.0000004377 0.1935329139 0.7258598804 -0.1877307743
  -0.0000001341 0.3010086715 0.0000001155 -0.0010645305 -0.0328153297 0.0109450826
  0.7640511394 0.4168770313 -0.0157419667 -0.8642812371 -0.2566711605 -0.3242971599
  -0.0000000633 1.7199565172 0.0000000000 -0.2448226064 -0.0318568461 0.0228468627
  -0.0000001639 0.4365784526 0.0000001192 -0.7311187983 -0.0489670373 -0.1773138493
  0.0000000149 2.5287611485 -0.0000004172 0.0145506067 0.5327118039 -0.8456479907
  0.0000001490 0.6526256204 -0.0000002384 -0.4202500582 0.0105235260 0.0170386937
  0.0000002868 2.2037847042 0.0000001416 0.2305089533 0.0248726029 -0.0191860981
  0.0000000764 0.3807581663 0.0000001369 0.2981035411 0.0412000194 0.0786755979
  0.0000002384 0.3010085821 -0.0000002235 -0.0108817704 -0.0104970699 0.0015860432
}

frame 2 {
  0.0394316874 0.0000000020 0.0592072010 -0.5000000596 -0.4999999106 -0.4999999702
  -0.0000001891 2.0960848331 -1.2987560034 -0.4532393515 0.0025454871 0.0020591917
  -0.0000000006 1.1012828350 0.0000000831 -0.1722117066 0.0018317442 0.0014911507
  -0.0007274853 0.8572791219 0.0267302860 -0.1348812729 -0.0023422709 0.0002856392
  0.0000000001 0.7547030449 -0.0000002434 -0.2028634101 -0.0000358594 0.0002526487
  0.0000000026 0.7010406852 -0.0000001099 -0.0409298763 -0.0026860759 0.0011809857
  0.0000000000 0.6804280281 -0.0000003576 0.1620347053 -0.0000000707 -0.0000001148
  0.0000005599 0.2040015161 0.6939017177 -0.2583903372 0.0000002312 0.0000000204
  -0.0068010567 0.0107358117 -0.0928322077 -0.0027300608 0.9643034339 -0.2647854686
  -0.0000000014 0.3152529299 0.0000004666 0.2685073316 0.0003591617 -0.0033610719
  0.0000000009 0.2971106172 -0.0000000180 -0.2522453666 0.0002041861 0.0005592274
  -0.3204290569 0.7713125348 -0.1498030573 0.1215229556 0.0081555657 0.0149728497
  0.3420010507 0.7806502581 -0.1344274431 0.1231188700 -0.0058682933 -0.0183886029
  0.2881521583 0.9586443901 0.2346230596 0.1506267488 -0.0100886505 -0.0259717572
  0.2232752889 0.9701768756 0.5488808155 0.1035948247 -0.0048638848 -0.0011620926
  -0.2098273486 0.9884821177 0.5430680513 0.1071736366 0.0033223571 0.0083887782
  -0.2806004286 0.9382220507 0.2304937392 0.1496267021 0.0059524039 0.0249577239
  0.8006747365 0.2590180039 0.2732725143 -0.2076286376 -0.8779556751 -0.2795697749
  0.0000002533 2.0237672329 0.0000002980 -0.4848617017 -0.1385648549 0.1156732664
  0.0000000531 0.6780934334 -0.0000001043 -0.6230230331 -0.0237865783 0.0407686606
  0.0000001043 2.8945579529 -0.0000001788 -0.0662688240 -0.2618682384 0.9588227868
  -0.8006744385 0.2590178549 0.2732736766 -0.1692148298 0.9259330630 0.2982627749
  0.0000001490 2.0237669945 0.0000008941 -0.5191993117 0.0292868372 -0.0088306786
  -0.0000004247 0.6532894969 -0.0000000224 -0.5831221938 -0.0048731542 -0.0024879454
  -0.0000002384 3.2158613205 -0.0000001788 -0.0056412998 0.2580143809 -0.9578440785
  0.9979729056 0.7564488649 -0.0049598832 -0.3255972862 -0.7408989072 -0.5698361397
  -0.0000001043 2.0559284687 0.0000002384 -0.1690891385 -0.0585001707 0.0411067121
  -0.0000000857 0.4029234052 0.0000000596 -0.7867929339 0.0099775987 0.0748943686
  -0.0000002906 3.0829141140 -0.0000001192 -0.0274965409 0.4208083153 -0.9067327380
  -0.0000001881 0.8658202291 -0.0000004768 -0.1167389229 0.0005853329 -0.0179110803
  -0.0000006370 2.4563078880 -0.0000004023 -0.0213762335 -0.9584163427 0.2845066786
  0.0000000759 0.4304139018 -0.0000000149 -0.3762561679 0.0962916985 -0.1378552169
  0.0000001974 0.3361924291 -0.0000000522 -0.0073530283 -0.9913159609 0.1289249510
  -0.9979730248 0.7564488053 -0.0049596988 -0.4074470401 0.7490839958 0.4989149272
  -0.0000001118 2.0559284687 -0.0000003576 0.0361555330 0.1943730265 -0.1258882284
  -0.0000000224 0.4029234946 0.0000003576 -0.8614404202 0.0006506120 -0.0369520187
  -0.0000003874 3.0829143524 0.0000001788 0.0311795156 -0.3966667056 0.9172311425
  -0.0000001937 0.8859063983 -0.0000004768 -0.1241840571 -0.0111737391 0.0077350596
  0.0000000638 2.4326870441 -0.0000006184 -0.0310640987 0.9555980563 -0.2809491754
  -0.0000002325 0.4304142296 -0.0000002682 -0.4725905657 0.0497147962 -0.0037110394
  0.0000000708 0.3361912966 0.0000000149 -0.1137772873 -0.0367629193 -0.0055973507
  -0.7640509009 0.4168767333 -0.0157422796 -0.8773366213 0.2770044208 0.3168793619
  0.0000001807 1.7199565172 0.0000001192 -0.2765830457 0.1742289811 -0.1023407876
  0.0000001192 0.4365783036 0.0000001341 -0.7277111411 0.0880384371 0.3785381019
  0.0000002384 2.5287609100 -0.0000004768 0.0519938469 -0.5830998421 0.8106448054
  0.0000000740 0.6678895950 0.0000002384 -0.3841476142 -0.0148988031 -0.0065415837
  -0.0000002811 2.1936645508 -0.0000004992 0.2427480966 0.0091647450 0.0021101050
  -0.0000004975 0.3807585239 -0.0000003353 0.3907306194 0.6659028530 -0.2358249277
  0.0000000093 0.3010083437 -0.0000001555 -0.0010645112 -0.0328153037 0.0109451097
  0.7640510798 0.4168769717 -0.0157421362 -0.8565143347 -0.3174518645 -0.3499364555
  -0.0000003148 1.7199566364 0.0000002980 -0.3020724058 -0.0137579227 -0.0099883843
  -0.0000004908 0.4365783036 -0.0000000596 -0.7410150766 -0.0637355372 -0.2194480300
  0.0000000149 2.5287611485 -0.0000004172 0.0139724333 0.5766298771 -0.8167426586
  0.0000000764 0.6526257992 0.0000003576 -0.3862225711 0.0150358984 0.0057001673
  -0.0000000629 2.2037844658 -0.0000009350 0.2381190062 0.0244687535 -0.0213852637
  0.0000001555 0.3807584047 -0.0000004470 0.4601928294 -0.0964772627 -0.1217966527
  -0.0000000981 0.3010082245 0.0000000075 -0.0108817741 -0.0104970811 0.0015860585
}

frame 3 {
  0.0394316874 0.0000000020 0.0592072010 -0.5000000596 -0.4999999106 -0.4999999702
  -0.0000001647 2.3942658901 -1.2216031551 -0.4970681071 0.0005398403 0.0017931203
  0.0000000004 1.1012824774 0.0000001183 -0.1639715582 -0.0080399262 0.0028489034
  -0.0082477704 0.8576525450 0.0026729614 -0.0844544694 0.0072826128 -0.0058541289
  0.0000000014 0.7547033429 0.0000002150 -0.1708211303 0.0000340004 -0.0002268477
  0.0000000014 0.7010408640 -0.0000004118 0.0201068353 -0.0016061530 0.0014443177
  0.0000000000 0.6804280281 0.0000000000 0.1465551108 -0.0000000694 -0.0000001114
  0.0000005599 0.2040012926 0.6939017773 -0.2583903372 0.0000002312 0.0000000204
  -0.0068010553 0.0107359905 -0.0928320885 -0.0027036679 0.9643050432 -0.2647799253
  0.0000000007 0.3152519763 0.0000002868 0.2685097754 0.0003591513 -0.0033612137
  0.0000000015 0.2971104383 0.0000002193 -0.2522470057 0.0002041935 0.0005592436
  -0.3204289973 0.7713125944 -0.1498029679 0.0584094711 0.0044731982 0.0195829272
  0.3420011103 0.7806501389 -0.1344275326 0.0615780316 -0.0030038774 -0.0234847814
  0.2881521881 0.9586445093 0.2346231192 0.0811710060 -0.0060987840 -0.0363260098
  0.2232752442 0.9701765180 0.5488807559 0.0483333953 -0.0023200621 -0.0019265813
  -0.2098273635 0.9884817004 0.5430679321 0.0509614944 0.0022483657 0.0106361005
  -0.2806003690 0.9382218719 0.2304940075 0.0801868513 0.0035544520 0.0342682227
  0.8006747961 0.2590179443 0.2732718289 -0.2245389223 -0.8236557841 -0.4057058096
  0.0000000000 2.0237672329 0.0000001788 -0.5003821850 -0.1324691772 0.1215170622
  0.0000001490 0.6780936122 -0.0000000447 -0.6917825341 -0.0184289832 0.0416183360
  0.0000002608 2.8945574760 -0.0000002980 -0.0715749562 -0.2239996940 0.9717374444
  -0.8006743789 0.2590178549 0.2732726336 -0.1697476655 0.8659618497 0.4407878220
  -0.0000001341 2.0237672329 0.0000007749 -0.5443534255 0.0234154072 -0.0117535880
  -0.0000002608 0.6532891989 0.0000000522 -0.6662729979 -0.0085965712 0.0013422400
  -0.0000003949 3.2158615589 -0.0000004172 -0.0125632733 0.2189362049 -0.9736320972
  0.9979730248 0.7564488053 -0.0049596038 -0.2930733263 -0.7433190942 -0.5771954060
  0.0000002272 2.0559282303 -0.0000003576 -0.0972228125 -0.0559058934 0.0302655045
  0.0000000577 0.4029235542 -0.0000004172 -0.8172461987 0.0006955409 0.0230736602
  -0.0000002086 3.0829138756 0.0000001192 0.0258369502 -0.4872045815 0.8726826906
  -0.0000000596 0.8658198118 -0.0000003576 -0.0575864315 0.0028655280 -0.0336040780
  -0.0000000261 2.4563083649 0.0000001490 -0.0185833611 -0.9577795267 0.2868548930
  0.0000002161 0.4304148555 0.0000002831 -0.3333281577 -0.0089602340 -0.0679135844
  0.0000003409 0.3361917734 -0.0000000075 -0.0073524304 -0.9913158417 0.1289254427
  -0.9979728460 0.7564485669 -0.0049597779 -0.3788419962 0.7438887954 0.5143603683
  -0.0000000633 2.0559284687 0.0000003576 0.0135369888 0.1226663888 -0.0650781095
  -0.0000001229 0.4029235840 0.0000002384 -0.8497171402 0.0003244109 -0.0762528926
  -0.0000002533 3.0829148293 -0.0000002980 0.0312499516 -0.4798439145 0.8766853213
  -0.0000000596 0.8859071732 -0.0000002384 -0.0509046577 -0.0112539027 0.0097467965
  0.0000002906 2.4326872826 -0.0000010580 -0.0289125703 0.9547853470 -0.2841593921
  -0.0000000782 0.4304144084 0.0000005066 -0.3556513786 0.0380486846 -0.0196936578
  -0.0000003530 0.3361912370 0.0000000065 -0.1137773022 -0.0367629342 -0.0055973586
  -0.7640510798 0.4168764949 -0.0157422833 -0.8789972067 0.2454264909 0.2976230085
  0.0000001807 1.7199569941 0.0000000298 -0.0993390009 0.1028212979 -0.0342141390
  0.0000002943 0.4365787804 0.0000000894 -0.8455607891 -0.0170914307 0.1803453118
  0.0000002310 2.5287604332 -0.0000003576 0.0514850207 -0.6274064779 0.7769722939
  -0.0000005513 0.6678891182 -0.0000002384 -0.3323479593 -0.0166826677 -0.0025691050
  0.0000000764 2.1936638355 0.0000004992 0.2462584674 0.0092995400 0.0027406716
  0.0000000149 0.3807584941 -0.0000003576 0.3146971464 0.6436484456 -0.2658157051
  -0.0000000014 0.3010091782 0.0000002266 -0.0010645188 -0.0328153074 0.0109451115
  0.7640510201 0.4168767333 -0.0157417171 -0.8595019579 -0.2797473669 -0.3426456451
  -0.0000001937 1.7199568748 0.0000003874 -0.1547444016 -0.0252613593 0.0035885898
  -0.0000002682 0.4365785420 -0.0000003576 -0.8095032573 0.0016954762 -0.1649329066
  -0.0000001267 2.5287609100 0.0000001192 0.0136207184 0.6180496812 -0.7859554291
  0.0000002533 0.6526256800 0.0000002384 -0.3394145966 0.0169771705 0.0016811882
  0.0000003725 2.2037842274 -0.0000006929 0.2417302877 0.0243819654 -0.0219912510
  0.0000003725 0.3807581663 0.0000001192 0.4300795794 -0.0504270568 -0.0849155709
  -0.0000000326 0.3010078669 -0.0000000047 -0.0108817741 -0.0104970802 0.0015860514
}

frame 4 {
  0.0394316874 0.0000000020 0.0592072010 -0.5000000596 -0.4999999106 -0.4999999702
  -0.0000001411 2.6987733841 -1.1423774958 -0.5200092793 0.0005707822 0.0026184150
  0.0000000015 1.1012824774 0.0000004344 -0.1583328396 -0.0095606782 0.0065204389
  -0.0157930776 0.8575085402 0.0085180579 -0.0630717650 0.0083074290 -0.0103735290
  -0.0000000019 0.7547031641 0.0000000271 -0.1427745819 0.0000617465 -0.0003554222
  -0.0000000011 0.7010408640 0.0000001275 0.0822391212 -0.0025849405 0.0018792251
  -0.0000000000 0.6804280877 0.0000000000 0.1406286955 -0.0000000688 -0.0000001101
  0.0000005599 0.2040012777 0.6939016581 -0.2583903372 0.0000002312 0.0000000204
  -0.0068010562 0.0107359318 -0.0928320885 -0.0027833036 0.9643055201 -0.2647770941
  0.0000000019 0.3152525127 0.0000000483 0.2685045898 0.0003591502 -0.0033610547
  0.0000000017 0.2971101999 -0.0000003766 -0.2522438765 0.0002041581 0.0005591810
  -0.3204290271 0.7713121176 -0.1498028487 -0.0328438804 -0.0007652530 0.0228973832
  0.3420011103 0.7806500793 -0.1344267875 -0.0273142736 0.0010893795 -0.0272640828
  0.2881521285 0.9586437941 0.2346232384 -0.0376067944 0.0007403946 -0.0456662998
  0.2232752591 0.9701762795 0.5488813519 -0.0268344842 0.0011380006 -0.0023197436
  -0.2098273486 0.9884821177 0.5430682302 -0.0266809668 0.0007583358 0.0124801472
  -0.2806004286 0.9382214546 0.2304940373 -0.0380020291 -0.0006148630 0.0427898131
  0.8006748557 0.2590177655 0.2732726336 -0.2280252576 -0.7633365393 -0.5069070458
  0.0000001341 2.0237674713 -0.0000000820 -0.4992857575 -0.1290986687 0.1227325499
  0.0000000447 0.6780931950 0.0000000894 -0.7363096476 -0.0146729117 0.0416127928
  0.0000004359 2.8945574760 -0.0000008345 0.0761025026 0.2403943837 -0.9674478769
  -0.8006744385 0.2590177953 0.2732734978 -0.1568679065 0.7993445396 0.5516026020
  -0.0000001583 2.0237672329 0.0000002906 -0.5454013348 0.0208518468 -0.0128777232
  -0.0000002719 0.6532895565 0.0000001490 -0.7220531106 -0.0098715201 0.0034331551
  -0.0000003930 3.2158613205 -0.0000002384 -0.0196229331 0.2360607982 -0.9711201191
  0.9979730248 0.7564490438 -0.0049600406 -0.3502721488 -0.7262039781 -0.5458685160
  0.0000001080 2.0559279919 0.0000002384 -0.0728682503 -0.0884262398 0.0287874155
  -0.0000001043 0.4029234648 0.0000004768 -0.7911248207 -0.0141314855 0.1336326450
  0.0000003278 3.0829136372 -0.0000001788 0.0278120860 -0.5283323526 0.8485438228
  -0.0000002682 0.8658200502 -0.0000005960 -0.0208947957 0.0023516398 -0.0253358260
  -0.0000005960 2.4563081264 -0.0000006557 -0.0194754396 -0.9572058320 0.2887008488
  0.0000003427 0.4304140806 -0.0000002384 -0.3102267385 -0.0005198607 -0.0471506789
  0.0000001921 0.3361914158 0.0000000075 -0.0073530255 -0.9913157821 0.1289255768
  -0.9979730248 0.7564486861 -0.0049599065 -0.3795250058 0.7416307926 0.5022317171
  -0.0000000149 2.0559279919 0.0000003576 0.0292339176 0.1179862171 -0.0412015095
  0.0000001192 0.4029234946 0.0000000000 -0.8171417713 0.0208261758 -0.1316287816
  -0.0000002831 3.0829138756 -0.0000001788 0.0274851620 -0.5422170162 0.8393849730
  0.0000002347 0.8859067559 0.0000000000 0.0035539116 -0.0104662087 -0.0010906695
  -0.0000001136 2.4326870441 -0.0000001639 -0.0291769691 0.9539243579 -0.2870363593
  -0.0000003278 0.4304144979 0.0000004917 -0.2690185010 -0.0203053653 0.0074396119
  -0.0000002123 0.3361924887 -0.0000000745 -0.1137772724 -0.0367629267 -0.0055973423
  -0.7640509605 0.4168767035 -0.0157418624 -0.8967641592 0.2002725750 0.2439866066
  0.0000002757 1.7199568748 0.0000001192 -0.0491102040 0.1028832495 -0.0420703553
  0.0000002719 0.4365786910 0.0000003874 -0.8472191095 -0.0029434564 0.0547556132
  0.0000001788 2.5287609100 0.0000001192 0.0507698543 -0.6465386152 0.7611259222
  -0.0000003874 0.6678897142 -0.0000008345 -0.3025764227 -0.0154096009 -0.0071119871
  -0.0000003316 2.1936640739 -0.0000001416 0.2456288487 0.0091264341 0.0020253800
  -0.0000003353 0.3807586432 -0.0000005066 0.3023069501 0.6031809449 -0.3031156957
  0.0000000075 0.3010087609 -0.0000002239 -0.0010645112 -0.0328153037 0.0109451097
  0.7640510798 0.4168769419 -0.0157416649 -0.8827129602 -0.2316668332 -0.2891668975
  -0.0000002384 1.7199569941 -0.0000001192 -0.1105352640 -0.0438014492 0.0216525700
  -0.0000001118 0.4365787208 -0.0000002980 -0.8070530891 -0.0025081446 -0.0690690875
  -0.0000008494 2.5287606716 0.0000000000 0.0131377587 0.6329796910 -0.7739244103
  0.0000000000 0.6526254416 -0.0000013113 -0.3152464628 0.0161756016 0.0050208941
  0.0000002123 2.2037844658 0.0000004619 0.2409732938 0.0245536044 -0.0212341733
  0.0000002673 0.3807584941 0.0000001043 0.4567915797 -0.0023292962 -0.0669880956
  0.0000000683 0.3010083735 0.0000000303 -0.0108817741 -0.0104970802 0.0015860589
}

