MD5Version 10 // Parameters used during export: Reorient: True; Scale: 1.0
commandline ""

numFrames 27
numJoints 38
frameRate 60
numAnimatedComponents 228

hierarchy {
  "root" -1 63 0 //
  "torso" 0 63 6 //
  "torso1" 1 63 12 //
  "head" 2 63 18 //
  "tentacle.L" 3 63 24 //
  "tentacle1.L" 4 63 30 //
  "tentacle.R" 3 63 36 //
  "tentacle1.R" 6 63 42 //
  "tip_f.L" 2 63 48 //
  "boop.L" 2 63 54 //
  "boop1.L" 2 63 60 //
  "boop7.L" 2 63 66 //
  "tip_f.R" 2 63 72 //
  "boop.R" 2 63 78 //
  "boop1.R" 2 63 84 //
  "boop7.R" 2 63 90 //
  "back" 1 63 96 //
  "butt" 16 63 102 //
  "boop10.L" 17 63 108 //
  "boop10.R" 17 63 114 //
  "tip_b.L" 16 63 120 //
  "boop4.L" 16 63 126 //
  "boop8.L" 16 63 132 //
  "tip_b.R" 16 63 138 //
  "boop4.R" 16 63 144 //
  "boop8.R" 16 63 150 //
  "tip_m.L" 1 63 156 //
  "boop2.L" 1 63 162 //
  "boop3.L" 1 63 168 //
  "boop9.L" 1 63 174 //
  "boop5.L" 1 63 180 //
  "boop6.L" 1 63 186 //
  "tip_m.R" 1 63 192 //
  "boop2.R" 1 63 198 //
  "boop3.R" 1 63 204 //
  "boop9.R" 1 63 210 //
  "boop5.R" 1 63 216 //
  "boop6.R" 1 63 222 //
}

bounds {
  ( -2.8754773140 -2.0383903980 -0.0746136010 ) ( 2.6332154274 2.0628013611 1.7232096195 )
  ( -2.8692829609 -2.0440864563 -0.0738393217 ) ( 2.6316485405 2.0730638504 1.7276439667 )
  ( -2.8522081375 -2.0597801208 -0.0715271682 ) ( 2.6325345039 2.1013178825 1.7404398918 )
  ( -2.8352425098 -2.0799181461 -0.0680514723 ) ( 2.6327724457 2.1374404430 1.7585387230 )
  ( -2.8201344013 -2.0970304012 -0.0643985718 ) ( 2.6317906380 2.1678647995 1.7762745619 )
  ( -2.8077781200 -2.1070683002 -0.0617543161 ) ( 2.6303892136 2.1854948997 1.7883905172 )
  ( -2.8031871319 -2.1101551056 -0.0608264208 ) ( 2.6297721863 2.1908679008 1.7925107479 )
  ( -2.8036041260 -2.1098873615 -0.0609096289 ) ( 2.6298294067 2.1904029846 1.7921440601 )
  ( -2.8048548698 -2.1090686321 -0.0611605346 ) ( 2.6300015450 2.1889801025 1.7910346985 )
  ( -2.8069188595 -2.1076695919 -0.0615785569 ) ( 2.6302766800 2.1865439415 1.7891759872 )
  ( -2.8097376823 -2.1056537628 -0.0621585697 ) ( 2.6306381226 2.1830248833 1.7865750790 )
  ( -2.8132209778 -2.1029858589 -0.0628899932 ) ( 2.6310577393 2.1783516407 1.7832567692 )
  ( -2.8172383308 -2.0996398926 -0.0637565404 ) ( 2.6315011978 2.1724681854 1.7792692184 )
  ( -2.8216309547 -2.0956101418 -0.0647359788 ) ( 2.6319289207 2.1653552055 1.7746866941 )
  ( -2.8262183666 -2.0909242630 -0.0658002943 ) ( 2.6323051453 2.1570510864 1.7696127892 )
  ( -2.8308150768 -2.0856523514 -0.0669170842 ) ( 2.6325941086 2.1476745605 1.7641786337 )
  ( -2.8352448940 -2.0799136162 -0.0680514947 ) ( 2.6327724457 2.1374335289 1.7585384846 )
  ( -2.8393590450 -2.0738730431 -0.0691681653 ) ( 2.6328291893 2.1266236305 1.7528622150 )
  ( -2.8435342312 -2.0677328110 -0.0702341497 ) ( 2.6327676773 2.1156101227 1.7473238707 )
  ( -2.8501992226 -2.0617146492 -0.0712203979 ) ( 2.6326060295 2.1047980785 1.7420902252 )
  ( -2.8559091091 -2.0560431480 -0.0721035451 ) ( 2.6323707104 2.0945959091 1.7373105288 )
  ( -2.8613419533 -2.0509247780 -0.0728659183 ) ( 2.6320974827 2.0853817463 1.7331098318 )
  ( -2.8665034771 -2.0465359688 -0.0734961480 ) ( 2.6318197250 2.0774765015 1.7295843363 )
  ( -2.8704774380 -2.0430130959 -0.0739874095 ) ( 2.6317825317 2.0711302757 1.7268021107 )
  ( -2.8732771873 -2.0404515266 -0.0743369013 ) ( 2.6324825287 2.0665144920 1.7248032093 )
  ( -2.8749327660 -2.0389046669 -0.0745448992 ) ( 2.6330337524 2.0637276173 1.7236059904 )
  ( -2.8754773140 -2.0383903980 -0.0746136010 ) ( 2.6332154274 2.0628013611 1.7232096195 )
}

baseframe {
  ( 0.0000000000 0.0000000000 1.0000000000 ) ( 0.4999999702 -0.5000000000 0.5000000596 )
  ( -0.0000000000 0.3063463569 0.8412714005 ) ( -0.0000000542 0.6955333352 -0.7184938788 )
  ( 0.0000000000 1.3493596315 0.0000000205 ) ( 0.0000000107 -0.9988002181 0.0489705727 )
  ( -0.0000001078 1.5471527576 -0.3146134317 ) ( -0.4736934900 -0.0000002214 0.0000000454 )
  ( 0.0587135032 0.8376622200 -0.0838612095 ) ( 0.0319966562 0.5977396965 0.3777594268 )
  ( -0.0000000229 0.2429900467 0.0000000051 ) ( -0.4181883931 0.0000059963 -0.0000032710 )
  ( -0.0607319772 0.8385645747 -0.0833465680 ) ( 0.0122566381 -0.6080569029 -0.3609169424 )
  ( -0.0000001045 0.2374178469 0.0000000128 ) ( -0.3721733093 0.0000016786 0.0000036045 )
  ( 1.4243649244 0.3662071824 0.1993640512 ) ( -0.5741192102 -0.6044641733 -0.3718667626 )
  ( 0.3296363354 1.1707423925 -0.7418686748 ) ( 0.7193551660 -0.0034941791 -0.0037048133 )
  ( 0.7528003454 0.5630729198 -0.7151184082 ) ( 0.6049175262 0.3186131716 -0.0212290175 )
  ( 1.1943778992 0.7695444822 -0.1487940103 ) ( 0.5066965818 0.4797537327 0.3287961483 )
  ( -1.4243649244 0.3662071824 0.1993650347 ) ( -0.3672881126 -0.4131159484 -0.5770590901 )
  ( -0.3296368122 1.1707423925 -0.7418684959 ) ( 0.7193569541 0.0038245113 0.0033622496 )
  ( -0.7701662779 0.5588867068 -0.7297711372 ) ( 0.5261390209 0.1114061773 -0.2992553711 )
  ( -1.1823128462 0.7737880945 -0.1767145544 ) ( -0.4984721243 0.8210214972 -0.2667492330 )
  ( -0.0000000000 0.0000002645 0.0000001397 ) ( -0.0000000747 -0.0900828764 -0.9959343672 )
  ( 0.0000000000 1.1379019022 0.0000000298 ) ( 0.3041469455 -0.0000000564 0.0000000179 )
  ( 0.6739707589 0.0622844696 0.3715734184 ) ( -0.5833552480 -0.1681409329 0.0130277472 )
  ( -0.7810674310 0.0879245400 0.2562515438 ) ( -0.5215219855 0.0300893746 -0.1831304729 )
  ( 1.2509074211 0.9054201841 -0.3102088571 ) ( 0.4404064715 -0.3429319561 0.5290254951 )
  ( 0.8815217018 0.6643680334 0.6056026220 ) ( -0.5094130635 -0.1803605109 0.1675079465 )
  ( 1.3489320278 0.3797309697 0.0743372291 ) ( -0.4703258574 -0.4736672640 0.4371619225 )
  ( -1.2509074211 0.9054201841 -0.3102088571 ) ( 0.6133158207 -0.5475406647 0.3125212789 )
  ( -0.9075071216 0.6607854962 0.5266835093 ) ( -0.5660707951 0.1776671857 -0.1786268651 )
  ( -1.4084856510 0.3263736665 -0.0037793680 ) ( 0.2674489319 -0.4195635617 -0.5860092044 )
  ( -1.5604763031 0.4714115560 -0.2048420906 ) ( 0.3945766985 0.4126714468 -0.6045740247 )
  ( -0.3106493056 1.1060127020 0.8858308196 ) ( 0.0513756946 0.7780858874 0.6224982142 )
  ( -0.7314699888 0.6655397415 0.8392417431 ) ( 0.1312439293 -0.6869707704 -0.7078753114 )
  ( -0.3655653000 0.2533499897 0.8979741931 ) ( -0.0350590199 -0.7288195491 -0.6838051081 )
  ( -1.2784247398 0.3708303571 0.4198390841 ) ( 0.3141695559 -0.6529923081 -0.6414983273 )
  ( -1.4598538876 0.9663969278 0.1813039780 ) ( 0.3715421557 -0.6309405565 -0.5507364273 )
  ( 1.5604763031 0.4714115560 -0.2048425525 ) ( 0.5726933479 0.5853071809 -0.4395712614 )
  ( 0.2655653656 1.0973490477 0.9614252448 ) ( 0.1293685734 -0.7496640086 -0.6419409513 )
  ( 0.7296919823 0.6614130735 0.8004874587 ) ( 0.0683836639 0.6995324492 0.7001060247 )
  ( 0.3463382125 0.1825023890 0.8957909942 ) ( 0.0105164191 -0.6659310460 -0.7450238466 )
  ( 1.3478801250 0.3832067847 0.4811495841 ) ( 0.2421903908 0.6215728521 0.6719866991 )
  ( 1.4734741449 1.0102740526 0.0975962728 ) ( -0.4783740640 -0.4623877704 0.4040198028 )
}

frame 0 {
  0.0000000000 0.0000000000 1.0000000000 0.4999999702 -0.5000000000 0.5000000596
  -0.0000000000 0.3063463569 0.8412714005 -0.0000000542 0.6955333352 -0.7184938788
  0.0000000000 1.3493596315 0.0000000205 0.0000000107 -0.9988002181 0.0489705727
  -0.0000001078 1.5471527576 -0.3146134317 -0.3529965580 -0.0000002325 0.0000000391
  0.0587135032 0.8376624584 -0.0838611349 0.0319966637 0.5977396965 0.3777593672
  0.0000001296 0.2429899871 -0.0000000373 -0.4181883335 0.0000059900 -0.0000032670
  -0.0607319772 0.8385646343 -0.0833465233 0.0122566614 -0.6080568433 -0.3609169424
  -0.0000000407 0.2374178767 0.0000000373 -0.3721732795 0.0000016765 0.0000035983
  1.4243649244 0.3662071824 0.1993640512 -0.6370176673 -0.6597740054 -0.2614188194
  0.3296363354 1.1707423925 -0.7418686748 0.7193551660 -0.0034941791 -0.0037048133
  0.7528003454 0.5630729198 -0.7151184082 0.6049175262 0.3186131716 -0.0212290175
  1.1943778992 0.7695444822 -0.1487940103 0.5066965818 0.4797537327 0.3287961483
  -1.4243649244 0.3662071824 0.1993650347 -0.2522692978 -0.3022225499 -0.6409133673
  -0.3296368122 1.1707423925 -0.7418684959 0.7193569541 0.0038245113 0.0033622496
  -0.7701662779 0.5588867068 -0.7297711372 0.5261390209 0.1114061773 -0.2992553711
  -1.1823128462 0.7737880945 -0.1767145544 -0.4984721243 0.8210214972 -0.2667492330
  -0.0000000000 0.0000002645 0.0000001397 -0.0000000747 -0.0900828764 -0.9959343672
  0.0000000000 1.1379019022 0.0000000298 0.3041469455 -0.0000000564 0.0000000179
  0.6739707589 0.0622844696 0.3715734184 -0.5833552480 -0.1681409329 0.0130277472
  -0.7810674310 0.0879245400 0.2562515438 -0.5215219855 0.0300893746 -0.1831304729
  1.2509074211 0.9054201841 -0.3102088571 0.3503412008 -0.2148901671 0.5808482766
  0.8815217018 0.6643680334 0.6056026220 -0.5094130635 -0.1803605109 0.1675079465
  1.3489320278 0.3797309697 0.0743372291 -0.4703258574 -0.4736672640 0.4371619225
  -1.2509074211 0.9054201841 -0.3102088571 0.6508713961 -0.6699885726 0.1690834165
  -0.9075071216 0.6607854962 0.5266835093 -0.5660707951 0.1776671857 -0.1786268651
  -1.4084856510 0.3263736665 -0.0037793680 0.2674489319 -0.4195635617 -0.5860092044
  -1.5604763031 0.4714115560 -0.2048420906 0.2551330030 0.2778187394 -0.6724807620
  -0.3106493056 1.1060127020 0.8858308196 0.0513756946 0.7780858874 0.6224982142
  -0.7314699888 0.6655397415 0.8392417431 0.1312439293 -0.6869707704 -0.7078753114
  -0.3655653000 0.2533499897 0.8979741931 -0.0350590199 -0.7288195491 -0.6838051081
  -1.2784247398 0.3708303571 0.4198390841 0.3141695559 -0.6529923081 -0.6414983273
  -1.4598538876 0.9663969278 0.1813039780 0.3715421557 -0.6309405565 -0.5507364273
  1.5604763031 0.4714115560 -0.2048425525 0.6593233943 0.6633563042 -0.2861741781
  0.2655653656 1.0973490477 0.9614252448 0.1293685734 -0.7496640086 -0.6419409513
  0.7296919823 0.6614130735 0.8004874587 0.0683836639 0.6995324492 0.7001060247
  0.3463382125 0.1825023890 0.8957909942 0.0105164191 -0.6659310460 -0.7450238466
  1.3478801250 0.3832067847 0.4811495841 0.2421903908 0.6215728521 0.6719866991
  1.4734741449 1.0102740526 0.0975962728 -0.4783740640 -0.4623877704 0.4040198028
}

frame 1 {
  0.0000000000 0.0000000000 1.0000000000 0.4999999702 -0.5000000000 0.5000000596
  -0.0000000000 0.3063463569 0.8412714005 -0.0012325125 0.6942231059 -0.7197579741
  -0.0000000003 1.3493597507 -0.0000000120 0.0055625113 -0.9985760450 0.0530575067
  0.0000276032 1.5455993414 -0.3219568729 -0.3537118435 0.0003210847 -0.0002357744
  0.0587135106 0.8376623988 -0.0838609189 0.0236189738 0.5976724625 0.3766510189
  0.0000001618 0.2429900914 -0.0000000671 -0.4265424311 -0.0001749403 0.0093097659
  -0.0607319698 0.8385646343 -0.0833462477 0.0025700247 -0.6084714532 -0.3585867584
  0.0000002316 0.2374179065 -0.0000000298 -0.3763475418 -0.0007247563 -0.0095168576
  1.4243649244 0.3662071228 0.1993640363 -0.6312582493 -0.6663753986 -0.2654725611
  0.3310607672 1.1681997776 -0.7381471992 0.7158262134 0.0023692613 0.0012661893
  0.7480635047 0.5595020056 -0.7031454444 0.6049174666 0.3186131120 -0.0212290473
  1.1822900772 0.7659327388 -0.1443922371 0.5066965818 0.4797537327 0.3287961483
  -1.4243649244 0.3662071228 0.1993650049 -0.2523142993 -0.2997896373 -0.6317682266
  -0.3324561715 1.1718540192 -0.7349050045 0.7189165354 -0.0026856149 -0.0014324785
  -0.7702144384 0.5549923778 -0.7306250930 0.5383267999 0.1108089313 -0.3052909374
  -1.1823128462 0.7737882137 -0.1767147034 -0.4984720647 0.8210216165 -0.2667490244
  0.0000000001 0.0000002254 0.0000001825 -0.0000402705 -0.0919594765 -0.9957618117
  0.0000000000 1.1379020214 -0.0000000019 0.3053480983 -0.0000000563 0.0000000178
  0.6726322174 0.0603153668 0.3658794165 -0.5833552480 -0.1681409627 0.0130277518
  -0.7859450579 0.0867857412 0.2497548163 -0.5202353597 0.0292153433 -0.1970547289
  1.2509074211 0.9054201841 -0.3102089465 0.3466803730 -0.2098162621 0.5790975690
  0.8763260245 0.6595690250 0.5967962742 -0.5094130635 -0.1803604960 0.1675079167
  1.3398385048 0.3780913055 0.0729080588 -0.4703258574 -0.4736672640 0.4371619225
  -1.2509075403 0.9054202437 -0.3102089465 0.6453413367 -0.6742811203 0.1706520766
  -0.9031624794 0.6542323828 0.5192411542 -0.5738560557 0.1769874990 -0.1793475896
  -1.4068439007 0.3290850818 -0.0047359876 0.2665811479 -0.4231437147 -0.5789020658
  -1.5604761839 0.4714115858 -0.2048420161 0.2499679178 0.2722643614 -0.6742389798
  -0.3106920719 1.1099096537 0.8836348653 0.0513589457 0.7851008773 0.6135161519
  -0.7314085364 0.6631163955 0.8372442126 0.1314055771 -0.6793045998 -0.7150623202
  -0.3685514331 0.2543588877 0.8940643668 -0.0230867472 -0.7309189439 -0.6819416881
  -1.2715685368 0.3710215390 0.4134848118 0.3141694665 -0.6529922485 -0.6414983273
  -1.4513435364 0.9653003216 0.1775900871 0.3715420961 -0.6309405565 -0.5507364273
  1.5604763031 0.4714115560 -0.2048425227 0.6642794609 0.6633360982 -0.2800583243
  0.2655653954 1.0973489285 0.9614252448 0.1293684244 -0.7496640086 -0.6419410110
  0.7267851830 0.6613023877 0.7901973724 0.0683835372 0.6995323896 0.7001060843
  0.3404902518 0.1904664338 0.8843213916 0.0120700300 -0.6782531738 -0.7338651419
  1.3370494843 0.3775201142 0.4751976728 0.2479424924 0.6114295125 0.6752799749
  1.4652173519 1.0210039616 0.0897105560 -0.4852545559 -0.4573949575 0.4059277475
}

frame 2 {
  0.0000000000 0.0000000000 1.0000000000 0.4999999702 -0.5000000000 0.5000000596
  -0.0000000000 0.3063463569 0.8412714005 -0.0048199147 0.6903854012 -0.7234123945
  0.0000000009 1.3493595123 -0.0000000744 0.0217673331 -0.9976509213 0.0649507642
  0.0001082587 1.5410792828 -0.3433266282 -0.3557921350 0.0012562611 -0.0009220985
  0.0587134995 0.8376621008 -0.0838609338 -0.0008138706 0.5972292423 0.3732647598
  0.0000001332 0.2429901063 0.0000000056 -0.4505316913 -0.0007018905 0.0365140550
  -0.0607319698 0.8385643959 -0.0833463073 -0.0256879125 -0.6093308926 -0.3515857160
  -0.0000000410 0.2374178767 -0.0000000112 -0.3882882595 -0.0028455406 -0.0372890718
  1.4243649244 0.3662071228 0.1993641406 -0.6139802337 -0.6851509809 -0.2771052122
  0.3352063894 1.1607991457 -0.7273157239 0.7051882744 0.0194654502 0.0157603212
  0.7342842221 0.5491140485 -0.6683160067 0.6049175262 0.3186131418 -0.0212290082
  1.1471258402 0.7554261088 -0.1315874457 0.5066965818 0.4797537327 0.3287961483
  -1.4243649244 0.3662071228 0.1993651241 -0.2521762252 -0.2923560143 -0.6043624878
  -0.3406613767 1.1750886440 -0.7146404982 0.7173627615 -0.0216587503 -0.0154057778
  -0.7703543901 0.5436584949 -0.7331094146 0.5731186271 0.1088657454 -0.3224609792
  -1.1823129654 0.7737880349 -0.1767145246 -0.4984720945 0.8210216165 -0.2667489946
  -0.0000000002 0.0000001975 0.0000000969 -0.0001572718 -0.0974190235 -0.9952290058
  -0.0000000023 1.1379020214 0.0000000223 0.3088414669 -0.0000000557 0.0000000170
  0.6687368751 0.0545843393 0.3493084610 -0.5833552480 -0.1681409627 0.0130277472
  -0.8001391292 0.0834725723 0.2308477163 -0.5158711672 0.0266223066 -0.2375383675
  1.2509075403 0.9054202437 -0.3102089167 0.3358818591 -0.1949493885 0.5737791657
  0.8612098098 0.6456069350 0.5711755157 -0.5094130635 -0.1803605407 0.1675079018
  1.3133791685 0.3733203709 0.0687496439 -0.4703258574 -0.4736672938 0.4371619225
  -1.2509073019 0.9054202437 -0.3102089465 0.6290304065 -0.6865842342 0.1751716286
  -0.8905218840 0.6351625323 0.4975876212 -0.5962523222 0.1749111265 -0.1813525259
  -1.4020652771 0.3369764388 -0.0075201644 0.2639236748 -0.4333808124 -0.5579000711
  -1.5604760647 0.4714114666 -0.2048420459 0.2348175645 0.2559709847 -0.6791043282
  -0.3108165860 1.1212503910 0.8772436380 0.0512731858 0.8049864173 0.5868418217
  -0.7312296629 0.6560632586 0.8314306736 0.1317932159 -0.6565061808 -0.7355742455
  -0.3772419989 0.2572950423 0.8826851845 0.0121058840 -0.7354582548 -0.6749479771
  -1.2516183853 0.3715776801 0.3949956894 0.3141694069 -0.6529924273 -0.6414982677
  -1.4265804291 0.9621091485 0.1667835861 0.3715420663 -0.6309405565 -0.5507364869
  1.5604760647 0.4714114666 -0.2048425525 0.6782938242 0.6628268361 -0.2620223165
  0.2655653059 1.0973486900 0.9614250064 0.1293685883 -0.7496640086 -0.6419410110
  0.7183277011 0.6609802246 0.7602592111 0.0683835298 0.6995323300 0.7001060843
  0.3234718144 0.2136409879 0.8509529829 0.0166046303 -0.7132404447 -0.7000054717
  1.3055377007 0.3609706163 0.4578842819 0.2644617260 0.5810183883 0.6840928793
  1.4411923885 1.0522155762 0.0667636618 -0.5050839186 -0.4426170290 0.4112948179
}

frame 3 {
  0.0000000000 0.0000000000 1.0000000000 0.4999999702 -0.5000000000 0.5000000596
  -0.0000000000 0.3063463569 0.8412714005 -0.0099773509 0.6848051548 -0.7286010981
  0.0000000022 1.3493596315 -0.0000000229 0.0450733453 -0.9956101775 0.0820217133
  0.0002241812 1.5345839262 -0.3740437329 -0.3587788343 0.0026006463 -0.0019087356
  0.0587134995 0.8376621008 -0.0838610902 -0.0359980315 0.5959444046 0.3679860830
  0.0000001034 0.2429900467 0.0000000149 -0.4839928746 -0.0014583565 0.0756924450
  -0.0607319437 0.8385643959 -0.0833463147 -0.0663697422 -0.6096525192 -0.3409716487
  -0.0000002524 0.2374177724 0.0000000261 -0.4048523307 -0.0059001837 -0.0772570744
  1.4243648052 0.3662072122 0.1993640810 -0.5878743529 -0.7108947039 -0.2933365107
  0.3411660194 1.1501605511 -0.7117460966 0.6889691353 0.0440666191 0.0366176516
  0.7144860029 0.5341885686 -0.6182723045 0.6049175262 0.3186131120 -0.0212290380
  1.0966013670 0.7403299809 -0.1131892279 0.5066965818 0.4797537327 0.3287961483
  -1.4243646860 0.3662071526 0.1993651092 -0.2512674928 -0.2807960510 -0.5630866289
  -0.3524565697 1.1797388792 -0.6855136752 0.7144213915 -0.0489535443 -0.0355073400
  -0.7705559731 0.5273659825 -0.7366808653 0.6209039688 0.1055548638 -0.3458745182
  -1.1823127270 0.7737880945 -0.1767145097 -0.4984719753 0.8210216165 -0.2667492330
  0.0000000018 0.0000001753 0.0000001564 -0.0003252410 -0.1052605584 -0.9943825603
  -0.0000000020 1.1379020214 0.0000000099 0.3138562739 -0.0000000559 0.0000000188
  0.6631377339 0.0463471003 0.3254895806 -0.5833552480 -0.1681409180 0.0130277425
  -0.8205413222 0.0787101239 0.2036691606 -0.5079944730 0.0227898527 -0.2952946126
  1.2509074211 0.9054201841 -0.3102089763 0.3200086951 -0.1733550429 0.5655637383
  0.8394872546 0.6255428791 0.5343573093 -0.5094130635 -0.1803605258 0.1675079018
  1.2753512859 0.3664634824 0.0627730861 -0.4703258574 -0.4736672640 0.4371619225
  -1.2509074211 0.9054202437 -0.3102089465 0.6050518751 -0.7037471533 0.1815385818
  -0.8723563552 0.6077528000 0.4664694965 -0.6276796460 0.1716752946 -0.1839851290
  -1.3951958418 0.3483203948 -0.0115225092 0.2597652972 -0.4475829303 -0.5269467831
  -1.5604761839 0.4714114964 -0.2048421204 0.2127686739 0.2322551608 -0.6854271293
  -0.3109955192 1.1375529766 0.8680563569 0.0510494448 0.8320767283 0.5472292304
  -0.7309727073 0.6459243894 0.8230736852 0.1321308762 -0.6225518584 -0.7639076114
  -0.3897350132 0.2615160346 0.8663281798 0.0630700290 -0.7377034426 -0.6608077884
  -1.2229465246 0.3723771274 0.3684229553 0.3141695559 -0.6529923081 -0.6414982677
  -1.3909915686 0.9575231075 0.1512525231 0.3715421259 -0.6309404969 -0.5507364273
  1.5604763031 0.4714115262 -0.2048425525 0.6972953081 0.6609144211 -0.2355580032
  0.2655653358 1.0973489285 0.9614252448 0.1293685883 -0.7496639490 -0.6419410706
  0.7061736584 0.6605175138 0.7172353268 0.0683835298 0.6995323300 0.7001060843
  0.2990093231 0.2469505519 0.8030040860 0.0231008157 -0.7608225346 -0.6480321288
  1.2602528334 0.3371813297 0.4330087304 0.2874817550 0.5352110863 0.6946389079
  1.4066649675 1.0970604420 0.0337816142 -0.5330110192 -0.4207745492 0.4185065627
}

frame 4 {
  0.0000000000 0.0000000000 1.0000000000 0.4999999702 -0.5000000000 0.5000000596
  -0.0000000000 0.3063463569 0.8412714005 -0.0151349343 0.6791518927 -0.7337117791
  0.0000000050 1.3493596315 0.0000000048 0.0683404133 -0.9927342534 0.0990233943
  0.0003401540 1.5280897617 -0.4047588706 -0.3617608845 0.0039449986 -0.0028953545
  0.0587135255 0.8376620412 -0.0838605985 -0.0711345896 0.5938987136 0.3622386754
  0.0000002207 0.2429901212 0.0000000075 -0.5159667730 -0.0022089258 0.1146350950
  -0.0607319884 0.8385646343 -0.0833459944 -0.1069307029 -0.6088923216 -0.3297552466
  -0.0000001184 0.2374179065 -0.0000000391 -0.4206163883 -0.0089442758 -0.1170684099
  1.4243650436 0.3662071824 0.1993640959 -0.5604247451 -0.7350056767 -0.3088909090
  0.3471256793 1.1395224333 -0.6961765885 0.6717188358 0.0685996413 0.0574180260
  0.6946932673 0.5192675591 -0.5682432652 0.6049175262 0.3186131120 -0.0212290473
  1.0460916758 0.7252383232 -0.0947963744 0.5066965818 0.4797537327 0.3287961185
  -1.4243649244 0.3662071824 0.1993650794 -0.2495233864 -0.2683025599 -0.5199443102
  -0.3642516434 1.1843891144 -0.6563891172 0.7106525302 -0.0761891678 -0.0555653833
  -0.7707575560 0.5110736489 -0.7402526140 0.6653608084 0.1016781479 -0.3674403727
  -1.1823129654 0.7737882137 -0.1767146140 -0.4984721541 0.8210214972 -0.2667490244
  0.0000000027 0.0000002462 0.0000001415 -0.0004936152 -0.1130920574 -0.9934414625
  0.0000000115 1.1379020214 0.0000000590 0.3188622892 -0.0000000570 0.0000000175
  0.6575390100 0.0381108187 0.3016720116 -0.5833552480 -0.1681409627 0.0130277425
  -0.8409422040 0.0739486963 0.1764915586 -0.4982894361 0.0188729372 -0.3519769013
  1.2509075403 0.9054202437 -0.3102088869 0.3037700057 -0.1515632570 0.5567001700
  0.8177690506 0.6054828763 0.4975465536 -0.5094130635 -0.1803605258 0.1675079465
  1.2373291254 0.3596075177 0.0567974374 -0.4703258574 -0.4736672640 0.4371619225
  -1.2509073019 0.9054202437 -0.3102089167 0.5805061460 -0.7202488780 0.1877350360
  -0.8541942835 0.5803454518 0.4353570342 -0.6580620408 0.1681559980 -0.1863117516
  -1.3883266449 0.3596643806 -0.0155249098 0.2552227974 -0.4611208439 -0.4952144921
  -1.5604761839 0.4714114964 -0.2048420012 0.1904695481 0.2082662284 -0.6909368038
  -0.3111744225 1.1538546085 0.8588691950 0.0507084653 0.8572314978 0.5063557625
  -0.7307156324 0.6357855797 0.8147166371 0.1322070509 -0.5873753428 -0.7907301784
  -0.4022278190 0.2657370865 0.8499715328 0.1135592461 -0.7347928286 -0.6420506239
  -1.1942782402 0.3731764257 0.3418540359 0.3141694963 -0.6529923081 -0.6414983273
  -1.3554072380 0.9529375434 0.1357236505 0.3715421259 -0.6309404969 -0.5507364273
  1.5604760647 0.4714114964 -0.2048424631 0.7148350477 0.6576161981 -0.2086043656
  0.2655653656 1.0973489285 0.9614251852 0.1293684244 -0.7496640682 -0.6419410110
  0.6940216422 0.6600548029 0.6742190719 0.0683836639 0.6995324492 0.7001060843
  0.2745481431 0.2802570164 0.7550659180 0.0294814426 -0.8045513630 -0.5928159356
  1.2149760723 0.3133929968 0.4081408381 0.3094080091 0.4873830080 0.7025549412
  1.3721423149 1.1418914795 0.0008024797 -0.5601448417 -0.3983097672 0.4250958562
}

frame 5 {
  0.0000000000 0.0000000000 1.0000000000 0.4999999702 -0.5000000000 0.5000000596
  -0.0000000000 0.3063463569 0.8412714005 -0.0187195893 0.6751770973 -0.7372203469
  0.0000000102 1.3493595123 0.0000000160 0.0844723508 -0.9902456999 0.1107870117
  0.0004207619 1.5235723257 -0.4261251986 -0.3638324440 0.0048801117 -0.0035816196
  0.0587135181 0.8376623392 -0.0838609040 -0.0954783708 0.5920326710 0.3579761684
  0.0000002505 0.2429900616 0.0000000149 -0.5371851921 -0.0027249237 0.1414001882
  -0.0607319660 0.8385645747 -0.0833463818 -0.1349630058 -0.6077308655 -0.3216291666
  0.0000002524 0.2374178320 0.0000000410 -0.4310633540 -0.0110453200 -0.1445482671
  1.4243650436 0.3662071824 0.1993641257 -0.5406384468 -0.7507340908 -0.3192602992
  0.3512713015 1.1321221590 -0.6853460073 0.6591535211 0.0855684876 0.0718057901
  0.6809244752 0.5088874102 -0.5334402919 0.6049175262 0.3186131418 -0.0212290287
  1.0109543800 0.7147393823 -0.0820012763 0.5066965818 0.4797537327 0.3287961483
  -1.4243648052 0.3662071824 0.1993651390 -0.2478298098 -0.2591304481 -0.4890628755
  -0.3724564910 1.1876237392 -0.6361293793 0.7075508833 -0.0950516462 -0.0694573596
  -0.7708977461 0.4997401237 -0.7427371144 0.6939808130 0.0986857638 -0.3811841905
  -1.1823129654 0.7737880945 -0.1767145544 -0.4984720051 0.8210214972 -0.2667493820
  0.0000000012 0.0000002017 0.0000002086 -0.0006110189 -0.1185327172 -0.9927312136
  -0.0000000064 1.1379020214 -0.0000000233 0.3223392963 -0.0000000555 0.0000000194
  0.6536443233 0.0323811658 0.2851038575 -0.5833553076 -0.1681409627 0.0130277518
  -0.8551336527 0.0706365705 0.1575862318 -0.4905222952 0.0161226559 -0.3904620111
  1.2509075403 0.9054201245 -0.3102088571 0.2922877371 -0.1363270730 0.5501694083
  0.8026611805 0.5915283561 0.4719396234 -0.5094130635 -0.1803605258 0.1675079018
  1.2108794451 0.3548383117 0.0526405275 -0.4703257978 -0.4736672938 0.4371619225
  -1.2509075403 0.9054201841 -0.3102088571 0.5631337166 -0.7313143015 0.1919359565
  -0.8415600061 0.5612800121 0.4137140214 -0.6785055995 0.1655497551 -0.1877448857
  -1.3835481405 0.3675553501 -0.0183089394 0.2518471479 -0.4701164067 -0.4727559686
  -1.5604761839 0.4714114368 -0.2048419416 0.1748512089 0.1914619803 -0.6942812204
  -0.3112988472 1.1651945114 0.8524782062 0.0504029877 0.8735051751 0.4773276746
  -0.7305367589 0.6287327409 0.8089033365 0.1321068555 -0.5622940063 -0.8084204197
  -0.4109180570 0.2686732411 0.8385933042 0.1478725225 -0.7298018336 -0.6265228987
  -1.1743355989 0.3737323880 0.3233718574 0.3141694963 -0.6529922485 -0.6414983273
  -1.3306536674 0.9497476220 0.1249213070 0.3715421259 -0.6309404969 -0.5507364869
  1.5604760647 0.4714114964 -0.2048424333 0.7261201143 0.6545202732 -0.1896537989
  0.2655653656 1.0973488092 0.9614252448 0.1293685734 -0.7496640086 -0.6419410110
  0.6855683923 0.6597328782 0.6442955136 0.0683836564 0.6995322704 0.7001061440
  0.2575322688 0.3034259081 0.7217180133 0.0338019803 -0.8323876262 -0.5529373884
  1.1834800243 0.2968451977 0.3908413351 0.3238929212 0.4532126188 0.7064751387
  1.3481271267 1.1730782986 -0.0221387427 -0.5784910917 -0.3823684752 0.4292990863
}

frame 6 {
  0.0000000000 0.0000000000 1.0000000000 0.4999999702 -0.5000000000 0.5000000596
  -0.0000000000 0.3063463569 0.8412714005 -0.0199500825 0.6738035083 -0.7384169102
  0.0000000026 1.3493593931 0.0000000270 0.0900011659 -0.9892991781 0.1148140654
  0.0004485316 1.5220193863 -0.4334668517 -0.3645437062 0.0052014021 -0.0038174193
  0.0587134995 0.8376619220 -0.0838611722 -0.1038149670 0.5913087726 0.3564631939
  -0.0000003409 0.2429900765 -0.0000000224 -0.5442649126 -0.0029008153 0.1505112201
  -0.0607319735 0.8385641575 -0.0833465084 -0.1445455402 -0.6072136164 -0.3187802136
  -0.0000000060 0.2374177724 0.0000000261 -0.4345491230 -0.0117626786 -0.1539338976
  1.4243648052 0.3662070930 0.1993640065 -0.5337235928 -0.7559318542 -0.3227318525
  0.3526957035 1.1295791864 -0.6816247106 0.6547353268 0.0913731605 0.0767277256
  0.6761924624 0.5053199530 -0.5214795470 0.6049175262 0.3186131120 -0.0212290082
  0.9988784194 0.7111313343 -0.0776040405 0.5066965818 0.4797537327 0.3287961483
  -1.4243646860 0.3662070334 0.1993649900 -0.2471597195 -0.2558983266 -0.4783199728
  -0.3752756715 1.1887347698 -0.6291677952 0.7063957453 -0.1015106738 -0.0742145479
  -0.7709458470 0.4958460033 -0.7435905337 0.7033424377 0.0976080820 -0.3856510222
  -1.1823126078 0.7737880349 -0.1767145991 -0.4984720051 0.8210214972 -0.2667493820
  -0.0000000023 0.0000002093 0.0000001862 -0.0006516053 -0.1204006001 -0.9924765825
  -0.0000000024 1.1379021406 0.0000000115 0.3235328794 -0.0000000557 0.0000000183
  0.6523060799 0.0304123312 0.2794110179 -0.5833553076 -0.1681409329 0.0130277527
  -0.8600100279 0.0694980994 0.1510901898 -0.4876722991 0.0151764164 -0.4034678936
  1.2509074211 0.9054201841 -0.3102089167 0.2883113027 -0.1310825944 0.5478588939
  0.7974692583 0.5867328048 0.4631396830 -0.5094130635 -0.1803605407 0.1675079167
  1.2017904520 0.3531996012 0.0512121022 -0.4703257978 -0.4736672938 0.4371619225
  -1.2509073019 0.9054202437 -0.3102089167 0.5571134090 -0.7350351810 0.1933575571
  -0.8372182250 0.5547288656 0.4062766433 -0.6853901148 0.1646256298 -0.1882018596
  -1.3819061518 0.3702668250 -0.0192656796 0.2506480813 -0.4731237888 -0.4649769366
  -1.5604761839 0.4714114666 -0.2048420012 0.1694701314 0.1856718808 -0.6953371763
  -0.3113416433 1.1690908670 0.8502824306 0.0502853394 0.8788562417 0.4672614336
  -0.7304753661 0.6263093948 0.8069059253 0.1320436895 -0.5535757542 -0.8143065572
  -0.4139040709 0.2696821392 0.8346837759 0.1594455242 -0.7275499105 -0.6207629442
  -1.1674828529 0.3739234507 0.3170207143 0.3141695559 -0.6529922485 -0.6414983273
  -1.3221474886 0.9486514330 0.1212092265 0.3715421259 -0.6309404969 -0.5507364869
  1.5604761839 0.4714114666 -0.2048424631 0.7298187017 0.6533077359 -0.1831167936
  0.2655653656 1.0973488092 0.9614251852 0.1293687522 -0.7496640086 -0.6419410110
  0.6826634407 0.6596223116 0.6340122819 0.0683836564 0.6995323300 0.7001060843
  0.2516854703 0.3113873005 0.7102577686 0.0352556482 -0.8414325714 -0.5390201807
  1.1726561785 0.2911593020 0.3848957121 0.3287106454 0.4413428903 0.7075215578
  1.3398746252 1.1837964058 -0.0300217979 -0.5846874118 -0.3768389225 0.4306700826
}

frame 7 {
  0.0000000000 0.0000000000 1.0000000000 0.4999999702 -0.5000000000 0.5000000596
  -0.0000000000 0.3063463569 0.8412714005 -0.0198407881 0.6739262342 -0.7383103371
  0.0000000043 1.3493595123 -0.0000000143 0.0895082057 -0.9893854856 0.1144551113
  0.0004460325 1.5221582651 -0.4328117669 -0.3644802272 0.0051727374 -0.0037963807
  0.0587135106 0.8376623392 -0.0838609487 -0.1030718610 0.5913751721 0.3565991819
  0.0000000759 0.2429900467 0.0000000075 -0.5436378121 -0.0028851556 0.1497003436
  -0.0607319698 0.8385645747 -0.0833463520 -0.1436917484 -0.6072621346 -0.3190355301
  -0.0000003609 0.2374178022 0.0000000261 -0.4342403412 -0.0116988132 -0.1530978829
  1.4243649244 0.3662071228 0.1993640661 -0.5343428850 -0.7554724216 -0.3224242032
  0.3525686264 1.1298062801 -0.6819566488 0.6551315188 0.0908558667 0.0762890801
  0.6766148806 0.5056382418 -0.5225469470 0.6049175262 0.3186131716 -0.0212290268
  0.9999561310 0.7114531994 -0.0779963434 0.5066965818 0.4797537327 0.3287961483
  -1.4243648052 0.3662072122 0.1993650943 -0.2472213358 -0.2561882734 -0.4792808294
  -0.3750241697 1.1886359453 -0.6297888160 0.7065006495 -0.1009349599 -0.0737904683
  -0.7709415555 0.4961934984 -0.7435144782 0.7025172114 0.0977051258 -0.3852578998
  -1.1823128462 0.7737879753 -0.1767145991 -0.4984719455 0.8210216165 -0.2667492628
  -0.0000000028 0.0000002540 0.0000001415 -0.0006474578 -0.1202339903 -0.9924995303
  -0.0000000114 1.1379020214 -0.0000000489 0.3234264255 -0.0000000565 0.0000000186
  0.6524255276 0.0305877849 0.2799186110 -0.5833552480 -0.1681409180 0.0130277378
  -0.8595748544 0.0695999786 0.1516696960 -0.4879302382 0.0152608166 -0.4023123085
  1.2509074211 0.9054203033 -0.3102089167 0.2886666059 -0.1315506101 0.5480664372
  0.7979325056 0.5871608257 0.4639250338 -0.5094130635 -0.1803605407 0.1675079167
  1.2026015520 0.3533457816 0.0513395332 -0.4703258574 -0.4736672938 0.4371619225
  -1.2509074211 0.9054202437 -0.3102089465 0.5576515198 -0.7347050309 0.1932311207
  -0.8376056552 0.5553133488 0.4069401920 -0.6847789288 0.1647086889 -0.1881618649
  -1.3820527792 0.3700249195 -0.0191802569 0.2507558763 -0.4728572071 -0.4656721652
  -1.5604761839 0.4714115262 -0.2048420161 0.1699504554 0.1861887276 -0.6952449083
  -0.3113377690 1.1687433720 0.8504781723 0.0502958186 0.8783837557 0.4681613445
  -0.7304808497 0.6265255809 0.8070840240 0.1320499927 -0.5543556809 -0.8137854338
  -0.4136376381 0.2695921659 0.8350324035 0.1584177762 -0.7277618051 -0.6212851405
  -1.1680941582 0.3739064038 0.3175871968 0.3141694367 -0.6529923677 -0.6414982677
  -1.3229063749 0.9487493038 0.1215403378 0.3715421259 -0.6309406161 -0.5507364273
  1.5604760647 0.4714114964 -0.2048425525 0.7294924259 0.6534191966 -0.1837001443
  0.2655653358 1.0973489285 0.9614251256 0.1293685734 -0.7496640682 -0.6419409513
  0.6829226017 0.6596321464 0.6349297166 0.0683835447 0.6995323300 0.7001060247
  0.2522071004 0.3106769919 0.7112802267 0.0351292156 -0.8406362534 -0.5402660370
  1.1736220121 0.2916665971 0.3854262233 0.3282841444 0.4424041808 0.7074344158
  1.3406108618 1.1828399897 -0.0293184537 -0.5841368437 -0.3773332536 0.4305492640
}

frame 8 {
  0.0000000000 0.0000000000 1.0000000000 0.4999999702 -0.5000000000 0.5000000596
  -0.0000000000 0.3063463569 0.8412714005 -0.0195088703 0.6742968559 -0.7379879951
  -0.0000000038 1.3493596315 0.0000001127 0.0880178213 -0.9896442294 0.1133697331
  0.0004385422 1.5225766897 -0.4308318794 -0.3642884493 0.0050860946 -0.0037327940
  0.0587135106 0.8376621604 -0.0838606209 -0.1008248702 0.5915734172 0.3570090234
  0.0000001973 0.2429901212 -0.0000000224 -0.5417367816 -0.0028377452 0.1472468823
  -0.0607319959 0.8385646939 -0.0833462700 -0.1411096603 -0.6074060798 -0.3198060095
  0.0000000147 0.2374178469 0.0000000149 -0.4333043098 -0.0115055731 -0.1505690664
  1.4243650436 0.3662070930 0.1993640959 -0.5362118483 -0.7540787458 -0.3214914501
  0.3521845043 1.1304916143 -0.6829602718 0.6563267708 0.0892915353 0.0749626309
  0.6778910160 0.5066004395 -0.5257729888 0.6049175262 0.3186131418 -0.0212289970
  1.0032131672 0.7124264836 -0.0791824311 0.5066965818 0.4797537923 0.3287961483
  -1.4243648052 0.3662070036 0.1993650943 -0.2474053651 -0.2570627630 -0.4821826220
  -0.3742639422 1.1883361340 -0.6316663027 0.7068155408 -0.0991939828 -0.0725082308
  -0.7709286213 0.4972434044 -0.7432842255 0.7000107765 0.0979974866 -0.3840633333
  -1.1823129654 0.7737879157 -0.1767145693 -0.4984717965 0.8210217953 -0.2667490840
  -0.0000000032 0.0000002092 0.0000002309 -0.0006370454 -0.1197303385 -0.9925685525
  -0.0000000138 1.1379019022 -0.0000000731 0.3231045604 -0.0000000565 0.0000000186
  0.6527864933 0.0311189219 0.2814541757 -0.5833552480 -0.1681409627 0.0130277425
  -0.8582598567 0.0699067116 0.1534217000 -0.4887055755 0.0155159058 -0.3988135755
  1.2509075403 0.9054201245 -0.3102089167 0.2897401452 -0.1329652518 0.5486920476
  0.7993327379 0.5884540677 0.4662981927 -0.5094130635 -0.1803605258 0.1675079167
  1.2050526142 0.3537877202 0.0517247058 -0.4703258574 -0.4736672938 0.4371619225
  -1.2509074211 0.9054201841 -0.3102090061 0.5592769384 -0.7337046862 0.1928485781
  -0.8387765884 0.5570800304 0.4089460969 -0.6829276681 0.1649589837 -0.1880399436
  -1.3824956417 0.3692937493 -0.0189224519 0.2510807216 -0.4720494151 -0.4677722454
  -1.5604760647 0.4714115262 -0.2048419267 0.1714021266 0.1877507418 -0.6949636936
  -0.3113262355 1.1676925421 0.8510705829 0.0503279231 0.8769499660 0.4708791971
  -0.7304973602 0.6271790266 0.8076227307 0.1320678443 -0.5567105412 -0.8122053742
  -0.4128324389 0.2693200409 0.8360869884 0.1553050429 -0.7283890843 -0.6228541732
  -1.1699423790 0.3738548458 0.3193001747 0.3141694963 -0.6529923677 -0.6414982677
  -1.3252004385 0.9490448833 0.1225415915 0.3715421259 -0.6309404969 -0.5507364273
  1.5604760647 0.4714114666 -0.2048424035 0.7285019755 0.6537516713 -0.1854636967
  0.2655653358 1.0973488092 0.9614253640 0.1293684244 -0.7496640682 -0.6419409513
  0.6837059855 0.6596620083 0.6377034187 0.0683836564 0.6995323896 0.7001060843
  0.2537839115 0.3085299134 0.7143712044 0.0347379185 -0.8382170796 -0.5440266728
  1.1765410900 0.2931999266 0.3870300651 0.3269911110 0.4456095397 0.7071636319
  1.3428364992 1.1799490452 -0.0271924697 -0.5824699998 -0.3788263202 0.4301823080
}

frame 9 {
  0.0000000000 0.0000000000 1.0000000000 0.4999999702 -0.5000000000 0.5000000596
  -0.0000000000 0.3063463569 0.8412714005 -0.0189526342 0.6749161482 -0.7374482751
  -0.0000000028 1.3493596315 -0.0000000772 0.0855243951 -0.9900692701 0.1115535274
  0.0004260355 1.5232772827 -0.4275212586 -0.3639677167 0.0049412181 -0.0036264737
  0.0587134957 0.8376621604 -0.0838606507 -0.0970650166 0.5918982029 0.3576904237
  -0.0000004633 0.2429900765 0.0000000224 -0.5385397673 -0.0027582843 0.1431363821
  -0.0607319474 0.8385644555 -0.0833457783 -0.1367874593 -0.6076369882 -0.3210897744
  0.0000002224 0.2374177873 0.0000000000 -0.4317304790 -0.0111820977 -0.1463354230
  1.4243649244 0.3662071824 0.1993641406 -0.5393282175 -0.7517306805 -0.3199237287
  0.3515422642 1.1316386461 -0.6846383810 0.6583172083 0.0866734087 0.0727426335
  0.6800251007 0.5082094073 -0.5311669707 0.6049175262 0.3186131120 -0.0212290175
  1.0086591244 0.7140538692 -0.0811655596 0.5066965818 0.4797537327 0.3287961483
  -1.4243650436 0.3662071824 0.1993651390 -0.2477058172 -0.2585187852 -0.4870250225
  -0.3729927540 1.1878352165 -0.6348055005 0.7073346376 -0.0962808505 -0.0703625903
  -0.7709068656 0.4989997447 -0.7428994179 0.6957792044 0.0984823629 -0.3820440471
  -1.1823130846 0.7737882137 -0.1767145097 -0.4984720051 0.8210214972 -0.2667491734
  -0.0000000008 0.0000002427 0.0000000670 -0.0006186462 -0.1188880578 -0.9926831722
  -0.0000000085 1.1379022598 0.0000000739 0.3225663006 -0.0000000560 0.0000000225
  0.6533898115 0.0320067033 0.2840212584 -0.5833552480 -0.1681409329 0.0130277425
  -0.8560609221 0.0704200715 0.1563507617 -0.4899874926 0.0159424338 -0.3929437697
  1.2509074211 0.9054201841 -0.3102089167 0.2915327251 -0.1353300065 0.5497325659
  0.8016742468 0.5906168222 0.4702666998 -0.5094130635 -0.1803604960 0.1675079167
  1.2091513872 0.3545268774 0.0523689762 -0.4703257978 -0.4736672938 0.4371619225
  -1.2509074211 0.9054203033 -0.3102088869 0.5619907975 -0.7320251465 0.1922072321
  -0.8407345414 0.5600342751 0.4123001695 -0.6798202395 0.1653752178 -0.1878331155
  -1.3832358122 0.3680711687 -0.0184909105 0.2516207099 -0.4706916213 -0.4712789357
  -1.5604761839 0.4714114964 -0.2048421353 0.1738284677 0.1903615147 -0.6944856644
  -0.3113069832 1.1659356356 0.8520605564 0.0503808334 0.8745319247 0.4754174054
  -0.7305251360 0.6282718778 0.8085232973 0.1320958287 -0.5606403351 -0.8095472455
  -0.4114859998 0.2688651681 0.8378496766 0.1500797272 -0.7293949723 -0.6254441738
  -1.1730326414 0.3737687767 0.3221641779 0.3141695559 -0.6529923081 -0.6414982677
  -1.3290363550 0.9495393634 0.1242153421 0.3715420961 -0.6309406161 -0.5507364869
  1.5604763031 0.4714115262 -0.2048425525 0.7268306613 0.6542953849 -0.1884117424
  0.2655653358 1.0973489285 0.9614251256 0.1293685734 -0.7496640086 -0.6419409513
  0.6850160360 0.6597118974 0.6423404217 0.0683835298 0.6995324492 0.7001060843
  0.2564204335 0.3049398065 0.7195393443 0.0340784229 -0.8341272473 -0.5503002405
  1.1814223528 0.2957639396 0.3897110820 0.3248152137 0.4509601295 0.7066860199
  1.3465580940 1.1751153469 -0.0236378834 -0.5796736479 -0.3813189268 0.4295625985
}

frame 10 {
  0.0000000000 0.0000000000 1.0000000000 0.4999999702 -0.5000000000 0.5000000596
  -0.0000000000 0.3063463569 0.8412714005 -0.0181786250 0.6757788062 -0.7366936207
  -0.0000000045 1.3493597507 -0.0000001017 0.0820425674 -0.9906465411 0.1090165600
  0.0004086404 1.5242536068 -0.4229018092 -0.3635201454 0.0047390694 -0.0034781161
  0.0587135442 0.8376622200 -0.0838605613 -0.0918134302 0.5923370123 0.3586328030
  -0.0000001183 0.2429900765 -0.0000000373 -0.5340416431 -0.0026471484 0.1373848617
  -0.0607319511 0.8385645151 -0.0833459646 -0.1307471246 -0.6079387069 -0.3228713572
  -0.0000005248 0.2374178618 0.0000000149 -0.4295160472 -0.0107298698 -0.1404173374
  1.4243648052 0.3662071526 0.1993640810 -0.5436567664 -0.7484181523 -0.3177204132
  0.3506459892 1.1332383156 -0.6869796515 0.6610772610 0.0830153376 0.0696409047
  0.6830027699 0.5104540586 -0.5386936069 0.6049175262 0.3186131120 -0.0212290268
  1.0162578821 0.7163242698 -0.0839325339 0.5066965818 0.4797537327 0.3287961483
  -1.4243650436 0.3662070930 0.1993651241 -0.2481099814 -0.2605369389 -0.4937605560
  -0.3712188900 1.1871358156 -0.6391859055 0.7080436945 -0.0922118276 -0.0673657060
  -0.7708766460 0.5014497042 -0.7423621416 0.6897907853 0.0991506651 -0.3791813254
  -1.1823129654 0.7737880945 -0.1767145246 -0.4984720945 0.8210214376 -0.2667493522
  0.0000000003 0.0000002837 0.0000000596 -0.0005936765 -0.1177124754 -0.9928411841
  0.0000000053 1.1379019022 0.0000000420 0.3218151331 -0.0000000563 0.0000000214
  0.6542318463 0.0332453661 0.2876030803 -0.5833552480 -0.1681409627 0.0130277425
  -0.8529925346 0.0711361840 0.1604378819 -0.4917452931 0.0165375080 -0.3847135305
  1.2509074211 0.9054202437 -0.3102089167 0.2940287888 -0.1386282742 0.5511729717
  0.8049410582 0.5936343074 0.4758040011 -0.5094130635 -0.1803605258 0.1675079018
  1.2148703337 0.3555580378 0.0532677919 -0.4703258574 -0.4736672938 0.4371619225
  -1.2509073019 0.9054201245 -0.3102089465 0.5657687783 -0.7296674848 0.1913084537
  -0.8434665799 0.5641563535 0.4169800580 -0.6754595041 0.1659511179 -0.1875383407
  -1.3842688799 0.3663653135 -0.0178890787 0.2523674667 -0.4687823951 -0.4761616886
  -1.5604761839 0.4714115858 -0.2048421651 0.1772117913 0.1940019131 -0.6938024759
  -0.3112800717 1.1634840965 0.8534422517 0.0504524708 0.8711159229 0.4817346931
  -0.7305637598 0.6297966838 0.8097801208 0.1321297735 -0.5661071539 -0.8058040142
  -0.4096072912 0.2682305276 0.8403095007 0.1427470446 -0.7307069302 -0.6289871931
  -1.1773447990 0.3736486137 0.3261604607 0.3141694963 -0.6529923081 -0.6414982677
  -1.3343884945 0.9502290487 0.1265510619 0.3715421259 -0.6309406161 -0.5507364273
  1.5604763031 0.4714115858 -0.2048426270 0.7244673967 0.6550283432 -0.1925210804
  0.2655653358 1.0973490477 0.9614251852 0.1293684244 -0.7496640086 -0.6419410110
  0.6868439913 0.6597816348 0.6488108635 0.0683835447 0.6995324492 0.7001060843
  0.2600991726 0.2999306321 0.7267507911 0.0331590325 -0.8283284307 -0.5590203404
  1.1882326603 0.2993414700 0.3934523761 0.3217506409 0.4584057927 0.7059674859
  1.3517508507 1.1683708429 -0.0186777543 -0.5757528543 -0.3847882450 0.4286850095
}

frame 11 {
  0.0000000000 0.0000000000 1.0000000000 0.4999999702 -0.5000000000 0.5000000596
  -0.0000000000 0.3063463569 0.8412714005 -0.0171932168 0.6768729091 -0.7357318997
  0.0000000014 1.3493596315 -0.0000000092 0.0776132122 -0.9913533926 0.1057878584
  0.0003864481 1.5254952908 -0.4170309901 -0.3629510999 0.0044821454 -0.0032895624
  0.0587135144 0.8376622200 -0.0838605538 -0.0851306766 0.5928705931 0.3598165512
  0.0000000116 0.2429900914 0.0000000149 -0.5282625556 -0.0025054442 0.1300495416
  -0.0607319511 0.8385645151 -0.0833461881 -0.1230555326 -0.6082876921 -0.3251192570
  0.0000001532 0.2374178320 -0.0000000373 -0.4266713262 -0.0101538235 -0.1328790933
  1.4243649244 0.3662070632 0.1993640959 -0.5491247773 -0.7441473603 -0.3148930967
  0.3495069146 1.1352715492 -0.6899555922 0.6645558476 0.0783584490 0.0656922609
  0.6867870092 0.5133069754 -0.5482587218 0.6049175858 0.3186131418 -0.0212289970
  1.0259150267 0.7192095518 -0.0874491856 0.5066965818 0.4797537327 0.3287961483
  -1.4243649244 0.3662071228 0.1993651241 -0.2485979646 -0.2630785406 -0.5022832155
  -0.3689645827 1.1862468719 -0.6447528005 0.7089185715 -0.0870337710 -0.0635519922
  -0.7708380818 0.5045635104 -0.7416796684 0.6820408702 0.0999856144 -0.3754679561
  -1.1823129654 0.7737880349 -0.1767144650 -0.4984720647 0.8210215569 -0.2667493820
  0.0000000029 0.0000002165 0.0000001639 -0.0005613414 -0.1162179857 -0.9930390716
  -0.0000000232 1.1379021406 0.0000001908 0.3208600879 -0.0000000568 0.0000000177
  0.6553020477 0.0348198637 0.2921558022 -0.5833552480 -0.1681409329 0.0130277332
  -0.8490931392 0.0720463991 0.1656325907 -0.4939265549 0.0172933619 -0.3741889298
  1.2509074211 0.9054203033 -0.3102088273 0.2971920371 -0.1428175867 0.5529844165
  0.8090930581 0.5974693298 0.4828413725 -0.5094130635 -0.1803605407 0.1675079316
  1.2221386433 0.3568684757 0.0544102080 -0.4703258574 -0.4736672640 0.4371619225
  -1.2509074211 0.9054201841 -0.3102088869 0.5705555081 -0.7266473174 0.1901595443
  -0.8469386697 0.5693951249 0.4229280651 -0.6698762178 0.1666747779 -0.1871533245
  -1.3855818510 0.3641970754 -0.0171239767 0.2533051372 -0.4663313627 -0.4823493958
  -1.5604759455 0.4714114964 -0.2048420906 0.1815075576 0.1986240000 -0.6929069161
  -0.3112458289 1.1603682041 0.8551982641 0.0505400673 0.8667036891 0.4897370934
  -0.7306128740 0.6317343116 0.8113774657 0.1321643889 -0.5730262399 -0.8009904027
  -0.4072195292 0.2674237192 0.8434358835 0.1333617419 -0.7322180271 -0.6333667636
  -1.1828249693 0.3734957576 0.3312395215 0.3141694069 -0.6529923081 -0.6414983273
  -1.3411909342 0.9511056542 0.1295196563 0.3715420961 -0.6309405565 -0.5507364273
  1.5604761839 0.4714114964 -0.2048425227 0.7214109898 0.6559169292 -0.1977358460
  0.2655653656 1.0973490477 0.9614252448 0.1293685883 -0.7496640682 -0.6419408917
  0.6891670227 0.6598699689 0.6570344567 0.0683836639 0.6995323896 0.7001060843
  0.2647746801 0.2935640514 0.7359156013 0.0319790803 -0.8208056092 -0.5700420141
  1.1968882084 0.3038882613 0.3982073963 0.3178087175 0.4678319991 0.7049663067
  1.3583499193 1.1597990990 -0.0123738684 -0.5707380772 -0.3891824484 0.4275482297
}

frame 12 {
  0.0000000000 0.0000000000 1.0000000000 0.4999999702 -0.5000000000 0.5000000596
  -0.0000000000 0.3063463569 0.8412714005 -0.0160151925 0.6781782508 -0.7345776558
  0.0000000027 1.3493596315 0.0000000407 0.0723091140 -0.9921596646 0.1019195542
  0.0003599507 1.5269806385 -0.4100082815 -0.3622701764 0.0041748080 -0.0030640110
  0.0587134697 0.8376624584 -0.0838610977 -0.0771256983 0.5934732556 0.3612115085
  0.0000002068 0.2429900765 0.0000000000 -0.5212605596 -0.0023353011 0.1212406754
  -0.0607320108 0.8385646939 -0.0833462551 -0.1138350517 -0.6086540818 -0.3277834654
  -0.0000004552 0.2374178618 0.0000000140 -0.4232243299 -0.0094629712 -0.1238390207
  1.4243650436 0.3662071228 0.1993641257 -0.5556140542 -0.7389507890 -0.3114722073
  0.3481445014 1.1377040148 -0.6935152411 0.6686729789 0.0727774948 0.0609601475
  0.6913136840 0.5167195201 -0.5597006679 0.6049174666 0.3186131418 -0.0212290175
  1.0374671221 0.7226611376 -0.0916557088 0.5066965222 0.4797537625 0.3287961483
  -1.4243649244 0.3662071824 0.1993651241 -0.2491435558 -0.2660830319 -0.5124180913
  -0.3662678599 1.1851837635 -0.6514118910 0.7099265456 -0.0808308423 -0.0589834824
  -0.7707919478 0.5082885623 -0.7408629656 0.6725699306 0.1009621918 -0.3709176481
  -1.1823127270 0.7737880945 -0.1767145395 -0.4984720945 0.8210214972 -0.2667493820
  0.0000000054 0.0000002277 0.0000002309 -0.0005224348 -0.1144296378 -0.9932712317
  0.0000000130 1.1379021406 -0.0000000157 0.3197171986 -0.0000000561 0.0000000237
  0.6565819979 0.0367031544 0.2976014912 -0.5833552480 -0.1681409329 0.0130277472
  -0.8444287181 0.0731352568 0.1718461961 -0.4964567423 0.0181964617 -0.3615093827
  1.2509074211 0.9054201841 -0.3102089763 0.3009622395 -0.1478243619 0.5551222563
  0.8140596151 0.6020565033 0.4912589490 -0.5094130635 -0.1803605109 0.1675079167
  1.2308329344 0.3584361374 0.0557763875 -0.4703257978 -0.4736672640 0.4371619225
  -1.2509075403 0.9054201841 -0.3102090061 0.5762588382 -0.7229999304 0.1887761652
  -0.8510918021 0.5756618977 0.4300425351 -0.6631379724 0.1675279886 -0.1866775155
  -1.3871520758 0.3616036773 -0.0162091292 0.2544098198 -0.4633639157 -0.4897232950
  -1.5604763031 0.4714114666 -0.2048420012 0.1866394430 0.2041455209 -0.6917956471
  -0.3112049699 1.1566411257 0.8572986126 0.0506391972 0.8613227606 0.4992682040
  -0.7306717038 0.6340523958 0.8132880926 0.1321934611 -0.5812582970 -0.7951505780
  -0.4043633342 0.2664586902 0.8471755981 0.1220466569 -0.7337913513 -0.6384181380
  -1.1893801689 0.3733129203 0.3373147249 0.3141694665 -0.6529922485 -0.6414983273
  -1.3493276834 0.9521540999 0.1330705583 0.3715421259 -0.6309404969 -0.5507364273
  1.5604761839 0.4714114666 -0.2048424929 0.7176789045 0.6569151282 -0.2039617896
  0.2655653656 1.0973489285 0.9614251852 0.1293685585 -0.7496640086 -0.6419409513
  0.6919459701 0.6599757671 0.6668710709 0.0683837757 0.6995323300 0.7001061440
  0.2703674138 0.2859485745 0.7468786836 0.0305559933 -0.8115849495 -0.5831284523
  1.2072418928 0.3093269169 0.4038948715 0.3130262494 0.4790480733 0.7036395073
  1.3662441969 1.1495459080 -0.0048331115 -0.5646938086 -0.3944156468 0.4261569679
}

frame 13 {
  0.0000000000 0.0000000000 1.0000000000 0.4999999702 -0.5000000000 0.5000000596
  -0.0000000000 0.3063463569 0.8412714005 -0.0146683231 0.6796658635 -0.7332531214
  -0.0000000069 1.3493598700 -0.0000001300 0.0662393570 -0.9930284619 0.0974902064
  0.0003296135 1.5286781788 -0.4019805789 -0.3614915311 0.0038234929 -0.0028061804
  0.0587135255 0.8376622796 -0.0838610530 -0.0679624826 0.5941142440 0.3627778292
  -0.0000000447 0.2429900765 -0.0000000224 -0.5131411552 -0.0021400256 0.1111303195
  -0.0607319586 0.8385644555 -0.0833465457 -0.1032719463 -0.6090044379 -0.3307946920
  0.0000001035 0.2374178469 -0.0000000159 -0.4192264378 -0.0086711776 -0.1134784520
  1.4243648052 0.3662071526 0.1993640959 -0.5629602075 -0.7328948975 -0.3075110614
  0.3465869427 1.1404839754 -0.6975840926 0.6733192801 0.0663856566 0.0555405989
  0.6964878440 0.5206202269 -0.5727794170 0.6049175262 0.3186131418 -0.0212290287
  1.0506712198 0.7266066074 -0.0964640453 0.5066965818 0.4797537327 0.3287961483
  -1.4243648052 0.3662071824 0.1993650645 -0.2497155070 -0.2694674730 -0.5239161849
  -0.3631853461 1.1839684248 -0.6590238810 0.7110270858 -0.0737297982 -0.0537535921
  -0.7707393765 0.5125464201 -0.7399295568 0.6614838243 0.1020477563 -0.3655748665
  -1.1823126078 0.7737880945 -0.1767145544 -0.4984719753 0.8210216165 -0.2667493820
  0.0000000003 0.0000003133 0.0000000596 -0.0004787355 -0.1123846546 -0.9935304523
  -0.0000000044 1.1379020214 0.0000000265 0.3184102178 -0.0000000556 0.0000000177
  0.6580454111 0.0388557054 0.3038263619 -0.5833552480 -0.1681409627 0.0130277472
  -0.8390968442 0.0743797943 0.1789490581 -0.4992408752 0.0192267895 -0.3469033837
  1.2509074211 0.9054203033 -0.3102089763 0.3052524924 -0.1535402834 0.5575270057
  0.8197365403 0.6073001027 0.5008812547 -0.5094130635 -0.1803605407 0.1675079316
  1.2407711744 0.3602282405 0.0573384538 -0.4703257978 -0.4736672640 0.4371619225
  -1.2509074211 0.9054203033 -0.3102089167 0.5827470422 -0.7187850475 0.1871826053
  -0.8558391929 0.5828250051 0.4381749034 -0.6553583741 0.1684864759 -0.1861133426
  -1.3889474869 0.3586388826 -0.0151630621 0.2556494772 -0.4599252641 -0.4981128871
  -1.5604763031 0.4714116156 -0.2048422098 0.1924954057 0.2104457617 -0.6904720664
  -0.3111582398 1.1523809433 0.8596996665 0.0507447422 0.8550367951 0.5101031065
  -0.7307388783 0.6367022395 0.8154720664 0.1322100908 -0.5906053782 -0.7883676291
  -0.4010984898 0.2653557062 0.8514501452 0.1090080440 -0.7352720499 -0.6439321637
  -1.1968733072 0.3731041551 0.3442592323 0.3141694963 -0.6529923081 -0.6414983273
  -1.3586285114 0.9533528090 0.1371293366 0.3715421259 -0.6309404969 -0.5507364273
  1.5604761839 0.4714115858 -0.2048425972 0.7133117318 0.6579697132 -0.2110601217
  0.2655653358 1.0973489285 0.9614251256 0.1293684393 -0.7496641278 -0.6419409513
  0.6951221824 0.6600968838 0.6781150103 0.0683836564 0.6995324492 0.7001060843
  0.2767604291 0.2772436440 0.7594095469 0.0289142616 -0.8007558584 -0.5979421735
  1.2190767527 0.3155440986 0.4103957117 0.3074723482 0.4917808175 0.7019500732
  1.3752677441 1.1378260851 0.0037862440 -0.5577254295 -0.4003652930 0.4245249331
}

frame 14 {
  0.0000000000 0.0000000000 1.0000000000 0.4999999702 -0.5000000000 0.5000000596
  -0.0000000000 0.3063463569 0.8412714005 -0.0131848399 0.6812977195 -0.7317888737
  0.0000000021 1.3493596315 -0.0000000168 0.0595507510 -0.9939194322 0.0926059708
  0.0002962973 1.5305463076 -0.3931440115 -0.3606340289 0.0034367642 -0.0025223591
  0.0587134734 0.8376623988 -0.0838610455 -0.0578626171 0.5947604179 0.3644665182
  -0.0000000726 0.2429900765 -0.0000000149 -0.5040661097 -0.0019242679 0.0999574512
  -0.0607319921 0.8385647535 -0.0833465010 -0.0916196555 -0.6093052030 -0.3340660036
  0.0000003199 0.2374178469 0.0000000224 -0.4147560000 -0.0077973758 -0.1020449698
  1.4243649244 0.3662070632 0.1993641406 -0.5709537864 -0.7260887027 -0.3030906022
  0.3448725641 1.1435444355 -0.7020632029 0.6783578992 0.0593366362 0.0495638996
  0.7021834850 0.5249139071 -0.5871758461 0.6049175262 0.3186131418 -0.0212289877
  1.0652062893 0.7309493423 -0.1017567813 0.5066965818 0.4797537923 0.3287961483
  -1.4243649244 0.3662070632 0.1993651092 -0.2502806783 -0.2731284797 -0.5364563465
  -0.3597921729 1.1826307774 -0.6674029827 0.7121741176 -0.0659019426 -0.0479884259
  -0.7706813216 0.5172333717 -0.7389020324 0.6489705443 0.1032030284 -0.3595246673
  -1.1823127270 0.7737880945 -0.1767145544 -0.4984720051 0.8210214972 -0.2667492032
  -0.0000000004 0.0000003132 0.0000001676 -0.0004308448 -0.1101325601 -0.9938083887
  -0.0000000012 1.1379021406 0.0000000048 0.3169707954 -0.0000000559 0.0000000160
  0.6596561074 0.0412255377 0.3106783330 -0.5833552480 -0.1681409180 0.0130277518
  -0.8332276344 0.0757497400 0.1867675483 -0.5021693110 0.0203575883 -0.3306984603
  1.2509075403 0.9054201245 -0.3102089167 0.3099502921 -0.1598220319 0.5601252913
  0.8259856701 0.6130722165 0.5114729404 -0.5094130635 -0.1803605407 0.1675079167
  1.2517107725 0.3622008562 0.0590577051 -0.4703257978 -0.4736672640 0.4371619225
  -1.2509074211 0.9054201245 -0.3102089167 0.5898494124 -0.7140899897 0.1854137480
  -0.8610650897 0.5907101631 0.4471269548 -0.6467020512 0.1695203036 -0.1854675263
  -1.3909237385 0.3553756475 -0.0140116857 0.2569852173 -0.4560834169 -0.5072965026
  -1.5604760647 0.4714115560 -0.2048420310 0.1989271939 0.2173652947 -0.6889497042
  -0.3111067116 1.1476910114 0.8623425364 0.0508522578 0.8479527235 0.5219504833
  -0.7308127284 0.6396187544 0.8178761601 0.1322080642 -0.6008125544 -0.7807711363
  -0.3975045681 0.2641413808 0.8561556935 0.0945465788 -0.7365030646 -0.6496684551
  -1.2051216364 0.3728741407 0.3519034982 0.3141694665 -0.6529922485 -0.6414983273
  -1.3688665628 0.9546720386 0.1415973306 0.3715421259 -0.6309404969 -0.5507364273
  1.5604760647 0.4714115858 -0.2048424482 0.7083813548 0.6590234637 -0.2188465595
  0.2655653358 1.0973489285 0.9614251256 0.1293684244 -0.7496641278 -0.6419408917
  0.6986187696 0.6602299213 0.6904919744 0.0683836490 0.6995323896 0.7001060843
  0.2837976813 0.2676611543 0.7732036114 0.0270913485 -0.7884882092 -0.6140520573
  1.2321041822 0.3223876357 0.4175520241 0.3012558222 0.5056762695 0.6998774409
  1.3852005005 1.1249248981 0.0132745523 -0.5499839187 -0.4068724811 0.4226774275
}

frame 15 {
  0.0000000000 0.0000000000 1.0000000000 0.4999999702 -0.5000000000 0.5000000596
  -0.0000000000 0.3063463569 0.8412714005 -0.0116057331 0.6830280423 -0.7302231789
  0.0000000005 1.3493596315 0.0000000511 0.0524250008 -0.9947921634 0.0873987824
  0.0002608031 1.5325353146 -0.3837389648 -0.3597209752 0.0030251341 -0.0022202702
  0.0587134920 0.8376619220 -0.0838609636 -0.0471010506 0.5953795314 0.3662224710
  -0.0000001183 0.2429901212 0.0000000522 -0.4942559302 -0.0016938623 0.0880244821
  -0.0607319772 0.8385643959 -0.0833462924 -0.0791947767 -0.6095275283 -0.3374961913
  -0.0000000808 0.2374178022 0.0000000261 -0.4099199772 -0.0068652518 -0.0898486897
  1.4243649244 0.3662071824 0.1993640512 -0.5793500543 -0.7186869383 -0.2983184755
  0.3430477977 1.1468018293 -0.7068306208 0.6836314201 0.0518218614 0.0431923904
  0.7082455754 0.5294840336 -0.6024988294 0.6049174666 0.3186131418 -0.0212290082
  1.0806760788 0.7355717421 -0.1073902100 0.5066965818 0.4797537327 0.3287961483
  -1.4243650436 0.3662071228 0.1993650496 -0.2508072257 -0.2769471407 -0.5496572852
  -0.3561806679 1.1812071800 -0.6763213873 0.7133204341 -0.0575598590 -0.0418446139
  -0.7706197500 0.5222219229 -0.7378086448 0.6353110671 0.1043849066 -0.3528979421
  -1.1823128462 0.7737880945 -0.1767146140 -0.4984719753 0.8210216165 -0.2667493820
  -0.0000000031 0.0000003504 0.0000002123 -0.0003796335 -0.1077345237 -0.9940957427
  0.0000000033 1.1379020214 0.0000000567 0.3154378533 -0.0000000560 0.0000000170
  0.6613705754 0.0437472723 0.3179715574 -0.5833552480 -0.1681409329 0.0130277518
  -0.8269806504 0.0772077590 0.1950893849 -0.5051257610 0.0215560626 -0.3133198619
  1.2509074211 0.9054201245 -0.3102089167 0.3149201274 -0.1664940864 0.5628334284
  0.8326368928 0.6192155480 0.5227463245 -0.5094130635 -0.1803605109 0.1675079018
  1.2633544207 0.3643002510 0.0608876199 -0.4703258574 -0.4736672938 0.4371619225
  -1.2509074211 0.9054202437 -0.3102088571 0.5973609686 -0.7090301514 0.1835144758
  -0.8666270971 0.5991026759 0.4566548169 -0.6373856664 0.1705958098 -0.1847517788
  -1.3930268288 0.3519021869 -0.0127862338 0.2583730221 -0.4519307911 -0.5170080066
  -1.5604764223 0.4714115858 -0.2048419863 0.2057545036 0.2247099578 -0.6872544289
  -0.3110519946 1.1426993608 0.8651557565 0.0509555899 0.8402277827 0.5344604254
  -0.7308915854 0.6427233219 0.8204350471 0.1321820468 -0.6115766168 -0.7725400925
  -0.3936793804 0.2628490031 0.8611643314 0.0790552348 -0.7373474836 -0.6553758979
  -1.2139009237 0.3726294637 0.3600399792 0.3141694963 -0.6529923081 -0.6414983273
  -1.3797637224 0.9560763240 0.1463528275 0.3715421259 -0.6309406161 -0.5507364273
  1.5604763031 0.4714116156 -0.2048425078 0.7029950619 0.6600201130 -0.2270986289
  0.2655653656 1.0973490477 0.9614253044 0.1293684095 -0.7496640682 -0.6419409513
  0.7023402452 0.6603716612 0.7036655545 0.0683836490 0.6995323896 0.7001060843
  0.2912878692 0.2574622929 0.7878851891 0.0251346156 -0.7750456333 -0.6309484243
  1.2459702492 0.3296717703 0.4251688719 0.2945262790 0.5203120112 0.6974273920
  1.3957726955 1.1111942530 0.0233733170 -0.5416655540 -0.4137471616 0.4206529260
}

frame 16 {
  0.0000000000 0.0000000000 1.0000000000 0.4999999702 -0.5000000000 0.5000000596
  -0.0000000000 0.3063463569 0.8412714005 -0.0099773090 0.6848051548 -0.7286010981
  0.0000000036 1.3493596315 -0.0000000672 0.0450711511 -0.9956103563 0.0820208490
  0.0002241965 1.5345864296 -0.3740399480 -0.3587788343 0.0026006477 -0.0019087349
  0.0587135255 0.8376621008 -0.0838608146 -0.0359947346 0.5959435105 0.3679877520
  0.0000001797 0.2429900765 -0.0000000075 -0.4839842916 -0.0014556190 0.0756850019
  -0.0607319660 0.8385643959 -0.0833462775 -0.0663636252 -0.6096506119 -0.3409759402
  -0.0000002231 0.2374178320 -0.0000000149 -0.4048514068 -0.0059023104 -0.0772492290
  1.4243648052 0.3662070930 0.1993641257 -0.5878816843 -0.7108888030 -0.2933278680
  0.3411659896 1.1501607895 -0.7117464542 0.6889705658 0.0440624580 0.0366136059
  0.7144967914 0.5341967344 -0.6182997823 0.6049175262 0.3186131120 -0.0212290473
  1.0966291428 0.7403383255 -0.1131993383 0.5066965818 0.4797537327 0.3287961483
  -1.4243648052 0.3662071824 0.1993651390 -0.2512684464 -0.2807970047 -0.5630993843
  -0.3524562120 1.1797385216 -0.6855182052 0.7144216299 -0.0489487909 -0.0355027691
  -0.7705559731 0.5273664594 -0.7366808057 0.6208763719 0.1055501625 -0.3458715379
  -1.1823128462 0.7737880349 -0.1767145544 -0.4984720349 0.8210217357 -0.2667486966
  -0.0000000002 0.0000001902 0.0000001490 -0.0003255772 -0.1052604690 -0.9943825603
  0.0000000054 1.1379020214 0.0000000129 0.3138562143 -0.0000000568 0.0000000197
  0.6631383896 0.0463484377 0.3254922628 -0.5833552480 -0.1681409180 0.0130277378
  -0.8205385804 0.0787113085 0.2036707848 -0.5079975724 0.0227852277 -0.2952749133
  1.2509075403 0.9054202437 -0.3102089167 0.3200109303 -0.1733573079 0.5655634403
  0.8394956589 0.6255508065 0.5343716741 -0.5094130635 -0.1803605258 0.1675079018
  1.2753617764 0.3664653897 0.0627747029 -0.4703258574 -0.4736672640 0.4371619225
  -1.2509074211 0.9054202437 -0.3102089465 0.6050534248 -0.7037459016 0.1815387607
  -0.8723628521 0.6077575088 0.4664804339 -0.6276713014 0.1716774553 -0.1839832962
  -1.3951959610 0.3483203053 -0.0115224877 0.2597669065 -0.4475813508 -0.5269503593
  -1.5604761839 0.4714115262 -0.2048421055 0.2127725482 0.2322593629 -0.6854257584
  -0.3109954894 1.1375520229 0.8680565953 0.0510510169 0.8320662379 0.5472451448
  -0.7309727073 0.6459246278 0.8230737448 0.1321295947 -0.6225624681 -0.7638990879
  -0.3897346854 0.2615160644 0.8663290739 0.0630044714 -0.7377106547 -0.6608173251
  -1.2229540348 0.3723769188 0.3684300780 0.3141695857 -0.6529923677 -0.6414982677
  -1.3910011053 0.9575244188 0.1512567252 0.3715421557 -0.6309406161 -0.5507364273
  1.5604763031 0.4714115262 -0.2048425525 0.6972932220 0.6609124541 -0.2355651855
  0.2655653656 1.0973489285 0.9614251256 0.1293684244 -0.7496640086 -0.6419411302
  0.7061778903 0.6605176926 0.7172503471 0.0683836490 0.6995323896 0.7001061440
  0.2990118861 0.2469446510 0.8030251861 0.0231039226 -0.7607852817 -0.6480757594
  1.2602689266 0.3371831179 0.4330232441 0.2874717414 0.5352221131 0.6946389675
  1.4066747427 1.0970343351 0.0337873250 -0.5330060124 -0.4207782745 0.4185033143
}

frame 17 {
  0.0000000000 0.0000000000 1.0000000000 0.4999999702 -0.5000000000 0.5000000596
  -0.0000000000 0.3063463569 0.8412714005 -0.0083488757 0.6865751147 -0.7269710302
  -0.0000000006 1.3493596315 0.0000000197 0.0377135649 -0.9963452220 0.0766360685
  0.0001875683 1.5366374254 -0.3643409610 -0.3578363061 0.0021761553 -0.0015972046
  0.0587135032 0.8376622796 -0.0838612542 -0.0248839017 0.5964316130 0.3697062433
  0.0000002319 0.2429900914 -0.0000000075 -0.4735645950 -0.0012169342 0.0633223578
  -0.0607319735 0.8385645747 -0.0833466053 -0.0535207428 -0.6096656919 -0.3443953395
  -0.0000002114 0.2374177873 0.0000000150 -0.3997030556 -0.0049381834 -0.0646345690
  1.4243648052 0.3662071526 0.1993641257 -0.5962785482 -0.7029279470 -0.2882702649
  0.3392842412 1.1535201073 -0.7166628838 0.6942067146 0.0362965055 0.0300293714
  0.7207480669 0.5389094353 -0.6341010928 0.6049174666 0.3186131120 -0.0212290175
  1.1125822067 0.7451049685 -0.1190085486 0.5066965818 0.4797537923 0.3287961483
  -1.4243649244 0.3662071228 0.1993651390 -0.2516461313 -0.2845534384 -0.5763542056
  -0.3487319052 1.1782705784 -0.6947149634 0.7154402733 -0.0403320529 -0.0291568171
  -0.7704924345 0.5325108171 -0.7355531454 0.6061099768 0.1066590399 -0.3386604488
  -1.1823127270 0.7737880945 -0.1767145693 -0.4984720349 0.8210216761 -0.2667488754
  0.0000000001 0.0000002125 0.0000001788 -0.0002723732 -0.1027854830 -0.9946600795
  0.0000000045 1.1379020214 -0.0000000106 0.3122737408 -0.0000000558 0.0000000176
  0.6649063826 0.0489495397 0.3330132663 -0.5833552480 -0.1681409329 0.0130277425
  -0.8140965104 0.0802152529 0.2122526914 -0.5106864572 0.0240062028 -0.2771236897
  1.2509074211 0.9054201841 -0.3102089763 0.3250650764 -0.1802007258 0.5682289004
  0.8463546634 0.6318860054 0.5459970832 -0.5094130635 -0.1803605109 0.1675079018
  1.2873688936 0.3686302900 0.0646617860 -0.4703258574 -0.4736672640 0.4371619225
  -1.2509075403 0.9054200649 -0.3102089763 0.6126893759 -0.6983957291 0.1795459837
  -0.8780986667 0.6164119840 0.4763058424 -0.6178531051 0.1727306545 -0.1831844151
  -1.3973647356 0.3447383046 -0.0102587547 0.2611223757 -0.4431656897 -0.5368148088
  -1.5604761839 0.4714114666 -0.2048420310 0.2197654694 0.2397814542 -0.6835160255
  -0.3109389544 1.1324043274 0.8709575534 0.0511339977 0.8237121105 0.5599030256
  -0.7310538888 0.6491259933 0.8257126212 0.1320511550 -0.6334256530 -0.7551075220
  -0.3857899606 0.2601832747 0.8714938164 0.0469095185 -0.7375568748 -0.6657953262
  -1.2320072651 0.3721245229 0.3768205345 0.3141694367 -0.6529923081 -0.6414982677
  -1.4022383690 0.9589723945 0.1561607420 0.3715421259 -0.6309405565 -0.5507364869
  1.5604761839 0.4714114964 -0.2048425525 0.6914457083 0.6616663933 -0.2439825684
  0.2655654252 1.0973489285 0.9614252448 0.1293685883 -0.7496640682 -0.6419409513
  0.7100155354 0.6606637836 0.7308351994 0.0683835298 0.6995323300 0.7001060843
  0.3067360222 0.2364271581 0.8181651235 0.0210585278 -0.7461411357 -0.6648764610
  1.2745676041 0.3446945250 0.4408776462 0.2803083360 0.5499295592 0.6915877461
  1.4175769091 1.0828747749 0.0442016199 -0.5242676139 -0.4277471304 0.4162917733
}

frame 18 {
  0.0000000000 0.0000000000 1.0000000000 0.4999999702 -0.5000000000 0.5000000596
  -0.0000000000 0.3063463569 0.8412714005 -0.0067697135 0.6882844567 -0.7253830433
  -0.0000000013 1.3493596315 0.0000000247 0.0305769499 -0.9969781041 0.0714091137
  0.0001520713 1.5386261940 -0.3549358249 -0.3569217920 0.0017645194 -0.0012951072
  0.0587135069 0.8376621604 -0.0838608146 -0.0141091654 0.5968323350 0.3713273108
  0.0000000205 0.2429900616 -0.0000000121 -0.4633281827 -0.0009852463 0.0513227768
  -0.0607319660 0.8385645747 -0.0833461732 -0.0410621203 -0.6095773578 -0.3476518393
  -0.0000001253 0.2374177575 -0.0000000224 -0.3946373165 -0.0040027085 -0.0523944832
  1.4243650436 0.3662070930 0.1993640959 -0.6042873859 -0.6950578094 -0.2833049595
  0.3374594748 1.1567775011 -0.7214301229 0.6991837621 0.0287627652 0.0236421209
  0.7268100977 0.5434795022 -0.6494238377 0.6049175262 0.3186131418 -0.0212290287
  1.1280522346 0.7497270107 -0.1246417761 0.5066965818 0.4797537327 0.3287961483
  -1.4243649244 0.3662070930 0.1993651241 -0.2519323230 -0.2881035507 -0.5890165567
  -0.3451203406 1.1768466234 -0.7036333680 0.7163488865 -0.0319737419 -0.0230012368
  -0.7704308033 0.5374993682 -0.7344596386 0.5914970040 0.1076788604 -0.3315024972
  -1.1823127270 0.7737880945 -0.1767145246 -0.4984721541 0.8210216165 -0.2667490244
  0.0000000005 0.0000002497 0.0000001416 -0.0002208685 -0.1003845707 -0.9949201345
  -0.0000000057 1.1379021406 -0.0000000313 0.3107383549 -0.0000000561 0.0000000177
  0.6666207910 0.0514713153 0.3403063416 -0.5833553076 -0.1681409180 0.0130277518
  -0.8078495860 0.0816732794 0.2205745429 -0.5131165981 0.0251811091 -0.2594393194
  1.2509074211 0.9054202437 -0.3102088571 0.3299295902 -0.1868157685 0.5707509518
  0.8530058265 0.6380294561 0.5572703481 -0.5094130635 -0.1803605258 0.1675079167
  1.2990125418 0.3707297444 0.0664917454 -0.4703257978 -0.4736672640 0.4371619225
  -1.2509075403 0.9054202437 -0.3102089465 0.6200377345 -0.6931461692 0.1775978059
  -0.8836606741 0.6248046160 0.4858339131 -0.6082376838 0.1737243086 -0.1823809594
  -1.3994684219 0.3412649632 -0.0090333009 0.2623995245 -0.4388224483 -0.5463019013
  -1.5604761839 0.4714115262 -0.2048420310 0.2265201956 0.2470468879 -0.6815873981
  -0.3108842075 1.1274129152 0.8737705350 0.0512041189 0.8154324889 0.5720481277
  -0.7311325073 0.6522304416 0.8282713294 0.1319499761 -0.6438368559 -0.7464436293
  -0.3819648027 0.2588909864 0.8765021563 0.0312919244 -0.7369150519 -0.6701713204
  -1.2407861948 0.3718797565 0.3849565685 0.3141694069 -0.6529922485 -0.6414983273
  -1.4131350517 0.9603766203 0.1609160453 0.3715420961 -0.6309404969 -0.5507364273
  1.5604763031 0.4714115262 -0.2048424929 0.6856394410 0.6622653008 -0.2520928681
  0.2655653656 1.0973490477 0.9614252448 0.1293687522 -0.7496640086 -0.6419409513
  0.7137368917 0.6608055830 0.7440084219 0.0683835372 0.6995323896 0.7001060843
  0.3142261505 0.2262282819 0.8328465223 0.0190697797 -0.7315956354 -0.6808324456
  1.2884331942 0.3519786894 0.4484941661 0.2732659876 0.5639824271 0.6883813143
  1.4281487465 1.0691438913 0.0543002635 -0.5157220364 -0.4344424903 0.4140889347
}

frame 19 {
  0.0000000000 0.0000000000 1.0000000000 0.4999999702 -0.5000000000 0.5000000596
  -0.0000000000 0.3063463569 0.8412714005 -0.0052860309 0.6898841262 -0.7238844633
  -0.0000000001 1.3493596315 -0.0000000739 0.0238716900 -0.9975010753 0.0664945692
  0.0001187275 1.5404946804 -0.3460992873 -0.3560622633 0.0013777732 -0.0010112765
  0.0587134995 0.8376623392 -0.0838609636 -0.0039890776 0.5971435905 0.3728091717
  0.0000000168 0.2429901361 0.0000000056 -0.4536001086 -0.0007675519 0.0400478318
  -0.0607319735 0.8385645151 -0.0833462775 -0.0293580275 -0.6094021797 -0.3506568670
  0.0000003707 0.2374178469 0.0000000075 -0.3898147345 -0.0031237516 -0.0408938602
  1.4243648052 0.3662071228 0.1993640959 -0.6116875410 -0.6875337958 -0.2785880268
  0.3357450068 1.1598378420 -0.7259091735 0.7037679553 0.0216847174 0.0176413078
  0.7325055599 0.5477731824 -0.6638199687 0.6049174666 0.3186131418 -0.0212290082
  1.1425867081 0.7540698051 -0.1299345046 0.5066965818 0.4797537923 0.3287961483
  -1.4243650436 0.3662070930 0.1993650496 -0.2521293759 -0.2913531959 -0.6007316113
  -0.3417271674 1.1755088568 -0.7120122313 0.7171313167 -0.0241209082 -0.0172179714
  -0.7703727484 0.5421863794 -0.7334319949 0.5775247216 0.1085860506 -0.3246394098
  -1.1823128462 0.7737880945 -0.1767145544 -0.4984720647 0.8210216165 -0.2667490244
  0.0000000005 0.0000002161 0.0000001378 -0.0001724784 -0.0981280655 -0.9951563478
  -0.0000000020 1.1379020214 -0.0000000693 0.3092950583 -0.0000000563 0.0000000176
  0.6682315469 0.0538408980 0.3471584022 -0.5833552480 -0.1681409627 0.0130277658
  -0.8019803762 0.0830429420 0.2283930331 -0.5152390599 0.0262757689 -0.2427660972
  1.2509073019 0.9054201245 -0.3102090657 0.3344658315 -0.1930099428 0.5730636716
  0.8592548370 0.6438014507 0.5678618550 -0.5094130635 -0.1803605258 0.1675079167
  1.3099520206 0.3727024794 0.0682109520 -0.4703258574 -0.4736672938 0.4371619225
  -1.2509075403 0.9054202437 -0.3102090359 0.6268897057 -0.6881601214 0.1757537723
  -0.8888864517 0.6326896548 0.4947856367 -0.5991230011 0.1746327877 -0.1816008240
  -1.4014444351 0.3380017579 -0.0078820065 0.2635656595 -0.4346884191 -0.5551415086
  -1.5604760647 0.4714114666 -0.2048421055 0.2328409553 0.2538451254 -0.6797071695
  -0.3108327091 1.1227228642 0.8764134645 0.0512586348 0.8074983358 0.5833360553
  -0.7312065363 0.6551470160 0.8306754827 0.1318332702 -0.6535031199 -0.7381836772
  -0.3783708811 0.2576766014 0.8812075257 0.0166368820 -0.7358738780 -0.6738724113
  -1.2490344048 0.3716497421 0.3926008344 0.3141693771 -0.6529923081 -0.6414982677
  -1.4233732224 0.9616958499 0.1653839499 0.3715421259 -0.6309404969 -0.5507364869
  1.5604763031 0.4714114964 -0.2048425972 0.6800658107 0.6627089381 -0.2596620023
  0.2655653656 1.0973488092 0.9614251852 0.1293685883 -0.7496641278 -0.6419408917
  0.7172333598 0.6609385610 0.7563854456 0.0683837831 0.6995324492 0.7001060247
  0.3212634027 0.2166457772 0.8466400504 0.0171956606 -0.7176397443 -0.6955037117
  1.3014603853 0.3588221073 0.4556501508 0.2665700614 0.5769853592 0.6851504445
  1.4380817413 1.0562431812 0.0637883246 -0.5076323152 -0.4406745434 0.4119679928
}

frame 20 {
  0.0000000000 0.0000000000 1.0000000000 0.4999999702 -0.5000000000 0.5000000596
  -0.0000000000 0.3063463569 0.8412714005 -0.0039382186 0.6913318634 -0.7225176692
  -0.0000000020 1.3493597507 -0.0000000130 0.0177814197 -0.9979159832 0.0620278269
  0.0000884344 1.5421919823 -0.3380717635 -0.3552810848 0.0010264372 -0.0007534302
  0.0587135106 0.8376621008 -0.0838612169 0.0051990575 0.5973716378 0.3741204739
  -0.0000000279 0.2429901063 0.0000000224 -0.4446766973 -0.0005698865 0.0298118312
  -0.0607319660 0.8385644555 -0.0833466798 -0.0187311061 -0.6091657877 -0.3533399403
  -0.0000001034 0.2374178767 0.0000000168 -0.3853828609 -0.0023256028 -0.0304505751
  1.4243648052 0.3662070930 0.1993642002 -0.6183021069 -0.6805934906 -0.2742623985
  0.3341875672 1.1626179218 -0.7299779654 0.7078537941 0.0152571006 0.0121920155
  0.7376796603 0.5516738892 -0.6768983603 0.6049175858 0.3186131418 -0.0212289970
  1.1557906866 0.7580150366 -0.1347426921 0.5066965818 0.4797537923 0.3287961483
  -1.4243648052 0.3662071228 0.1993651092 -0.2522481382 -0.2942311466 -0.6112140417
  -0.3386446536 1.1742937565 -0.7196241617 0.7177821994 -0.0169891156 -0.0119657693
  -0.7703201175 0.5464442968 -0.7324985862 0.5646450520 0.1093667075 -0.3182974458
  -1.1823128462 0.7737880945 -0.1767144948 -0.4984719753 0.8210216165 -0.2667490244
  0.0000000001 0.0000002925 0.0000001378 -0.0001285194 -0.0960775912 -0.9953641891
  -0.0000000005 1.1379020214 -0.0000000286 0.3079833090 -0.0000000563 0.0000000174
  0.6696947813 0.0559937283 0.3533831537 -0.5833552480 -0.1681409627 0.0130277472
  -0.7966485620 0.0842875391 0.2354956716 -0.5170311928 0.0272616614 -0.2275837064
  1.2509074211 0.9054201841 -0.3102090359 0.3385569453 -0.1986180097 0.5751164556
  0.8649317622 0.6490449309 0.5774838328 -0.5094130635 -0.1803605258 0.1675079167
  1.3198899031 0.3744944334 0.0697728544 -0.4703258574 -0.4736672938 0.4371619225
  -1.2509075403 0.9054201841 -0.3102090359 0.6330694556 -0.6835862994 0.1740677506
  -0.8936338425 0.6398528814 0.5029180050 -0.5907784700 0.1754366755 -0.1808710396
  -1.4032397270 0.3350369036 -0.0068359929 0.2645962834 -0.4308895171 -0.5631069541
  -1.5604763031 0.4714115560 -0.2048420161 0.2385598272 0.2599958479 -0.6779423356
  -0.3107859790 1.1184628010 0.8788142800 0.0513006151 0.8001648784 0.5934820771
  -0.7312735915 0.6577968597 0.8328594565 0.1317083538 -0.6621835828 -0.7305830121
  -0.3751060367 0.2565735579 0.8854824305 0.0033604761 -0.7345649600 -0.6768875122
  -1.2565277815 0.3714409173 0.3995454013 0.3141694963 -0.6529923081 -0.6414983273
  -1.4326742887 0.9628944993 0.1694428474 0.3715420663 -0.6309405565 -0.5507364869
  1.5604763031 0.4714115560 -0.2048425227 0.6749056578 0.6630122662 -0.2664920390
  0.2655653358 1.0973490477 0.9614253044 0.1293685734 -0.7496640086 -0.6419410110
  0.7204096913 0.6610596776 0.7676292658 0.0683836564 0.6995323300 0.7001060843
  0.3276563287 0.2079408765 0.8591711521 0.0154908570 -0.7047348619 -0.7085486650
  1.3132953644 0.3650392294 0.4621511698 0.2604263723 0.5886197090 0.6820355058
  1.4471050501 1.0445234776 0.0724078417 -0.5002344847 -0.4462851286 0.4099987447
}

frame 21 {
  0.0000000000 0.0000000000 1.0000000000 0.4999999702 -0.5000000000 0.5000000596
  -0.0000000000 0.3063463569 0.8412714005 -0.0027591677 0.6925942898 -0.7213177085
  0.0000000001 1.3493596315 -0.0000000365 0.0124551719 -0.9982320070 0.0581191555
  0.0000619248 1.5436769724 -0.3310490847 -0.3545973897 0.0007190803 -0.0005278634
  0.0587135069 0.8376622200 -0.0838607103 0.0132309133 0.5975283384 0.3752401173
  0.0000001604 0.2429900914 0.0000000522 -0.4368078709 -0.0003971673 0.0208674520
  -0.0607319698 0.8385644555 -0.0833460689 -0.0094417911 -0.6088989377 -0.3556498289
  0.0000002992 0.2374178320 0.0000000112 -0.3814675808 -0.0016279088 -0.0213212483
  1.4243649244 0.3662071526 0.1993641257 -0.6240022779 -0.6744427681 -0.2704478502
  0.3328250349 1.1650502682 -0.7335377932 0.7113660574 0.0096374927 0.0074278004
  0.7422061563 0.5550861955 -0.6883398890 0.6049175262 0.3186131418 -0.0212290380
  1.1673420668 0.7614665627 -0.1389490813 0.5066965818 0.4797537923 0.3287961483
  -1.4243649244 0.3662071228 0.1993651241 -0.2523052096 -0.2966897786 -0.6202539802
  -0.3359480202 1.1732304096 -0.7262833714 0.7183047533 -0.0107529890 -0.0073731979
  -0.7702739835 0.5501691103 -0.7316821814 0.5532442927 0.1100152358 -0.3126719296
  -1.1823128462 0.7737880349 -0.1767145097 -0.4984718263 0.8210216761 -0.2667490542
  -0.0000000006 0.0000001863 0.0000001118 -0.0000900646 -0.0942833498 -0.9955406785
  -0.0000000002 1.1379020214 -0.0000000180 0.3068353236 -0.0000000562 0.0000000181
  0.6709749103 0.0578770265 0.3588286936 -0.5833552480 -0.1681409627 0.0130277425
  -0.7919840217 0.0853764564 0.2417092472 -0.5184922814 0.0281168781 -0.2142829895
  1.2509075403 0.9054202437 -0.3102089167 0.3421120048 -0.2035081834 0.5768742561
  0.8698980808 0.6536319852 0.5859014988 -0.5094130635 -0.1803605407 0.1675079018
  1.3285843134 0.3760620058 0.0711392984 -0.4703258574 -0.4736672938 0.4371619225
  -1.2509074211 0.9054202437 -0.3102089465 0.6384394765 -0.6795512438 0.1725843698
  -0.8977869153 0.6461194754 0.5100327730 -0.5834304690 0.1761230677 -0.1802164614
  -1.4048100710 0.3324433565 -0.0059208982 0.2654752433 -0.4275332987 -0.5700229406
  -1.5604763031 0.4714115262 -0.2048421055 0.2435437441 0.2653557956 -0.6763545275
  -0.3107450604 1.1147354841 0.8809149265 0.0513302535 0.7936541438 0.6022698879
  -0.7313324809 0.6601148248 0.8347702622 0.1315849274 -0.6696963906 -0.7238606811
  -0.3722498417 0.2556084692 0.8892219067 -0.0082097361 -0.7331409454 -0.6792536378
  -1.2630828619 0.3712580800 0.4056205153 0.3141695261 -0.6529922485 -0.6414983273
  -1.4408110380 0.9639429450 0.1729936451 0.3715421259 -0.6309404969 -0.5507364273
  1.5604763031 0.4714114964 -0.2048425525 0.6703180075 0.6631997228 -0.2724290788
  0.2655653656 1.0973490477 0.9614251852 0.1293684244 -0.7496640086 -0.6419410706
  0.7231885195 0.6611654162 0.7774657011 0.0683836490 0.6995323300 0.7001060843
  0.3332490921 0.2003253698 0.8701336980 0.0139998971 -0.6932803392 -0.7197309136
  1.3236488104 0.3704779744 0.4678384960 0.2550084591 0.5986523032 0.6791729927
  1.4549989700 1.0342706442 0.0799483508 -0.4937267601 -0.4511523843 0.4082435369
}

frame 22 {
  0.0000000000 0.0000000000 1.0000000000 0.4999999702 -0.5000000000 0.5000000596
  -0.0000000000 0.3063463569 0.8412714005 -0.0017735491 0.6936466098 -0.7203115225
  -0.0000000001 1.3493597507 -0.0000000133 0.0080042584 -0.9984624386 0.0548512079
  0.0000397646 1.5449188948 -0.3251783550 -0.3540257215 0.0004621390 -0.0003392940
  0.0587135032 0.8376621008 -0.0838607848 0.0199397858 0.5976288319 0.3761563897
  -0.0000002325 0.2429901212 0.0000000298 -0.4301881492 -0.0002529614 0.0134007456
  -0.0607319660 0.8385643363 -0.0833462402 -0.0016833422 -0.6086330414 -0.3575537801
  0.0000000007 0.2374178469 -0.0000000224 -0.3781682253 -0.0010452132 -0.0136963176
  1.4243649244 0.3662071228 0.1993640512 -0.6287043095 -0.6692462564 -0.2672384679
  0.3316860795 1.1670837402 -0.7365137935 0.7142571211 0.0049430970 0.0034480100
  0.7459903955 0.5579392314 -0.6979051828 0.6049175262 0.3186131716 -0.0212290473
  1.1769992113 0.7643520236 -0.1424657404 0.5066965818 0.4797537327 0.3287961483
  -1.4243650436 0.3662071526 0.1993650794 -0.2523195446 -0.2987020314 -0.6277150512
  -0.3336936831 1.1723418236 -0.7318504453 0.7187080979 -0.0055426727 -0.0035361079
  -0.7702355981 0.5532830954 -0.7309997678 0.5436263084 0.1105325893 -0.3079177141
  -1.1823129654 0.7737881541 -0.1767146438 -0.4984718859 0.8210215569 -0.2667492032
  0.0000000000 0.0000003185 0.0000001974 -0.0000579185 -0.0927831382 -0.9956843853
  -0.0000000018 1.1379019022 -0.0000000735 0.3058752418 -0.0000000564 0.0000000181
  0.6720449328 0.0594511963 0.3633812666 -0.5833552480 -0.1681409329 0.0130277472
  -0.7880846262 0.0862868503 0.2469038516 -0.5196372867 0.0288263168 -0.2031562775
  1.2509074211 0.9054201841 -0.3102089763 0.3450663686 -0.2075842917 0.5783163905
  0.8740499616 0.6574667692 0.5929386020 -0.5094130635 -0.1803605407 0.1675079167
  1.3358522654 0.3773725033 0.0722815245 -0.4703257978 -0.4736672640 0.4371619225
  -1.2509073019 0.9054201841 -0.3102089763 0.6429023147 -0.6761544347 0.1713383496
  -0.9012588263 0.6513580680 0.5159801245 -0.5772549510 0.1766846776 -0.1796578616
  -1.4061230421 0.3302752674 -0.0051560150 0.2661937177 -0.4247046113 -0.5757659078
  -1.5604761839 0.4714115858 -0.2048420012 0.2476957887 0.2698210180 -0.6749960184
  -0.3107108772 1.1116197109 0.8826708794 0.0513505340 0.7881454825 0.6095509529
  -0.7313815951 0.6620526314 0.8363673687 0.1314711720 -0.6759169698 -0.7181906104
  -0.3698620796 0.2548018396 0.8923484087 -0.0178429708 -0.7317541838 -0.6810377240
  -1.2685630322 0.3711053431 0.4106994569 0.3141694963 -0.6529923081 -0.6414983273
  -1.4476130009 0.9648196101 0.1759621054 0.3715420365 -0.6309405565 -0.5507364273
  1.5604763031 0.4714115858 -0.2048424780 0.6664314866 0.6633009911 -0.2773635983
  0.2655653954 1.0973490477 0.9614251256 0.1293685883 -0.7496640086 -0.6419410110
  0.7255114317 0.6612538695 0.7856889963 0.0683835372 0.6995323300 0.7001060843
  0.3379245698 0.1939591020 0.8792985678 0.0127540054 -0.6835941672 -0.7289092541
  1.3323041201 0.3750247955 0.4725931585 0.2504506111 0.6069313288 0.6766833067
  1.4615983963 1.0256992579 0.0862522498 -0.4882618189 -0.4551910758 0.4067532420
}

frame 23 {
  0.0000000000 0.0000000000 1.0000000000 0.4999999702 -0.5000000000 0.5000000596
  -0.0000000000 0.3063463569 0.8412714005 -0.0009980839 0.6944726110 -0.7195178866
  -0.0000000000 1.3493596315 -0.0000000092 0.0045035528 -0.9986223578 0.0522798710
  0.0000223318 1.5458955765 -0.3205590248 -0.3535757661 0.0002599710 -0.0001909238
  0.0587134995 0.8376622796 -0.0838609636 0.0252142828 0.5976883173 0.3768645525
  0.0000003574 0.2429899871 -0.0000000298 -0.4249545932 -0.0001396304 0.0075342511
  -0.0607319660 0.8385646343 -0.0833464041 0.0044155265 -0.6083965898 -0.3590343297
  -0.0000002423 0.2374177873 -0.0000000149 -0.3755559027 -0.0005871708 -0.0077024340
  1.4243649244 0.3662071824 0.1993640661 -0.6323628426 -0.6651233435 -0.2647008002
  0.3307898343 1.1686832905 -0.7388552427 0.7165028453 0.0012521581 0.0003189477
  0.7489678264 0.5601837039 -0.7054313421 0.6049174666 0.3186131716 -0.0212290473
  1.1845978498 0.7666223645 -0.1452327073 0.5066965818 0.4797537923 0.3287961483
  -1.4243649244 0.3662071526 0.1993650198 -0.2523095608 -0.3002573550 -0.6335224509
  -0.3319198489 1.1716425419 -0.7362308502 0.7190039754 -0.0014453988 -0.0005187101
  -0.7702052593 0.5557332635 -0.7304626703 0.5360069871 0.1109236255 -0.3041464090
  -1.1823129654 0.7737882733 -0.1767146736 -0.4984720647 0.8210216761 -0.2667492330
  -0.0000000001 0.0000002403 0.0000001471 -0.0000326263 -0.0916025639 -0.9957950711
  0.0000000004 1.1379020214 -0.0000000756 0.3051196933 -0.0000000564 0.0000000179
  0.6728870869 0.0606898442 0.3669632375 -0.5833553076 -0.1681409627 0.0130277481
  -0.7850164175 0.0870026723 0.2509911656 -0.5204890966 0.0293807797 -0.1943996400
  1.2509075403 0.9054202437 -0.3102090359 0.3473793566 -0.2107834667 0.5794334412
  0.8773168325 0.6604843736 0.5984756947 -0.5094130635 -0.1803604960 0.1675079167
  1.3415712118 0.3784038723 0.0731802881 -0.4703257978 -0.4736672938 0.4371619225
  -1.2509074211 0.9054202437 -0.3102090061 0.6463966370 -0.6734667420 0.1703543812
  -0.9039908648 0.6554800868 0.5206598639 -0.5723757744 0.1771187335 -0.1792111099
  -1.4071561098 0.3285694420 -0.0045541404 0.2667485178 -0.4224646389 -0.5802593231
  -1.5604760647 0.4714114964 -0.2048420757 0.2509532273 0.2733240426 -0.6739073992
  -0.3106839061 1.1091679335 0.8840523958 0.0513631180 0.7837696671 0.6152368784
  -0.7314201593 0.6635771990 0.8376240730 0.1313758790 -0.6807726026 -0.7136976123
  -0.3679834008 0.2541670799 0.8948080540 -0.0253891200 -0.7305399179 -0.6823173761
  -1.2728747129 0.3709850907 0.4146956801 0.3141694367 -0.6529922485 -0.6414984465
  -1.4529651403 0.9655091763 0.1782977283 0.3715421259 -0.6309404969 -0.5507364273
  1.5604761839 0.4714114964 -0.2048425525 0.6633412838 0.6633452773 -0.2812271416
  0.2655653358 1.0973489285 0.9614251852 0.1293685883 -0.7496640086 -0.6419410706
  0.7273393869 0.6613233685 0.7921592593 0.0683837682 0.6995322704 0.7001061440
  0.3416033089 0.1889497787 0.8865094781 0.0117750680 -0.6759066582 -0.7360193729
  1.3391143084 0.3786022365 0.4763342142 0.2468476892 0.6133744717 0.6746635437
  1.4667906761 1.0189548731 0.0912122354 -0.4839467406 -0.4583491683 0.4055662453
}

frame 24 {
  0.0000000000 0.0000000000 1.0000000000 0.4999999702 -0.5000000000 0.5000000596
  -0.0000000000 0.3063463569 0.8412714005 -0.0004423471 0.6950635910 -0.7189480662
  -0.0000000001 1.3493596315 -0.0000000279 0.0019955423 -0.9987252355 0.0504371412
  0.0000098364 1.5465953350 -0.3172483742 -0.3532532752 0.0001150832 -0.0000845906
  0.0587135032 0.8376622200 -0.0838608295 0.0289917476 0.5977205038 0.3773651421
  -0.0000000167 0.2429899871 -0.0000000149 -0.4211910367 -0.0000585163 0.0033352422
  -0.0607319698 0.8385645747 -0.0833462328 0.0087828934 -0.6082123518 -0.3600858450
  -0.0000002116 0.2374177873 -0.0000000373 -0.3736751378 -0.0002591823 -0.0034102495
  1.4243649244 0.3662071228 0.1993640661 -0.6349623799 -0.6621505022 -0.2628755569
  0.3301475644 1.1698298454 -0.7405332327 0.7180963755 -0.0013913232 -0.0019220964
  0.7511019111 0.5617924333 -0.7108252645 0.6049175262 0.3186131418 -0.0212290082
  1.1900435686 0.7682493329 -0.1472157389 0.5066965818 0.4797537923 0.3287961483
  -1.4243648052 0.3662070930 0.1993649900 -0.2522909045 -0.3013567626 -0.6376495361
  -0.3306486011 1.1711411476 -0.7393698692 0.7192043662 0.0014895297 0.0016426763
  -0.7701835036 0.5574891567 -0.7300775647 0.5305204988 0.1111952141 -0.3014279306
  -1.1823128462 0.7737882137 -0.1767145991 -0.4984721541 0.8210216165 -0.2667492032
  0.0000000000 0.0000002272 0.0000001304 -0.0000145002 -0.0907564014 -0.9958729744
  0.0000000005 1.1379019022 -0.0000000762 0.3045780659 -0.0000000564 0.0000000179
  0.6734904647 0.0615778863 0.3695301712 -0.5833552480 -0.1681409180 0.0130277378
  -0.7828175426 0.0875162557 0.2539202273 -0.5210730433 0.0297760330 -0.1881242990
  1.2509074211 0.9054201245 -0.3102089167 0.3490307331 -0.2130717039 0.5802244544
  0.8796581030 0.6626468897 0.6024439335 -0.5094130635 -0.1803604960 0.1675079167
  1.3456699848 0.3791428804 0.0738244653 -0.4703257978 -0.4736672640 0.4371619225
  -1.2509074211 0.9054201245 -0.3102089763 0.6488914490 -0.6715326905 0.1696472615
  -0.9059487581 0.6584341526 0.5240139365 -0.5688683987 0.1774255484 -0.1788870692
  -1.4078965187 0.3273465931 -0.0041226707 0.2671404481 -0.4208517671 -0.5834656954
  -1.5604761839 0.4714115262 -0.2048420310 0.2532823980 0.2758286893 -0.6731165051
  -0.3106646836 1.1074110270 0.8850426674 0.0513701923 0.7806121111 0.6192880273
  -0.7314479351 0.6646700501 0.8385248780 0.1313035190 -0.6842310429 -0.7104609609
  -0.3666369319 0.2537120879 0.8965710402 -0.0307804290 -0.7296035290 -0.6831678748
  -1.2759650946 0.3708988726 0.4175596535 0.3141694963 -0.6529923081 -0.6414983273
  -1.4568009377 0.9660035372 0.1799717546 0.3715420663 -0.6309406161 -0.5507364273
  1.5604761839 0.4714115262 -0.2048425376 0.6611097455 0.6633577943 -0.2839853168
  0.2655653656 1.0973488092 0.9614252448 0.1293687373 -0.7496640086 -0.6419410110
  0.7286493778 0.6613733768 0.7967965007 0.0683836564 0.6995323896 0.7001060843
  0.3442397714 0.1853597164 0.8916775584 0.0110736843 -0.6703630090 -0.7410538793
  1.3439953327 0.3811661303 0.4790155292 0.2442570180 0.6179527640 0.6731836200
  1.4705122709 1.0141211748 0.0947670341 -0.4808462858 -0.4606015682 0.4047077298
}

frame 25 {
  0.0000000000 0.0000000000 1.0000000000 0.4999999702 -0.5000000000 0.5000000596
  -0.0000000000 0.3063463569 0.8412714005 -0.0001100002 0.6954166293 -0.7186068296
  -0.0000000000 1.3493597507 -0.0000001434 0.0004960460 -0.9987822175 0.0493351370
  0.0000023642 1.5470141172 -0.3152683377 -0.3530603647 0.0000284333 -0.0000209993
  0.0587135032 0.8376623988 -0.0838607699 0.0312498268 0.5977354050 0.3776617646
  0.0000002153 0.2429900616 -0.0000000596 -0.4189354479 -0.0000100336 0.0008263403
  -0.0607319735 0.8385646343 -0.0833461434 0.0113932947 -0.6080962420 -0.3607107699
  0.0000002007 0.2374179065 0.0000000373 -0.3725470901 -0.0000631343 -0.0008448768
  1.4243646860 0.3662071526 0.1993641406 -0.6365078688 -0.6603656411 -0.2617813051
  0.3297633529 1.1705155373 -0.7415366173 0.7190430760 -0.0029715286 -0.0032617319
  0.7523779869 0.5627545118 -0.7140510082 0.6049175262 0.3186131418 -0.0212290473
  1.1933003664 0.7692225575 -0.1484015137 0.5066965818 0.4797537327 0.3287961483
  -1.4243648052 0.3662071228 0.1993651092 -0.2522752285 -0.3020080924 -0.6401036978
  -0.3298883736 1.1708414555 -0.7412471771 0.7193195820 0.0032441437 0.0029348449
  -0.7701705098 0.5585393310 -0.7298472524 0.5272294283 0.1113541722 -0.2997961640
  -1.1823128462 0.7737880945 -0.1767144650 -0.4984720349 0.8210215569 -0.2667492628
  -0.0000000000 0.0000002123 0.0000000857 -0.0000036611 -0.0902503058 -0.9959191084
  -0.0000000000 1.1379020214 -0.0000000097 0.3042541146 -0.0000000564 0.0000000179
  0.6738512516 0.0621087626 0.3710655868 -0.5833552480 -0.1681409180 0.0130277472
  -0.7815024853 0.0878232196 0.2556719482 -0.5214117765 0.0300116073 -0.1843718290
  1.2509073019 0.9054201245 -0.3102088869 0.3500157297 -0.2144383192 0.5806936622
  0.8810583949 0.6639403701 0.6048173904 -0.5094130635 -0.1803605258 0.1675079167
  1.3481210470 0.3795847297 0.0742097571 -0.4703257978 -0.4736672640 0.4371619225
  -1.2509073019 0.9054201245 -0.3102089465 0.6503797174 -0.6703727841 0.1692236811
  -0.9071196914 0.6602009535 0.5260197520 -0.5667667389 0.1776072979 -0.1786917448
  -1.4083391428 0.3266155720 -0.0038647556 0.2673724890 -0.4198840857 -0.5853775740
  -1.5604763031 0.4714115262 -0.2048421353 0.2546732128 0.2773243487 -0.6726393700
  -0.3106531501 1.1063603163 0.8856347203 0.0513741560 0.7787150145 0.6217014194
  -0.7314645648 0.6653235555 0.8390634060 0.1312589347 -0.6862907410 -0.7085188627
  -0.3658317327 0.2534399927 0.8976252079 -0.0339964032 -0.7290176153 -0.6836499572
  -1.2778135538 0.3708474040 0.4192723632 0.3141694963 -0.6529923081 -0.6414983273
  -1.4590950012 0.9662991166 0.1809727401 0.3715421855 -0.6309404969 -0.5507364273
  1.5604763031 0.4714115858 -0.2048425972 0.6597682834 0.6633576751 -0.2856305540
  0.2655653954 1.0973488092 0.9614251256 0.1293686032 -0.7496640086 -0.6419410706
  0.7294328809 0.6614031196 0.7995696664 0.0683836564 0.6995323300 0.7001060843
  0.3458166122 0.1832127273 0.8947681785 0.0106546534 -0.6670343876 -0.7440400124
  1.3469145298 0.3826995194 0.4806188345 0.2427045405 0.6206748486 0.6722857952
  1.4727380276 1.0112304688 0.0968928039 -0.4789889753 -0.4619442821 0.4041911662
}

frame 26 {
  0.0000000000 0.0000000000 1.0000000000 0.4999999702 -0.5000000000 0.5000000596
  -0.0000000000 0.3063463569 0.8412714005 -0.0000000542 0.6955333352 -0.7184938788
  0.0000000000 1.3493596315 0.0000000205 0.0000000107 -0.9988002181 0.0489705727
  -0.0000001078 1.5471527576 -0.3146134317 -0.3529965580 -0.0000002325 0.0000000391
  0.0587135032 0.8376624584 -0.0838611349 0.0319966637 0.5977396965 0.3777593672
  0.0000001296 0.2429899871 -0.0000000373 -0.4181883335 0.0000059900 -0.0000032670
  -0.0607319772 0.8385646343 -0.0833465233 0.0122566614 -0.6080568433 -0.3609169424
  -0.0000000407 0.2374178767 0.0000000373 -0.3721732795 0.0000016765 0.0000035983
  1.4243649244 0.3662071824 0.1993640512 -0.6370176673 -0.6597740054 -0.2614188194
  0.3296363354 1.1707423925 -0.7418686748 0.7193551660 -0.0034941791 -0.0037048133
  0.7528003454 0.5630729198 -0.7151184082 0.6049175262 0.3186131716 -0.0212290175
  1.1943778992 0.7695444822 -0.1487940103 0.5066965818 0.4797537327 0.3287961483
  -1.4243649244 0.3662071824 0.1993650347 -0.2522692978 -0.3022225499 -0.6409133673
  -0.3296368122 1.1707423925 -0.7418684959 0.7193569541 0.0038245113 0.0033622496
  -0.7701662779 0.5588867068 -0.7297711372 0.5261390209 0.1114061773 -0.2992553711
  -1.1823128462 0.7737880945 -0.1767145544 -0.4984721243 0.8210214972 -0.2667492330
  -0.0000000000 0.0000002645 0.0000001397 -0.0000000747 -0.0900828764 -0.9959343672
  0.0000000000 1.1379019022 0.0000000298 0.3041469455 -0.0000000564 0.0000000179
  0.6739707589 0.0622844696 0.3715734184 -0.5833552480 -0.1681409329 0.0130277472
  -0.7810674310 0.0879245400 0.2562515438 -0.5215219855 0.0300893746 -0.1831304729
  1.2509074211 0.9054201841 -0.3102088571 0.3503412008 -0.2148901671 0.5808482766
  0.8815217018 0.6643680334 0.6056026220 -0.5094130635 -0.1803605109 0.1675079465
  1.3489320278 0.3797309697 0.0743372291 -0.4703258574 -0.4736672640 0.4371619225
  -1.2509074211 0.9054201841 -0.3102088571 0.6508713961 -0.6699885726 0.1690834165
  -0.9075071216 0.6607854962 0.5266835093 -0.5660707951 0.1776671857 -0.1786268651
  -1.4084856510 0.3263736665 -0.0037793680 0.2674489319 -0.4195635617 -0.5860092044
  -1.5604763031 0.4714115560 -0.2048420906 0.2551330030 0.2778187394 -0.6724807620
  -0.3106493056 1.1060127020 0.8858308196 0.0513756946 0.7780858874 0.6224982142
  -0.7314699888 0.6655397415 0.8392417431 0.1312439293 -0.6869707704 -0.7078753114
  -0.3655653000 0.2533499897 0.8979741931 -0.0350590199 -0.7288195491 -0.6838051081
  -1.2784247398 0.3708303571 0.4198390841 0.3141695559 -0.6529923081 -0.6414983273
  -1.4598538876 0.9663969278 0.1813039780 0.3715421557 -0.6309405565 -0.5507364273
  1.5604763031 0.4714115560 -0.2048425525 0.6593233943 0.6633563042 -0.2861741781
  0.2655653656 1.0973490477 0.9614252448 0.1293685734 -0.7496640086 -0.6419409513
  0.7296919823 0.6614130735 0.8004874587 0.0683836639 0.6995324492 0.7001060247
  0.3463382125 0.1825023890 0.8957909942 0.0105164191 -0.6659310460 -0.7450238466
  1.3478801250 0.3832067847 0.4811495841 0.2421903908 0.6215728521 0.6719866991
  1.4734741449 1.0102740526 0.0975962728 -0.4783740640 -0.4623877704 0.4040198028
}

