#Wavefront OBJ file created by Hexagon 2 
mtllib mesh/exemplo.mtl
g Bullet
usemtl Messing
# 176 
v 0.196419 1.33521 0 
v 0.138889 1.33521 -0.138889 
v -8.58573e-009 1.33521 -0.196419 
v -0.138889 1.33521 -0.138889 
v -0.196419 1.33521 1.71715e-008 
v -0.138889 1.33521 0.138889 
v 2.34227e-009 1.33521 0.196419 
v 0.138889 1.33521 0.138889 
v 0.196419 0.987562 0 
v 0.138889 0.987562 -0.138889 
v -8.58573e-009 0.987562 -0.196419 
v -0.138889 0.987562 -0.138889 
v -0.196419 0.987562 1.71715e-008 
v -0.138889 0.987562 0.138889 
v 2.34227e-009 0.987562 0.196419 
v 0.138889 0.987562 0.138889 
v 0.196419 0.639912 0 
v 0.138889 0.639912 -0.138889 
v -8.58573e-009 0.639912 -0.196419 
v -0.138889 0.639912 -0.138889 
v -0.196419 0.639912 1.71715e-008 
v -0.138889 0.639912 0.138889 
v 2.34227e-009 0.639912 0.196419 
v 0.138889 0.639912 0.138889 
v 0.196419 0.292262 0 
v 0.138889 0.292262 -0.138889 
v -8.58573e-009 0.292262 -0.196419 
v -0.138889 0.292262 -0.138889 
v -0.196419 0.292262 1.71715e-008 
v -0.138889 0.292262 0.138889 
v 2.34227e-009 0.292262 0.196419 
v 0.138889 0.292262 0.138889 
v 0.196419 -0.0553883 0 
v 0.138889 -0.0553883 -0.138889 
v -8.58573e-009 -0.0553883 -0.196419 
v -0.138889 -0.0553883 -0.138889 
v -0.196419 -0.0553883 1.71715e-008 
v -0.138889 -0.0553883 0.138889 
v 2.34227e-009 -0.0553883 0.196419 
v 0.138889 -0.0553883 0.138889 
v 0.138889 1.39053 -0.138889 
v 0.196419 1.39053 3.55236e-009 
v 0.138889 1.39053 0.138889 
v -1.699e-008 1.39053 -0.196419 
v -0.138889 1.39053 -0.138889 
v -0.196419 1.39053 1.36191e-008 
v -0.138889 1.39053 0.138889 
v -1.31667e-008 1.39053 0.196419 
v 0.11045 1.49463 -0.11045 
v 0.156199 1.49463 8.48751e-009 
v -2.68632e-008 1.49463 -0.156199 
v 0.11045 1.49463 0.11045 
v -2.70487e-008 1.49463 0.156199 
v -0.11045 1.49463 -0.11045 
v -0.156199 1.49463 5.16787e-009 
v -0.11045 1.49463 0.11045 
v 0.11045 1.61377 -0.11045 
v 0.156199 1.61377 7.74961e-009 
v -9.09152e-009 1.61377 -0.156199 
v 0.11045 1.61377 0.11045 
v -0.11045 1.61377 -0.11045 
v -7.8013e-009 1.61377 0.156199 
v -0.11045 1.61377 0.11045 
v -0.156199 1.61377 5.90575e-009 
v 0.0924142 1.61377 -0.0924142 
v 0.130693 1.61377 9.35834e-009 
v -7.30085e-009 1.61377 -0.130693 
v 0.0924142 1.61377 0.0924142 
v -0.0924142 1.61377 -0.0924142 
v -6.83347e-009 1.61377 0.130693 
v -0.130693 1.61377 2.06719e-009 
v -0.0924142 1.61377 0.0924142 
v 0.0924142 1.77411 -0.0924142 
v 0.130693 1.77411 1.1722e-008 
v -2.04529e-008 1.77411 -0.130693 
v 0.0924142 1.77411 0.0924142 
v -0.0924142 1.77411 -0.0924142 
v -2.47128e-008 1.77411 0.130693 
v -0.130693 1.77411 -2.96482e-010 
v -0.0924142 1.77411 0.0924142 
v 0.0762258 1.9801 -0.0762257 
v 0.107799 1.9801 1.01142e-008 
v 7.12506e-010 1.9801 -0.107799 
v 0.0762258 1.9801 0.0762257 
v -0.0762257 1.9801 -0.0762258 
v -6.27917e-009 1.9801 0.107799 
v -0.107799 1.9801 -6.90149e-010 
v -0.0762257 1.9801 0.0762258 
v 0.0122679 2.30864 -0.0122679 
v 0.0173495 2.30864 1.82767e-009 
v 5.00593e-008 2.30864 -0.0173494 
v 0.0122679 2.30864 0.0122679 
v -0.0122678 2.30864 -0.0122679 
v 4.97255e-008 2.30864 0.0173494 
v -0.0173494 2.30864 -3.10945e-010 
v -0.0122678 2.30864 0.0122679 
v 0.183096 -0.0759027 3.05246e-009 
v 0.129469 -0.0759027 -0.129469 
v 0.129469 -0.0759027 0.129469 
v -4.95094e-009 -0.0759027 -0.183096 
v -0.129469 -0.0759027 -0.129469 
v -0.183096 -0.0759027 1.29543e-008 
v -0.129469 -0.0759027 0.129469 
v -8.69054e-010 -0.0759027 0.183096 
v 0.183096 -0.08885 6.36388e-009 
v 0.129469 -0.08885 -0.129469 
v 0.129469 -0.08885 0.129469 
v -1.67527e-009 -0.08885 -0.183096 
v -4.21623e-009 -0.08885 0.183096 
v -0.129469 -0.08885 -0.129469 
v -0.183096 -0.08885 9.64291e-009 
v -0.129469 -0.08885 0.129469 
v 0.205452 -0.08885 1.64792e-008 
v 0.145276 -0.08885 -0.145276 
v 0.145277 -0.08885 0.145276 
v 5.20757e-009 -0.08885 -0.205452 
v -1.18184e-008 -0.08885 0.205452 
v -0.145276 -0.08885 -0.145276 
v -0.145276 -0.08885 0.145276 
v -0.205452 -0.08885 1.48197e-009 
v 0.205452 -0.108644 1.64792e-008 
v 0.145276 -0.108644 -0.145276 
v 0.145277 -0.108644 0.145276 
v 5.1445e-009 -0.108644 -0.205452 
v -1.18815e-008 -0.108644 0.205452 
v -0.145276 -0.108644 -0.145276 
v -0.145276 -0.108644 0.145276 
v -0.205452 -0.108644 1.48197e-009 
v 0.105957 -0.108644 8.83089e-009 
v 0.074923 -0.108644 -0.074923 
v 0.074923 -0.108644 0.074923 
v 2.98528e-009 -0.108644 -0.105957 
v -6.45973e-009 -0.108644 0.105957 
v -0.074923 -0.108644 -0.074923 
v -0.074923 -0.108644 0.074923 
v -0.105957 -0.108644 4.32173e-010 
v 0.105957 -0.0981504 1.12477e-008 
v 0.074923 -0.0981504 -0.074923 
v 0.074923 -0.0981504 0.074923 
v 5.31344e-009 -0.0981504 -0.105957 
v -8.96526e-009 -0.0981504 0.105957 
v -0.074923 -0.0981504 -0.074923 
v -0.074923 -0.0981504 0.074923 
v -0.105957 -0.0981504 -1.98468e-009 
v 0.0969209 -0.0981504 1.14393e-008 
v 0.0685334 -0.0981504 -0.0685334 
v 0.0685335 -0.0981504 0.0685334 
v 6.0111e-009 -0.0981504 -0.0969209 
v -9.35149e-009 -0.0981504 0.0969209 
v -0.0685334 -0.0981504 -0.0685334 
v -0.0685334 -0.0981504 0.0685334 
v -0.0969209 -0.0981504 -2.96622e-009 
v 0.0969209 -0.108644 1.05236e-008 
v 0.0685334 -0.108644 -0.0685334 
v 0.0685335 -0.108644 0.0685334 
v 4.94313e-009 -0.108644 -0.0969209 
v -8.58802e-009 -0.108644 0.0969209 
v -0.0685334 -0.108644 -0.0685334 
v -0.0685334 -0.108644 0.0685334 
v -0.0969209 -0.108644 -2.0505e-009 
v 0.0389937 -0.108644 3.88676e-009 
v 0.0275727 -0.108644 -0.0275727 
v 0.0275727 -0.108644 0.0275727 
v 1.6416e-009 -0.108644 -0.0389937 
v -3.10803e-009 -0.108644 0.0389937 
v -0.0275727 -0.108644 -0.0275727 
v -0.0275727 -0.108644 0.0275727 
v -0.0389937 -0.108644 -4.77821e-010 
v 0.000587086 -0.095572 7.34014e-011 
v 0.000415133 -0.095572 -0.000415132 
v 0.000415133 -0.095572 0.000415132 
v 7.45982e-010 -0.095572 -0.000587085 
v 6.44707e-010 -0.095572 0.000587085 
v -0.000415131 -0.095572 -0.000415132 
v -0.000415131 -0.095572 0.000415132 
v -0.000587084 -0.095572 -2.20768e-011 
# 270 
vn 1 1.11066e-007 -1.20967e-007 
vn 0.707107 6.51028e-008 -0.707107 
vn -3.22578e-008 -1.45924e-008 -1 
vn -0.707107 -7.70092e-008 -0.707107 
vn -1 -1.19462e-007 -6.45156e-008 
vn -0.707107 -6.61966e-008 0.707107 
vn 2.33869e-007 2.72098e-008 1 
vn 0.707107 8.23243e-008 0.707107 
vn 1 -2.72699e-010 -8.06445e-008 
vn 0.707107 -1.07889e-008 -0.707107 
vn -3.22578e-008 -1.70669e-008 -1 
vn -0.707107 -6.72385e-009 -0.707107 
vn -1 -2.03248e-009 6.45156e-008 
vn -0.707107 -1.97839e-009 0.707107 
vn 1.4516e-007 8.06403e-009 1 
vn 0.707107 8.18311e-009 0.707107 
vn 1 -2.72699e-010 -1.04838e-007 
vn 0.707107 -1.07889e-008 -0.707107 
vn -3.22578e-008 -1.70669e-008 -1 
vn -0.707107 -6.72385e-009 -0.707107 
vn -1 -2.03248e-009 8.06445e-008 
vn -0.707107 -1.97839e-009 0.707107 
vn 1.4516e-007 8.06403e-009 1 
vn 0.707107 8.18311e-009 0.707107 
vn 1 -2.72699e-010 -9.67734e-008 
vn 0.707107 -1.07889e-008 -0.707107 
vn -4.83867e-008 -1.70669e-008 -1 
vn -0.707107 -6.72385e-009 -0.707107 
vn -1 -2.03248e-009 9.67734e-008 
vn -0.707107 -1.97839e-009 0.707107 
vn 1.29031e-007 8.06403e-009 1 
vn 0.707107 8.18311e-009 0.707107 
vn 0.95788 -0.287168 -9.14912e-008 
vn 0.677324 -0.287168 -0.677324 
vn -3.32695e-008 -0.287168 -0.95788 
vn -0.677324 -0.287168 -0.677324 
vn -0.95788 -0.287168 9.98086e-008 
vn -0.677324 -0.287168 0.677324 
vn 1.24761e-007 -0.287168 0.95788 
vn 0.677324 -0.287168 0.677324 
vn 0.695009 0.184188 -0.695009 
vn 0.982891 0.184188 -5.71484e-008 
vn 0.695009 0.184188 0.695009 
vn -8.16406e-009 0.184188 -0.982891 
vn -0.695009 0.184188 -0.695009 
vn -0.982891 0.184188 -1.06133e-007 
vn -0.695009 0.184188 0.695009 
vn 2.53086e-007 0.184188 0.982891 
vn 0.695009 0.184188 -0.695009 
vn 0.982891 0.184188 -1.06133e-007 
vn 0 0.184188 -0.982891 
vn 0.695009 0.184188 0.695009 
vn 5.71484e-008 0.184188 0.982891 
vn -0.695009 0.184188 -0.695009 
vn -0.982891 0.184188 1.63281e-007 
vn -0.695009 0.184188 0.695009 
vn 0.707107 -1.23567e-007 -0.707107 
vn 7.00497e-007 1 0 
vn 1 -2.02355e-007 -2.74191e-007 
vn 3.23276e-007 1 0 
vn 0 2.12966e-008 -1 
vn 1.19149e-006 1 0 
vn 0.707107 -1.51833e-007 0.707107 
vn -1.35083e-006 1 0 
vn -0.707107 1.50271e-007 -0.707107 
vn 1.73194e-006 1 0 
vn -4.83867e-008 1.90514e-008 1 
vn -1.19149e-006 1 0 
vn -0.707107 1.68998e-007 0.707107 
vn -1.22188e-006 1 0 
vn -1 2.05876e-007 3.38707e-007 
vn -4.6355e-007 1 0 
vn 7.00497e-007 1 0 
vn 0.707107 3.93325e-008 -0.707107 
vn 3.23276e-007 1 0 
vn 1 7.94556e-008 -8.06445e-008 
vn 1.19149e-006 1 0 
vn -6.45156e-008 -1.54209e-008 -1 
vn -1.35083e-006 1 0 
vn 0.707107 7.82304e-008 0.707107 
vn 1.73194e-006 1 0 
vn -0.707107 -5.69352e-008 -0.707107 
vn -1.19149e-006 1 0 
vn 0 1.78822e-008 1 
vn -4.6355e-007 1 0 
vn -1 -8.37693e-008 -1.61289e-008 
vn -1.22188e-006 1 0 
vn -0.707107 -6.24801e-008 0.707107 
vn 0.706023 0.0553416 -0.706023 
vn 0.998468 0.0553416 -7.26588e-008 
vn 8.07321e-009 0.0553416 -0.998468 
vn 0.706023 0.0553416 0.706023 
vn -0.706023 0.0553417 -0.706023 
vn 1.04952e-007 0.0553416 0.998468 
vn -0.998468 0.0553417 -4.84392e-008 
vn -0.706023 0.0553416 0.706023 
vn 0.694403 0.188701 -0.694403 
vn 0.982035 0.188701 0 
vn 4.03255e-008 0.188701 -0.982035 
vn 0.694403 0.188701 0.694403 
vn -0.694403 0.188701 -0.694403 
vn 1.20976e-007 0.188701 0.982035 
vn -0.982035 0.188701 -6.45208e-008 
vn -0.694403 0.188701 0.694403 
vn 1.47205e-006 1 0 
vn 0.681743 0.265429 -0.681743 
vn 1.47205e-006 1 0 
vn 0.96413 0.265429 6.41819e-008 
vn 1.47205e-006 1 0 
vn 0 0.265429 -0.96413 
vn 1.47205e-006 1 0 
vn 0.681743 0.265429 0.681743 
vn 1.47205e-006 1 0 
vn -0.681743 0.265429 -0.681743 
vn 1.47205e-006 1 0 
vn 3.2091e-008 0.265429 0.96413 
vn 1.47205e-006 1 0 
vn -0.96413 0.265429 -4.81364e-008 
vn 1.47205e-006 1 0 
vn -0.681743 0.265429 0.681743 
vn 0.95788 -0.287168 -8.31739e-008 
vn 0.677324 -0.287168 -0.677324 
vn 0.677324 -0.287168 0.677323 
vn 1.66348e-008 -0.287168 -0.95788 
vn -0.677324 -0.287168 -0.677324 
vn -0.95788 -0.287168 8.31739e-008 
vn -0.677324 -0.287168 0.677324 
vn 1.24761e-007 -0.287168 0.95788 
vn 1 2.76568e-008 -6.45156e-008 
vn 1.23425e-008 1 0 
vn 0.707107 1.37814e-007 -0.707107 
vn 1.46343e-008 1 0 
vn 0.707107 3.56951e-007 0.707107 
vn 3.80291e-008 1 0 
vn 4.83867e-008 3.12682e-007 -1 
vn 1.64068e-008 1 0 
vn 1.29031e-007 2.56482e-007 1 
vn 7.85391e-009 1 0 
vn -0.707107 2.20974e-007 -0.707107 
vn -3.32308e-008 1 0 
vn -1 2.51284e-008 6.45156e-008 
vn -7.54414e-009 1 0 
vn -0.707107 -9.37901e-008 0.707107 
vn 9.62638e-009 1 0 
vn 1.23425e-008 1 0 
vn 1 1.03837e-009 -6.45156e-008 
vn 1.46343e-008 1 0 
vn 0.707107 1.20269e-008 -0.707107 
vn 3.80291e-008 1 0 
vn 0.707107 8.96743e-008 0.707107 
vn 1.64068e-008 1 0 
vn 4.83867e-008 -7.62954e-008 -1 
vn 7.85391e-009 1 0 
vn 3.22578e-008 -1.11552e-007 1 
vn -3.32308e-008 1 0 
vn -0.707107 -1.11724e-007 -0.707107 
vn 9.62638e-009 1 0 
vn -0.707107 -1.98561e-007 0.707107 
vn -7.54414e-009 1 0 
vn -1 -2.17742e-008 -0 
vn 1 1.03837e-009 -6.45156e-008 
vn 2.00309e-008 -1 0 
vn 0.707107 1.20269e-008 -0.707107 
vn -3.50008e-009 -1 -0 
vn 0.707107 8.96743e-008 0.707107 
vn 1.52794e-008 -1 0 
vn 4.83867e-008 -7.62954e-008 -1 
vn -1.53314e-008 -1 -0 
vn 3.22578e-008 -1.11552e-007 1 
vn 1.88746e-008 -1 0 
vn -0.707107 -1.11724e-007 -0.707107 
vn -4.52774e-009 -1 -0 
vn -0.707107 -1.98561e-007 0.707107 
vn 1.53315e-008 -1 0 
vn -1 -2.17742e-008 -0 
vn -9.91098e-010 -1 -0 
vn 2.00309e-008 -1 0 
vn -1 2.94483e-008 3.22578e-008 
vn -3.50008e-009 -1 -0 
vn -0.707107 -6.39681e-008 0.707107 
vn 1.52794e-008 -1 0 
vn -0.707107 2.6509e-007 -0.707107 
vn -1.53314e-008 -1 -0 
vn -4.83867e-008 -4.72857e-008 1 
vn 1.88746e-008 -1 0 
vn -8.06445e-008 3.30064e-007 -1 
vn -4.52774e-009 -1 -0 
vn 0.707107 4.71198e-008 0.707107 
vn 1.53315e-008 -1 0 
vn 0.707107 6.62661e-008 -0.707107 
vn -9.91098e-010 -1 -0 
vn 1 2.28103e-009 0 
vn -1 2.94483e-008 3.22578e-008 
vn -2.3568e-007 -1 -0 
vn -0.707107 -6.39681e-008 0.707107 
vn -1.04174e-007 -1 -0 
vn -0.707107 2.6509e-007 -0.707107 
vn -2.05869e-007 -1 -0 
vn -4.83867e-008 -4.72857e-008 1 
vn 1.07775e-008 -1 0 
vn -8.06445e-008 3.30064e-007 -1 
vn -5.38842e-008 -1 -0 
vn 0.707107 4.71198e-008 0.707107 
vn 1.90535e-008 -1 0 
vn 0.707107 6.62661e-008 -0.707107 
vn -3.49729e-008 -1 -0 
vn 1 2.28103e-009 0 
vn -4.7175e-008 -1 -0 
vn -2.3568e-007 -1 -0 
vn 1 -1.01032e-008 0 
vn -1.04174e-007 -1 -0 
vn 0.707107 4.64193e-008 -0.707107 
vn -2.05869e-007 -1 -0 
vn 0.707107 6.83362e-008 0.707107 
vn 1.07775e-008 -1 0 
vn 9.67734e-008 -5.92587e-008 -1 
vn -5.38842e-008 -1 -0 
vn 0 2.20895e-007 1 
vn 1.90535e-008 -1 0 
vn -0.707107 -1.21314e-007 -0.707107 
vn -3.49729e-008 -1 -0 
vn -0.707107 1.54491e-007 0.707107 
vn -4.7175e-008 -1 -0 
vn -1 -3.60132e-009 -0 
vn 1 -1.01032e-008 0 
vn -2.33994e-008 -1 -0 
vn 0.707107 4.64193e-008 -0.707107 
vn 3.13832e-008 -1 0 
vn 0.707107 6.83362e-008 0.707107 
vn -1.66033e-008 -1 -0 
vn 9.67734e-008 -5.92587e-008 -1 
vn 6.33782e-008 -1 0 
vn 0 2.20895e-007 1 
vn -2.78973e-008 -1 -0 
vn -0.707107 -1.21314e-007 -0.707107 
vn 1.93335e-008 -1 0 
vn -0.707107 1.54491e-007 0.707107 
vn -6.35996e-009 -1 -0 
vn -1 -3.60132e-009 -0 
vn 1.56718e-008 -1 0 
vn -2.33994e-008 -1 -0 
vn -0.319377 -0.938348 0.13229 
vn -0.319377 -0.938348 -0.13229 
vn -0.114958 -0.986696 0.114958 
vn -0.0447136 -0.993151 -0.107948 
vn -0.319377 -0.938348 -0.13229 
vn -1.32497e-008 -0.986696 0.162575 
vn -2.82289e-009 -0.986696 -0.162575 
vn 0.0447136 -0.993151 0.107948 
vn 0.319377 -0.938348 0.13229 
vn 0.0447136 -0.993151 -0.107948 
vn 0.319377 -0.938348 -0.13229 
vn 1.56718e-008 -1 0 
vn 0.319377 -0.938348 0.13229 
vn 0.319377 -0.938348 -0.13229 
vn 2.99961e-006 -1 0 
vn -0.319377 -0.938348 0.13229 
vn -0.319377 -0.938348 -0.13229 
vn -0.153275 -0.976224 0.153276 
vn -0.0671873 -0.984467 -0.162208 
vn -0.319377 -0.938348 -0.13229 
vn 9.55734e-007 -0.976224 0.216765 
vn 1.03159e-006 -0.976224 -0.216765 
vn 0.0671903 -0.984466 0.162208 
vn 0.319377 -0.938348 0.13229 
vn 0.0671904 -0.984466 -0.162208 
vn 0.319377 -0.938348 -0.13229 
vn 2.99961e-006 -1 0 
vn 0.319377 -0.938348 0.13229 
vn 0.319377 -0.938348 -0.13229 
usemtl Messing
f 1//1 9//9 10//10 2//2 
f 2//2 10//10 11//11 3//3 
f 3//3 11//11 12//12 4//4 
f 4//4 12//12 13//13 5//5 
f 5//5 13//13 14//14 6//6 
f 6//6 14//14 15//15 7//7 
f 7//7 15//15 16//16 8//8 
f 8//8 16//16 9//9 1//1 
f 9//9 17//17 18//18 10//10 
f 10//10 18//18 19//19 11//11 
f 11//11 19//19 20//20 12//12 
f 12//12 20//20 21//21 13//13 
f 13//13 21//21 22//22 14//14 
f 14//14 22//22 23//23 15//15 
f 15//15 23//23 24//24 16//16 
f 16//16 24//24 17//17 9//9 
f 17//17 25//25 26//26 18//18 
f 18//18 26//26 27//27 19//19 
f 19//19 27//27 28//28 20//20 
f 20//20 28//28 29//29 21//21 
f 21//21 29//29 30//30 22//22 
f 22//22 30//30 31//31 23//23 
f 23//23 31//31 32//32 24//24 
f 24//24 32//32 25//25 17//17 
f 25//25 33//33 34//34 26//26 
f 26//26 34//34 35//35 27//27 
f 27//27 35//35 36//36 28//28 
f 28//28 36//36 37//37 29//29 
f 29//29 37//37 38//38 30//30 
f 30//30 38//38 39//39 31//31 
f 31//31 39//39 40//40 32//32 
f 32//32 40//40 33//33 25//25 
f 171//260 173//263 175//266 176//268 174//264 172//262 170//259 169//256 
usemtl material23
f 90//107 89//105 91//109 93//113 95//117 96//119 94//115 92//111 
usemtl Messing
f 1//1 2//2 41//41 42//42 
f 8//8 1//1 42//42 43//43 
f 2//2 3//3 44//44 41//41 
f 3//3 4//4 45//45 44//44 
f 4//4 5//5 46//46 45//45 
f 5//5 6//6 47//47 46//46 
f 6//6 7//7 48//48 47//47 
f 7//7 8//8 43//43 48//48 
f 42//42 41//41 49//49 50//50 
f 41//41 44//44 51//51 49//49 
f 43//43 42//42 50//50 52//52 
f 48//48 43//43 52//52 53//53 
f 44//44 45//45 54//54 51//51 
f 45//45 46//46 55//55 54//54 
f 46//46 47//47 56//56 55//55 
f 47//47 48//48 53//53 56//56 
f 50//50 49//49 57//57 58//59 
f 49//49 51//51 59//61 57//57 
f 52//52 50//50 58//59 60//63 
f 51//51 54//54 61//65 59//61 
f 53//53 52//52 60//63 62//67 
f 56//56 53//53 62//67 63//69 
f 54//54 55//55 64//71 61//65 
f 55//55 56//56 63//69 64//71 
f 58//60 57//58 65//73 66//75 
f 57//58 59//62 67//77 65//73 
f 60//64 58//60 66//75 68//79 
f 59//62 61//66 69//81 67//77 
f 62//68 60//64 68//79 70//83 
f 61//66 64//72 71//85 69//81 
f 63//70 62//68 70//83 72//87 
f 64//72 63//70 72//87 71//85 
usemtl material23
f 66//76 65//74 73//89 74//90 
f 65//74 67//78 75//91 73//89 
f 68//80 66//76 74//90 76//92 
f 67//78 69//82 77//93 75//91 
f 70//84 68//80 76//92 78//94 
f 69//82 71//86 79//95 77//93 
f 72//88 70//84 78//94 80//96 
f 71//86 72//88 80//96 79//95 
f 74//90 73//89 81//97 82//98 
f 73//89 75//91 83//99 81//97 
f 76//92 74//90 82//98 84//100 
f 75//91 77//93 85//101 83//99 
f 78//94 76//92 84//100 86//102 
f 77//93 79//95 87//103 85//101 
f 80//96 78//94 86//102 88//104 
f 79//95 80//96 88//104 87//103 
f 82//98 81//97 89//106 90//108 
f 81//97 83//99 91//110 89//106 
f 84//100 82//98 90//108 92//112 
f 83//99 85//101 93//114 91//110 
f 86//102 84//100 92//112 94//116 
f 85//101 87//103 95//118 93//114 
f 88//104 86//102 94//116 96//120 
f 87//103 88//104 96//120 95//118 
usemtl Messing
f 34//34 33//33 97//121 98//122 
f 33//33 40//40 99//123 97//121 
f 35//35 34//34 98//122 100//124 
f 36//36 35//35 100//124 101//125 
f 37//37 36//36 101//125 102//126 
f 38//38 37//37 102//126 103//127 
f 39//39 38//38 103//127 104//128 
f 40//40 39//39 104//128 99//123 
f 98//122 97//121 105//129 106//131 
f 97//121 99//123 107//133 105//129 
f 100//124 98//122 106//131 108//135 
f 99//123 104//128 109//137 107//133 
f 101//125 100//124 108//135 110//139 
f 102//126 101//125 110//139 111//141 
f 103//127 102//126 111//141 112//143 
f 104//128 103//127 112//143 109//137 
f 106//132 105//130 113//145 114//147 
f 105//130 107//134 115//149 113//145 
f 108//136 106//132 114//147 116//151 
f 107//134 109//138 117//153 115//149 
f 110//140 108//136 116//151 118//155 
f 109//138 112//144 119//157 117//153 
f 111//142 110//140 118//155 120//159 
f 112//144 111//142 120//159 119//157 
f 114//148 113//146 121//161 122//163 
f 113//146 115//150 123//165 121//161 
f 116//152 114//148 122//163 124//167 
f 115//150 117//154 125//169 123//165 
f 118//156 116//152 124//167 126//171 
f 117//154 119//158 127//173 125//169 
f 120//160 118//156 126//171 128//175 
f 119//158 120//160 128//175 127//173 
f 122//164 121//162 129//177 130//179 
f 121//162 123//166 131//181 129//177 
f 124//168 122//164 130//179 132//183 
f 123//166 125//170 133//185 131//181 
f 126//172 124//168 132//183 134//187 
f 125//170 127//174 135//189 133//185 
f 128//176 126//172 134//187 136//191 
f 127//174 128//176 136//191 135//189 
f 130//180 129//178 137//193 138//195 
f 129//178 131//182 139//197 137//193 
f 132//184 130//180 138//195 140//199 
f 131//182 133//186 141//201 139//197 
f 134//188 132//184 140//199 142//203 
f 133//186 135//190 143//205 141//201 
f 136//192 134//188 142//203 144//207 
f 135//190 136//192 144//207 143//205 
f 138//196 137//194 145//209 146//211 
f 137//194 139//198 147//213 145//209 
f 140//200 138//196 146//211 148//215 
f 139//198 141//202 149//217 147//213 
f 142//204 140//200 148//215 150//219 
f 141//202 143//206 151//221 149//217 
f 144//208 142//204 150//219 152//223 
f 143//206 144//208 152//223 151//221 
f 146//212 145//210 153//225 154//227 
f 145//210 147//214 155//229 153//225 
f 148//216 146//212 154//227 156//231 
f 147//214 149//218 157//233 155//229 
f 150//220 148//216 156//231 158//235 
f 149//218 151//222 159//237 157//233 
f 152//224 150//220 158//235 160//239 
f 151//222 152//224 160//239 159//237 
f 154//228 153//226 161//241 162//244 
f 153//226 155//230 163//245 161//241 
f 156//232 154//228 162//244 164//247 
f 155//230 157//234 165//248 163//245 
f 158//236 156//232 164//247 166//249 
f 157//234 159//238 167//251 165//248 
f 160//240 158//236 166//249 168//253 
f 159//238 160//240 168//253 167//251 
f 162//244 161//242 169//257 170//259 
f 161//243 163//246 171//261 169//258 
f 164//247 162//244 170//259 172//262 
f 163//245 165//248 173//263 171//260 
f 166//249 164//247 172//262 174//264 
f 165//248 167//251 175//266 173//263 
f 168//254 166//250 174//265 176//269 
f 167//252 168//255 176//270 175//267 
