<?xml version="1.0" encoding="utf-8"?>
<!-- Generator: Adobe Illustrator 24.0.1, SVG Export Plug-In . SVG Version: 6.00 Build 0)  -->
<svg version="1.1" id="Layer_1" xmlns="http://www.w3.org/2000/svg" xmlns:xlink="http://www.w3.org/1999/xlink" x="0px" y="0px"
	 viewBox="0 0 16 16" style="enable-background:new 0 0 16 16;" xml:space="preserve">
<g>
	<path d="M15,2.44v0.04l-4.6,5.37L5.13,4.69l-1,5.97L1.51,8.91L1,9.22V2.44C1,1.64,1.64,1,2.44,1h11.12C14.36,1,15,1.64,15,2.44z"/>
	<path d="M15,4.02v9.54c0,0.8-0.64,1.44-1.44,1.44H2.44C1.64,15,1,14.36,1,13.56v-3.18l0.49-0.29l3.38,2.25l1-6.03l4.73,2.84
		L15,4.02z"/>
</g>
</svg>
