Day 1
----------------------------
Video name: description

Day 2
----------------------------

Day 3
----------------------------

Day 4
----------------------------

Day 5
----------------------------