{
    "defaultSeverity": "error",
    "extends": [
        "tslint:recommended"
    ],
    "jsRules": {},
    "rules": {
      "no-console": false,
      "quotemark": [true, "double", "avoid-template", "avoid-escape"],
      "object-literal-sort-keys": false,
      "ordered-imports": false
    },
    "rulesDirectory": []
}
