{
    "defaultSeverity": "error",
    "extends": [
        "tslint:recommended"
    ],
    "jsRules": {},
    "rules": {
      "object-literal-sort-keys": false,
      "no-console": false
    },
    "rulesDirectory": []
}
