\select@language {italian}
\select@language {italian}
\contentsline {section}{\numberline {1}Introduzione}{1}
\contentsline {section}{\numberline {2}Regressione lineare}{2}
\contentsline {section}{\numberline {3}Requisiti di sistema}{3}
\contentsline {section}{\numberline {4}Implementazione}{4}
\contentsline {section}{\numberline {5}Funzionamento}{5}
\contentsline {section}{\numberline {6}Casi di studio e osservazioni}{6}
