\relax 
\select@language{italian}
\@writefile{toc}{\select@language{italian}}
\@writefile{lof}{\select@language{italian}}
\@writefile{lot}{\select@language{italian}}
\select@language{italian}
\@writefile{toc}{\select@language{italian}}
\@writefile{lof}{\select@language{italian}}
\@writefile{lot}{\select@language{italian}}
\@writefile{toc}{\contentsline {section}{\numberline {1}Introduzione}{1}}
\@writefile{toc}{\contentsline {section}{\numberline {2}Regressione lineare}{2}}
\@writefile{toc}{\contentsline {section}{\numberline {3}Requisiti di sistema}{3}}
\@writefile{toc}{\contentsline {section}{\numberline {4}Implementazione}{4}}
\@writefile{lol}{\contentsline {lstlisting}{\numberline {1}Importazione librerie}{4}}
\@writefile{lol}{\contentsline {lstlisting}{\numberline {2}Apertura e iterazione dei file excel.}{4}}
\@writefile{lol}{\contentsline {lstlisting}{\numberline {3}Creazione del regressione lineare e calcolo dei valori.}{4}}
\@writefile{toc}{\contentsline {section}{\numberline {5}Funzionamento}{5}}
\@writefile{lof}{\contentsline {figure}{\numberline {1}{\ignorespaces Anteprima del software\relax }}{5}}
\@writefile{toc}{\contentsline {section}{\numberline {6}Casi di studio e osservazioni}{6}}
