LINUX -B-

0)Class 1B w="wcvcmakxx" s="VgCjMwAc", l=8, getSum()=98
	 res()=2.65788
1)Class 1C w="VnsH" t="0k60BavNSh", len=10, getSum()=1
	 moreThan05()=5
2)Class 1B w="oqrgvpogfu" s="RwGrVoPq", l=8, getSum()=340
	 res()=0.820414
3)Class 1C w="L82" t="l811un5182", len=10, getSum()=1
	 moreThan05()=5
4)Class 1C w="j" t="20v3175q2J", len=10, getSum()=1
	 moreThan05()=5
5)Class 1C w="14G6" t="Uj2PA414g6", len=10, getSum()=1
	 moreThan05()=5
6)Class 1C w="Yij" t="2636XRjyIJ", len=10, getSum()=106
	 moreThan05()=3
7)Class 1B w="cvainwic" s="AsIcNv", l=6, getSum()=308
	 res()=0.744548
8)Class 1B w="ffboguygg" s="OwGpUfYfGb", l=10, getSum()=229
	 res()=1.29971
9)Class 1B w="otxmpfl" s="MiPoFjLvCoStKx", l=14, getSum()=112
	 res()=3.20299
10)Class 1B w="rogytp" s="GpYwTrPo", l=8, getSum()=112
	 res()=2.50064
11)Class 1B w="fhpbfesns" s="BbFfEhSp", l=8, getSum()=102
	 res()=2.48552
12)Class 1B w="hqcikr" s="CyItKhRq", l=8, getSum()=106
	 res()=2.5637
13)Class 1B w="mijumd" s="JqUiMmDi", l=8, getSum()=223
	 res()=1.18605
14)Class 1C w="U7W1T" t="u7A8f72w1t", len=10, getSum()=86
	 moreThan05()=4
15)Class 1C w="LRT66U" t="6n3plrt66u", len=10, getSum()=86
	 moreThan05()=4
16)Class 1B w="jsyldpfqo" s="LwDhPjFsQy", l=10, getSum()=112
	 res()=2.71317
17)Class 1C w="71SmD5" t="I7o071sMd5", len=10, getSum()=1
	 moreThan05()=5
18)Class 1B w="qgtabpgp" s="AjBaPkGrPqDgSt", l=14, getSum()=98
	 res()=3.53272
19)Class 1B w="wjvkcsn" s="JeVcKpCgShNw", l=12, getSum()=1
	 res()=322.631
20)Class 1C w="7AlT7" t="7ajU4e8Lt7", len=10, getSum()=66
	 moreThan05()=7
21)Class 1C w="Lc582O1" t="l82DC582o1", len=10, getSum()=80
	 moreThan05()=4
22)Class 1B w="pqyqedli" s="QoYnQbEp", l=8, getSum()=207
	 res()=1.29962
23)Class 1C w="S74AP" t="53U2bs74ap", len=10, getSum()=66
	 moreThan05()=7
24)Class 1C w="F1205" t="a867if1205", len=10, getSum()=1
	 moreThan05()=5
25)Class 1B w="ajittkqq" s="JpInTa", l=6, getSum()=203
	 res()=1.1224
26)Class 1C w="URP" t="ur1U1cpOfp", len=10, getSum()=86
	 moreThan05()=4
27)Class 1B w="jcwdaa" s="ClWsDdAj", l=8, getSum()=195
	 res()=1.32772
28)Class 1B w="ghauhhexp" s="UwHgHrEcXgPhTa", l=14, getSum()=316
	 res()=1.10513
29)Class 1B w="ojbojyrxkr" s="OvJoYjRb", l=8, getSum()=223
	 res()=1.2153

Punto I (res(): 2 and 16): 3.533584
Punto II (i: moreThan05()>=5): 1 3 4 5 17 20 23 24 
Punto III (getSum() min, max, avg):min=1, max=340, avg=175.588
