variable,source_variable,alternatives,condition,values,values_parsed,format,static_value,aggregate,conversion,threshold
source_id,ergoid,,,,,,,,,,
date,e4_3494,startdat,,,,%Y-%m-%d,,,,,
birth_year,,,,,,,,,,,
date_age,startdat,,,,,%Y-%m-%d,,,,,
age,startage,,,,,,,,,,
sex,sex,,,0.0;1.0,male;female;-,,,,,,
education_years,,,,,,,,,,,
education_category,,,,,low;high,,,,,,
education_category_3,education,,,0.0;1.0;2.0;3.0,low;low;medium;high,,,,,,
education_category_verhage,,,,,1;2;3;4;5;6;7,,,,,,
date_diagnosis,dementia_date,,,,,%Y-%m-%d,,,,,
normal_cognition_diagnosis,,,,,yes;no,,,,,,
scd_diagnosis,,,,,yes;no,,,,,,
mci_diagnosis,,,,,yes;no,,,,,,
dementia_diagnosis,dementia_incident,,,1.0;0.0,yes;no,,,,,,
no_normal_cognition_diagnosis,,,,,yes;no,,,,,,
no_scd_diagnosis,,,,,yes;no,,,,,,
no_mci_diagnosis,,,,,yes;no,,,,,,
no_dementia_diagnosis,dementia_incident,,,1.0;0.0,yes;no,,,,,,
alzheimers_dementia,,,,,yes;no,,,,,,
lewy_body_dementia,,,,,yes;no,,,,,,
vascular_dementia,,,,,yes;no,,,,,,
frontotemporal_dementia,,,,,yes;no,,,,,,
parkinsons_dementia,,,,,yes;no,,,,,,
semantic_dementia,,,,,yes;no,,,,,,
corticobasal_syndrome,,,,,yes;no,,,,,,
psp,,,,,yes;no,,,,,,
pnfa,,,,,yes;no,,,,,,
cjd,,,,,yes;no,,,,,,
no_alzheimers_dementia,,,,,yes;no,,,,,,
no_lewy_body_dementia,,,,,yes;no,,,,,,
no_vascular_dementia,,,,,yes;no,,,,,,
no_frontotemporal_dementia,,,,,yes;no,,,,,,
no_parkinsons_dementia,,,,,yes;no,,,,,,
no_semantic_dementia,,,,,yes;no,,,,,,
no_corticobasal_syndrome,,,,,yes;no,,,,,,
no_psp,,,,,yes;no,,,,,,
no_pnfa,,,,,yes;no,,,,,,
no_cjd,,,,,yes;no,,,,,,
date_cdr,,,,,,%Y-%m-%d,,,,,
cdr_total,,,,,,,,,,,
cdr_sum_of_boxes,,,,,,,,,,,
mort_date,fp_mortdat,,,,,%Y-%m-%d,,,,,
live_date,fp_date_lastcontact,,,,,%Y-%m-%d,,,,,
mort,fp_vitalstatus,,,1.0;0.0,true;false,,,,,,
date_vitals,e4_3494,,,,,%Y-%m-%d,,,,,
sbp,e4_systolicBP,,,,,,,,,,
dbp,e4_diastolicBP,,,,,,,,,,
bmi,,,,,,,,,,,
weight,e4_230,,,,,,,,,,
height,e4_229,,,,,,,,,,
waist,,,,,,,,,,,
date_comorbidities,e4_3494,,,,,%Y-%m-%d,,,,,
hypertension,e4_HT2018,,,1.0;0.0,yes;no,,BP>140/90 or BP lowering med,,,,
hypercholesterolemia,,,,,yes;no,,,,,,
dm_1,,,,,yes;no,,,,,,
dm_2,,,,,yes;no,,,,,,
dm,diabetes_E4,,,1.0;0.0,yes;no,,,,,,
myocardial_infarction,,,,,yes;no,,,,,,
cardiovascular_disease,,,,,yes;no,,,,,,
heart_failure,,,,,yes;no,,,,,,
stroke,,,,,yes;no,,,,,,
no_dm_1,,,,,yes;no,,,,,,
no_dm_2,,,,,yes;no,,,,,,
no_dm,diabetes_E4,,,1.0;0.0,yes;no,,,,,,
no_myocardial_infarction,,,,,yes;no,,,,,,
no_heart_failure,,,,,yes;no,,,,,,
no_stroke,,,,,yes;no,,,,,,
drugs_hypertension,e4_bpldrug,,,1.0;0.0,yes;no,,,,,,
drugs_hypercholesterolemia,e4_c10,,,1.0;0.0,yes;no,,,,,,
drugs_diabetes,e4_a10,,,1.0;0.0,yes;no,,,,,,
date_blood,e4_3494,,,,,%Y-%m-%d,,,,,
glucose_fasted,e4_3846,,,,,,,,,,
glucose_nonfasted,,,,,,,,,,,
glucose_abnormal,,,,,yes;no,,,,,,
no_glucose_abnormal,,,,,yes;no,,,,,,
glucose_cutoff,,,,,,,,,,,
hdl,e4_4107,,,,,,,,,,
ldl,,,,,,,,,,,
hdl_ratio,,,,,,,,,,,
crp,e4_18452,,,,,,,,,,
date_habits,e4_3493,,,,,%Y-%m-%d,,,,,
alcohol,e4_Alc_Tot,,,True;False,yes;no,,,,,0,
smoking_behavior,smoking_e4,,,2.0;1.0;0.0,current;past;never,,,,,,
smoker,smoking_e4,,,2.0;1.0;0.0,yes;no;no,,,,,,
physical_activity,,,,,,,,,,,
apoe_date,,,,,,,,,,,
apoe_carrier,,,,,yes;no,,,,,,
apoe_genotype,apoe,,,22.0;23.0;33.0;34.0;24.0;44.0,2/2;2/3;3/3;3/4;2/4;4/4,,,,,,
date_lp,,,,,,%Y-%m-%d,,,,,
csf_assay_amyloid,,,,,luminex;innogetics Elisa;Elecsys;Innotest;Euroimmun,,,,,,
csf_ab_total_1_42,,,,,,,,,,,
csf_ab_total_ratio_42_40,,,,,,,,,,,
csf_ab_total_1_38,,,,,,,,,,,
amy_abnormal,,,,,yes;no,,,,,,
no_amy_abnormal,,,,,yes;no,,,,,,
amy_cutoff,,,,,,,,,,,
csf_assay_tau,,,,,luminex;innogetics Elisa;Elecsys;Innotest;Euroimmun,,,,,,
csf_ttau,,,,,,,,,,,
ttau_abnormal,,,,,yes;no,,,,,,
no_ttau_abnormal,,,,,yes;no,,,,,,
ttau_cutoff,,,,,,,,,,,
csf_ptau,,,,,,,,,,,
ptau_abnormal,,,,,yes;no,,,,,,
no_ptau_abnormal,,,,,yes;no,,,,,,
ptau_cutoff,,,,,,,,,,,
date_pet,,,,,,%Y-%m-%d,,,,,
pet_tracer,,,,,PiB;Florbetapir;AV-45,,,,,,
pet_assesment,,,,,quantitative;visual,,,,,,
pet_level_suvr,,,,,,,,,,,
pet_level_bpnd,,,,,,,,,,,
pet_abnormal,,,,,yes;no,,,,,,
no_pet_abnormal,,,,,yes;no,,,,,,
date_depression,e4_3493,,,,,%Y-%m-%d,,,,,
depression_rating_mini,,,,,,,,,,,
depression_rating_gds_15,,,,,,,,,,,
depression_rating_gds,,,,,,,,,,,
depression_rating_ces_d,e4_cesd-weighted,,,,,,,,,,
depression_rating_phq_9,,,,,,,,,,,
depression_rating_hads,,,,,,,,,,,
depression_rating_sf_36,,,,,,,,,,,
depression,,,,,yes;no,,,,,,
no_depression,,,,,yes;no,,,,,,
depression_cutoff,,,,,,,,,,,
date_anxiety,,,,,,%Y-%m-%d,,,,,
anxiety_rating_mini,,,,,,,,,,,
anxiety_rating_beck_anxiety,,,,,,,,,,,
anxiety_rating_state_trait,,,,,,,,,,,
anxiety_rating_hospital_scale,,,,,,,,,,,
anxiety,,,,,yes;no,,,,,,
no_anxiety,,,,,yes;no,,,,,,
anxiety_cutoff,,,,,,,,,,,
mhi_5_questionnaire,,,,,,,,,,,
lidas_questionnaire,,,,,,,,,,,
npi_questionnaire_frq,,,,,,,,,,,
npi_questionnaire_sev,,,,,,,,,,,
date_mmse,e4_3493,,,,,%Y-%m-%d,,,,,
mmse_total,dmmse,,,,,,,,,,
date_attention,e4_3494,,,,,%Y-%m-%d,,,,,
attention_test_tmt_a_time,,,,,,,,,,,
attention_test_tmt_a_errors,,,,,,,,,,,
attention_test_stroop_1_time,STR1T4,,,,,,,,,,
attention_test_stroop_1_errors,e4_2722,,,,,,,,,,
attention_test_stroop_2_time,STR2T4,,,,,,,,,,
attention_test_stroop_2_errors,e4_2725,,,,,,,,,,
attention_test_stroop_1_adj,STR1T4_adjusted,,,,,,ajusted for number of errors,,,,
attention_test_stroop_2_adj,,,,,,,,,,,
attention_test_sdst_60_correct,,,,,,,,,,,
attention_test_sdst_60_errors,,,,,,,,,,,
attention_test_sdst_120_correct,,,,,,,,,,,
attention_test_sdst_120_errors,,,,,,,,,,,
attention_test_ldst_30_correct,,,,,,,,,,,
attention_test_ldst_30_errors,,,,,,,,,,,
attention_test_ldst_60_correct,LDST4,,,,,,,,,,
attention_test_ldst_60_errors,,,,,,,,,,,
attention_test_ldst_90_correct,,,,,,,,,,,
attention_test_ldst_90_errors,,,,,,,,,,,
alphabet_coding_task,,,,,,,,,,,
date_memory,,,,,,,,,,,
priority_memory_im_ravlt,,,,,,,,,,,
priority_memory_im_cerad,,,,,,,,,,,
priority_memory_im_gb,,,,,,,,,,,
priority_memory_im_sct,,,,,,,,,,,
priority_memory_im_lm,,,,,,,,,,,
priority_memory_im_hopkins,,,,,,,,,,,
priority_memory_im_vat_a,,,,,,,,,,,
priority_memory_im_vat_b,,,,,,,,,,,
priority_memory_im_srb,,,,,,,,,,,
priority_memory_im_rrf,,,,,,,,,,,
priority_memory_im_mmse,,,,,,,,,,,
priority_memory_im_adas,,,,,,,,,,,
priority_memory_im_10_word_list_correct,,,,,,,,,,,
priority_memory_im_10_word_list_errors,,,,,,,,,,,
priority_memory_im_15_word_list_correct,WLTimm4,,,,,,,,,,
priority_memory_im_15_word_list_errors,,,,,,,,,,,
priority_memory_im_pwlt,,,,,,,,,,,
priority_memory_dr_ravlt,,,,,,,,,,,
priority_memory_dr_cerad,,,,,,,,,,,
priority_memory_dr_gb,,,,,,,,,,,
priority_memory_dr_sct,,,,,,,,,,,
priority_memory_dr_lm,,,,,,,,,,,
priority_memory_dr_hopkins,,,,,,,,,,,
priority_memory_dr_vat_a,,,,,,,,,,,
priority_memory_dr_vat_b,,,,,,,,,,,
priority_memory_dr_srb,,,,,,,,,,,
priority_memory_dr_rrf_short,,,,,,,,,,,
priority_memory_dr_rrf_long,,,,,,,,,,,
priority_memory_dr_mmse,,,,,,,,,,,
priority_memory_dr_adas,,,,,,,,,,,
priority_memory_dr_10_word_list_correct,,,,,,,,,,,
priority_memory_dr_10_word_list_errors,,,,,,,,,,,
priority_memory_dr_15_word_list_correct,WLTdel4,,,,,,,,,,
priority_memory_dr_15_word_list_errors,,,,,,,,,,,
priority_memory_de_pwlt,,,,,,,,,,,
date_executive,e4_3494,,,,,%Y-%m-%d,,,,,
priority_executive_tmt_b_time,,,,,,,,,,,
priority_executive_tmt_b_errors,,,,,,,,,,,
priority_executive_stroop_3_time,STR3T4,,,,,,,,,,
priority_executive_stroop_3_errors,e4_2728,,,,,,,,,,
priority_executive_stroop_3_time_adj,STR3T4_adjusted,,,,,,adjusted for errors,,,,
priority_executive_cst_a_time,,,,,,,,,,,
priority_executive_cst_a_errors,,,,,,,,,,,
priority_executive_cst_b_time,,,,,,,,,,,
priority_executive_cst_b_errors,,,,,,,,,,,
priority_executive_cst_c_time,,,,,,,,,,,
priority_executive_cst_c_errors,,,,,,,,,,,
priority_executive_vet,,,,,,,,,,,
priority_executive_bat,,,,,,,,,,,
priority_executive_cijfferreeksspanne,,,,,,,,,,,
priority_executive_vosp,,,,,,,,,,,
priority_executive_wais_3_b,,,,,,,,,,,
priority_executive_wais_3_f,,,,,,,,,,,
date_language,e4_3494,,,,,%Y-%m-%d,,,,,
priority_language_animal_fluency_60_correct,,,,,,,,,,,
priority_language_animal_fluency_60_errors,,,,,,,,,,,
priority_language_animal_fluency_120_correct,,,,,,,,,,,
priority_language_animal_fluency_120_errors,,,,,,,,,,,
priority_language_category_fluency_60,WFT4,,,,,,,,,,
priority_language_letter_fluency_60,,,,,,,,,,,
priority_language_bnt_15,,,,,,,,,,,
priority_language_bnt_30,,,,,,,,,,,
priority_language_bnt_60,,,,,,,,,,,
priority_language_verbal_fluency_60,,,,,,,,,,,
date_fluid_intelligence,,,,,,,,,,,
fluid_intelligence_raven,,,,,,,,,,,
date_dexterity,,,,,,,,,,,
dexterity_purdue_pegboard,,,,,,,,,,,
dexterity_clock_drawing,,,,,,,,,,,
dexterity_cogstate_battery,,,,,,,,,,,
cognitive_impairment_overall,,,,,yes;no,,,,,,
cognitive_impairment_attention,,,,,yes;no,,,,,,
cognitive_impairment_executive,,,,,yes;no,,,,,,
cognitive_impairment_memory,,,,,yes;no,,,,,,
cognitive_impairment_processing,,,,,yes;no,,,,,,
cognitive_score_overall,,,,,,,,,,,
cognitive_score_memory,,,,,,,,,,,
cognitive_score_processing,,,,,,,,,,,
cognitive_score_attention,,,,,,,,,,,
cognitive_score_executive,,,,,,,,,,,
date_plasma,,,,,,,,,,,
p_tau,,,,,,,,,,,
amyloid_b_42,abeta42,,,,,,,,,,
amyloid_b_40,abeta40,,,,,,,,,,
amyloid_b_ratio_42_40,,,,,,,,,,,
gfap,,,,,,,,,,,
nfl,nfl,,,,,,,,,,
e_selectin,,,,,,,,,,,
saa,,,,,,,,,,,
vcam,,,,,,,,,,,
icam,,,,,,,,,,,
il6,,,,,,,,,,,
il8,,,,,,,,,,,
il_1b,,,,,,,,,,,
tnfalpha,,,,,,,,,,,
vwf,,,,,,,,,,,
date_metabolomics,,,,,,,,,,,
metabo_age,,,,,,,,,,,
date_mri,,,,,,,,,,,
brain_age,,,,,,,,,,,
