^C:\USERS\HELLO\DESKTOP\NEW FOLDER (4)\SNAKE\EXECUTION\CLASSICMODE.CPP
/c /ZI /JMC /nologo /W3 /WX- /diagnostics:column /sdl /Od /D _DEBUG /D _CONSOLE /D _UNICODE /D UNICODE /Gm- /EHsc /RTC1 /MDd /GS /fp:precise /permissive- /Zc:wchar_t /Zc:forScope /Zc:inline /Fo"X64\DEBUG\\" /Fd"X64\DEBUG\VC142.PDB" /Gd /TP /FC C:\USERS\HELLO\DESKTOP\NEW FOLDER (4)\SNAKE\EXECUTION\CLASSICMODE.CPP
^C:\USERS\HELLO\DESKTOP\NEW FOLDER (4)\SNAKE\EXECUTION\GAME.CPP
/c /ZI /JMC /nologo /W3 /WX- /diagnostics:column /sdl /Od /D _DEBUG /D _CONSOLE /D _UNICODE /D UNICODE /Gm- /EHsc /RTC1 /MDd /GS /fp:precise /permissive- /Zc:wchar_t /Zc:forScope /Zc:inline /Fo"X64\DEBUG\\" /Fd"X64\DEBUG\VC142.PDB" /Gd /TP /FC C:\USERS\HELLO\DESKTOP\NEW FOLDER (4)\SNAKE\EXECUTION\GAME.CPP
^C:\USERS\HELLO\DESKTOP\NEW FOLDER (4)\SNAKE\EXECUTION\MODE.CPP
/c /ZI /JMC /nologo /W3 /WX- /diagnostics:column /sdl /Od /D _DEBUG /D _CONSOLE /D _UNICODE /D UNICODE /Gm- /EHsc /RTC1 /MDd /GS /fp:precise /permissive- /Zc:wchar_t /Zc:forScope /Zc:inline /Fo"X64\DEBUG\\" /Fd"X64\DEBUG\VC142.PDB" /Gd /TP /FC C:\USERS\HELLO\DESKTOP\NEW FOLDER (4)\SNAKE\EXECUTION\MODE.CPP
^C:\USERS\HELLO\DESKTOP\NEW FOLDER (4)\SNAKE\EXECUTION\SCREEN.CPP
/c /ZI /JMC /nologo /W3 /WX- /diagnostics:column /sdl /Od /D _DEBUG /D _CONSOLE /D _UNICODE /D UNICODE /Gm- /EHsc /RTC1 /MDd /GS /fp:precise /permissive- /Zc:wchar_t /Zc:forScope /Zc:inline /Fo"X64\DEBUG\\" /Fd"X64\DEBUG\VC142.PDB" /Gd /TP /FC C:\USERS\HELLO\DESKTOP\NEW FOLDER (4)\SNAKE\EXECUTION\SCREEN.CPP
^C:\USERS\HELLO\DESKTOP\NEW FOLDER (4)\SNAKE\EXECUTION\SOURCE.CPP
/c /ZI /JMC /nologo /W3 /WX- /diagnostics:column /sdl /Od /D _DEBUG /D _CONSOLE /D _UNICODE /D UNICODE /Gm- /EHsc /RTC1 /MDd /GS /fp:precise /permissive- /Zc:wchar_t /Zc:forScope /Zc:inline /Fo"X64\DEBUG\\" /Fd"X64\DEBUG\VC142.PDB" /Gd /TP /FC C:\USERS\HELLO\DESKTOP\NEW FOLDER (4)\SNAKE\EXECUTION\SOURCE.CPP
