key,id_x,date,value,stationId,param/paramName,param/paramFormula,param/paramCode,param/idParam,id_y,stationName,gegrLat,gegrLon,city_name,communeName,districtName,provinceName,addressStreet
SO2,672,2024-01-27 18:00:00,2.38661,117,dwutlenek siarki,SO2,SO2,1,117,"Wrocław, wyb. Conrada-Korzeniowskiego",51.129378,17.02925,Wrocław,Wrocław,Wrocław,DOLNOŚLĄSKIE,ul. Wyb. J.Conrada-Korzeniowskiego 18
PM2.5,670,2024-01-27 18:00:00,8.32718,117,pył zawieszony PM2.5,PM2.5,PM2.5,69,117,"Wrocław, wyb. Conrada-Korzeniowskiego",51.129378,17.02925,Wrocław,Wrocław,Wrocław,DOLNOŚLĄSKIE,ul. Wyb. J.Conrada-Korzeniowskiego 18
PM10,14395,2024-01-27 18:00:00,10.8168,117,pył zawieszony PM10,PM10,PM10,3,117,"Wrocław, wyb. Conrada-Korzeniowskiego",51.129378,17.02925,Wrocław,Wrocław,Wrocław,DOLNOŚLĄSKIE,ul. Wyb. J.Conrada-Korzeniowskiego 18
SO2,297,2024-01-27 18:00:00,3.13215,52,dwutlenek siarki,SO2,SO2,1,52,"Legnica, al. Rzeczypospolitej",51.204503,16.180513,Legnica,Legnica,Legnica,DOLNOŚLĄSKIE,al. Rzeczypospolitej 10/12
SO2,621,2024-01-27 18:00:00,4.65203,109,dwutlenek siarki,SO2,SO2,1,109,"Wałbrzych, ul. Wysockiego",50.768729,16.269677,Wałbrzych,Wałbrzych,Wałbrzych,DOLNOŚLĄSKIE,ul. Wysockiego 11
PM10,224,2024-01-27 18:00:00,16.5041,38,pył zawieszony PM10,PM10,PM10,3,38,"Kłodzko, ul. Szkolna",50.433493,16.65366,Kłodzko,Kłodzko,kłodzki,DOLNOŚLĄSKIE,ul. Szkolna 8
PM2.5,25988,2024-01-27 18:00:00,11.6152,38,pył zawieszony PM2.5,PM2.5,PM2.5,69,38,"Kłodzko, ul. Szkolna",50.433493,16.65366,Kłodzko,Kłodzko,kłodzki,DOLNOŚLĄSKIE,ul. Szkolna 8
SO2,450,2024-01-27 18:00:00,5.99682,74,dwutlenek siarki,SO2,SO2,1,74,Osieczów,51.31763,15.431719,Osieczów,Osiecznica,bolesławiecki,DOLNOŚLĄSKIE, 
PM10,14730,2024-01-27 18:00:00,12.4933,9153,pył zawieszony PM10,PM10,PM10,3,9153,"Jelenia Góra, ul. Ogińskiego",50.913433,15.765608,Jelenia Góra,Jelenia Góra,Jelenia Góra,DOLNOŚLĄSKIE,ul. Ogińskiego 6
PM2.5,14731,2024-01-27 18:00:00,11.3331,9153,pył zawieszony PM2.5,PM2.5,PM2.5,69,9153,"Jelenia Góra, ul. Ogińskiego",50.913433,15.765608,Jelenia Góra,Jelenia Góra,Jelenia Góra,DOLNOŚLĄSKIE,ul. Ogińskiego 6
SO2,14733,2024-01-27 18:00:00,5.82662,9153,dwutlenek siarki,SO2,SO2,1,9153,"Jelenia Góra, ul. Ogińskiego",50.913433,15.765608,Jelenia Góra,Jelenia Góra,Jelenia Góra,DOLNOŚLĄSKIE,ul. Ogińskiego 6
PM10,21642,2024-01-27 18:00:00,11.2125,12056,pył zawieszony PM10,PM10,PM10,3,12056,"Chojnów, ul. S. Małachowskiego ",51.27428,15.929804,Chojnów,Chojnów,legnicki,DOLNOŚLĄSKIE,S. Małachowskiego 7
PM2.5,21644,2024-01-27 18:00:00,9.95875,12056,pył zawieszony PM2.5,PM2.5,PM2.5,69,12056,"Chojnów, ul. S. Małachowskiego ",51.27428,15.929804,Chojnów,Chojnów,legnicki,DOLNOŚLĄSKIE,S. Małachowskiego 7
PM10,29567,2024-01-27 18:00:00,26.8571,17780,pył zawieszony PM10,PM10,PM10,3,17780,"Kudowa-Zdrój, ul. Szkolna ",50.438363,16.243756,Kudowa-Zdrój,Kudowa-Zdrój,kłodzki,DOLNOŚLĄSKIE,Szkolna 8
PM2.5,29568,2024-01-27 18:00:00,17.8477,17780,pył zawieszony PM2.5,PM2.5,PM2.5,69,17780,"Kudowa-Zdrój, ul. Szkolna ",50.438363,16.243756,Kudowa-Zdrój,Kudowa-Zdrój,kłodzki,DOLNOŚLĄSKIE,Szkolna 8
PM10,965,2024-01-27 18:00:00,16.7,156,pył zawieszony PM10,PM10,PM10,3,156,"Bydgoszcz, pl. Poznański",53.121764,17.987906,Bydgoszcz,Bydgoszcz,Bydgoszcz,KUJAWSKO-POMORSKIE,Plac Poznański
PM2.5,966,2024-01-27 18:00:00,4.3,156,pył zawieszony PM2.5,PM2.5,PM2.5,69,156,"Bydgoszcz, pl. Poznański",53.121764,17.987906,Bydgoszcz,Bydgoszcz,Bydgoszcz,KUJAWSKO-POMORSKIE,Plac Poznański
PM10,995,2024-01-27 18:00:00,16.5,158,pył zawieszony PM10,PM10,PM10,3,158,"Bydgoszcz, ul. Warszawska",53.134083,17.995708,Bydgoszcz,Bydgoszcz,Bydgoszcz,KUJAWSKO-POMORSKIE,ul. Warszawska 10
PM2.5,996,2024-01-27 18:00:00,13.0,158,pył zawieszony PM2.5,PM2.5,PM2.5,69,158,"Bydgoszcz, ul. Warszawska",53.134083,17.995708,Bydgoszcz,Bydgoszcz,Bydgoszcz,KUJAWSKO-POMORSKIE,ul. Warszawska 10
SO2,998,2024-01-27 18:00:00,3.2,158,dwutlenek siarki,SO2,SO2,1,158,"Bydgoszcz, ul. Warszawska",53.134083,17.995708,Bydgoszcz,Bydgoszcz,Bydgoszcz,KUJAWSKO-POMORSKIE,ul. Warszawska 10
PM10,26111,2024-01-27 18:00:00,51.9978,16237,pył zawieszony PM10,PM10,PM10,3,16237,"Lubsko, ul. Strzelecka",51.784252,14.958101,Lubsko,Lubsko,żarski,LUBUSKIE,ul. Strzelecka
PM2.5,26117,2024-01-27 18:00:00,46.651,16237,pył zawieszony PM2.5,PM2.5,PM2.5,69,16237,"Lubsko, ul. Strzelecka",51.784252,14.958101,Lubsko,Lubsko,żarski,LUBUSKIE,ul. Strzelecka
PM10,2069,2024-01-27 18:00:00,10.0,295,pył zawieszony PM10,PM10,PM10,3,295,"Łódź, ul. Czernika",51.75805,19.529786,Łódź,Łódź,Łódź,ŁÓDZKIE,ul. Czernika 1/3
PM2.5,2071,2024-01-27 18:00:00,8.0,295,pył zawieszony PM2.5,PM2.5,PM2.5,69,295,"Łódź, ul. Czernika",51.75805,19.529786,Łódź,Łódź,Łódź,ŁÓDZKIE,ul. Czernika 1/3
SO2,2088,2024-01-27 18:00:00,3.4,296,dwutlenek siarki,SO2,SO2,1,296,"Łódź, ul. Gdańska",51.775378,19.450992,Łódź,Łódź,Łódź,ŁÓDZKIE,ul. Gdańska 16
PM10,2087,2024-01-27 18:00:00,9.6,296,pył zawieszony PM10,PM10,PM10,3,296,"Łódź, ul. Gdańska",51.775378,19.450992,Łódź,Łódź,Łódź,ŁÓDZKIE,ul. Gdańska 16
PM10,2199,2024-01-27 18:00:00,15.0,314,pył zawieszony PM10,PM10,PM10,3,314,"Pabianice, ul. Konstantynowska",51.667981,19.368683,Pabianice,Pabianice,pabianicki,ŁÓDZKIE,ul. Konstantynowska
PM10,2377,2024-01-27 18:00:00,56.5,355,pył zawieszony PM10,PM10,PM10,3,355,"Zgierz, ul. Mielczarskiego",51.856692,19.421231,Zgierz,Zgierz,zgierski,ŁÓDZKIE,ul. Mielczarskiego 1
PM2.5,2378,2024-01-27 18:00:00,47.4,355,pył zawieszony PM2.5,PM2.5,PM2.5,69,355,"Zgierz, ul. Mielczarskiego",51.856692,19.421231,Zgierz,Zgierz,zgierski,ŁÓDZKIE,ul. Mielczarskiego 1
SO2,2382,2024-01-27 18:00:00,15.5,355,dwutlenek siarki,SO2,SO2,1,355,"Zgierz, ul. Mielczarskiego",51.856692,19.421231,Zgierz,Zgierz,zgierski,ŁÓDZKIE,ul. Mielczarskiego 1
PM10,16250,2024-01-27 18:00:00,17.0,10058,pył zawieszony PM10,PM10,PM10,3,10058,"Łódź, al. Jana Pawła II",51.754613,19.434925,Łódź,Łódź,Łódź,ŁÓDZKIE,al. Jana Pawła II 15
SO2,2039,2024-01-27 18:00:00,2.1,291,dwutlenek siarki,SO2,SO2,1,291,"Gajew, Ujęcie Wody",52.143258,19.233217,Gajew,Witonia,łęczycki,ŁÓDZKIE,Ujęcie wody
SO2,2222,2024-01-27 18:00:00,3.2,319,dwutlenek siarki,SO2,SO2,1,319,"Parzniewice, Ujęcie Wody",51.291175,19.517556,Parzniewice,Wola Krzysztoporska,piotrkowski,ŁÓDZKIE,Ujęcie wody
PM10,2245,2024-01-27 18:00:00,22.0,322,pył zawieszony PM10,PM10,PM10,3,322,"Piotrków Trybunalski, ul. Krakowskie Przedmieście",51.404406,19.696956,Piotrków Trybunalski,Piotrków Trybunalski,Piotrków Trybunalski,ŁÓDZKIE,ul. Krakowskie Przedmieście 13
PM10,16630,2024-01-27 18:00:00,35.0,331,pył zawieszony PM10,PM10,PM10,3,331,"Radomsko, ul. Rolna",51.067417,19.448714,Radomsko,Radomsko,radomszczański,ŁÓDZKIE,ul. Rolna 2
SO2,16633,2024-01-27 18:00:00,11.21,331,dwutlenek siarki,SO2,SO2,1,331,"Radomsko, ul. Rolna",51.067417,19.448714,Radomsko,Radomsko,radomszczański,ŁÓDZKIE,ul. Rolna 2
PM2.5,21363,2024-01-27 18:00:00,22.0,331,pył zawieszony PM2.5,PM2.5,PM2.5,69,331,"Radomsko, ul. Rolna",51.067417,19.448714,Radomsko,Radomsko,radomszczański,ŁÓDZKIE,ul. Rolna 2
PM10,3802,2024-01-27 18:00:00,11.5,562,pył zawieszony PM10,PM10,PM10,3,562,"Żyrardów, ul. Roosevelta",52.053811,20.429892,Żyrardów,Żyrardów,żyrardowski,MAZOWIECKIE,ul. Roosevelta 2
PM2.5,14379,2024-01-27 18:00:00,10.5,562,pył zawieszony PM2.5,PM2.5,PM2.5,69,562,"Żyrardów, ul. Roosevelta",52.053811,20.429892,Żyrardów,Żyrardów,żyrardowski,MAZOWIECKIE,ul. Roosevelta 2
PM10,17276,2024-01-27 18:00:00,1.8,9913,pył zawieszony PM10,PM10,PM10,3,9913,Guty Duże,52.943172,21.288167,Guty Duże,Czerwonka,makowski,MAZOWIECKIE,Guty Duże 4
SO2,16043,2024-01-27 18:00:00,1.9,9913,dwutlenek siarki,SO2,SO2,1,9913,Guty Duże,52.943172,21.288167,Guty Duże,Czerwonka,makowski,MAZOWIECKIE,Guty Duże 4
SO2,20365,2024-01-27 18:00:00,1.7,11358,dwutlenek siarki,SO2,SO2,1,11358,"Biała, ul. Kmicica",52.602534,19.6451,Biała,Stara Biała,płocki,MAZOWIECKIE,ul. Andrzeja Kmicica 33
PM2.5,28812,2024-01-27 18:00:00,4.6,11358,pył zawieszony PM2.5,PM2.5,PM2.5,69,11358,"Biała, ul. Kmicica",52.602534,19.6451,Biała,Stara Biała,płocki,MAZOWIECKIE,ul. Andrzeja Kmicica 33
PM10,27292,2024-01-27 18:00:00,5.6,11358,pył zawieszony PM10,PM10,PM10,3,11358,"Biała, ul. Kmicica",52.602534,19.6451,Biała,Stara Biała,płocki,MAZOWIECKIE,ul. Andrzeja Kmicica 33
PM2.5,26261,2024-01-27 18:00:00,6.6,16271,pył zawieszony PM2.5,PM2.5,PM2.5,69,16271,"Konstancin-Jeziorna, ul. Żeromskiego",52.082277,21.124598,Konstancin-Jeziorna,Konstancin-Jeziorna,piaseczyński,MAZOWIECKIE,Żeromskiego
PM10,26262,2024-01-27 18:00:00,8.6,16271,pył zawieszony PM10,PM10,PM10,3,16271,"Konstancin-Jeziorna, ul. Żeromskiego",52.082277,21.124598,Konstancin-Jeziorna,Konstancin-Jeziorna,piaseczyński,MAZOWIECKIE,Żeromskiego
PM10,28500,2024-01-27 18:00:00,6.1,17160,pył zawieszony PM10,PM10,PM10,3,17160,"Pułtusk, ul. Mickiewicza",52.703591,21.072603,Pułtusk,Pułtusk,pułtuski,MAZOWIECKIE,ul. Mickiewicza 36
PM2.5,28523,2024-01-27 18:00:00,5.4,17160,pył zawieszony PM2.5,PM2.5,PM2.5,69,17160,"Pułtusk, ul. Mickiewicza",52.703591,21.072603,Pułtusk,Pułtusk,pułtuski,MAZOWIECKIE,ul. Mickiewicza 36
SO2,16149,2024-01-27 18:00:00,1.73681,590,dwutlenek siarki,SO2,SO2,1,590,"Opole, os. Armii Krajowej",50.676856,17.950278,Opole,Opole,Opole,OPOLSKIE,os. Armii Krajowej
PM10,16147,2024-01-27 18:00:00,22.9714,10374,pył zawieszony PM10,PM10,PM10,3,10374,"Opole, ul. Koszyka",50.666736,17.899137,Opole,Opole,Opole,OPOLSKIE,ul. Koszyka 21
PM2.5,25986,2024-01-27 18:00:00,17.3788,10374,pył zawieszony PM2.5,PM2.5,PM2.5,69,10374,"Opole, ul. Koszyka",50.666736,17.899137,Opole,Opole,Opole,OPOLSKIE,ul. Koszyka 21
PM10,3843,2024-01-27 18:00:00,14.8651,568,pył zawieszony PM10,PM10,PM10,3,568,"Kędzierzyn-Koźle, ul. Śmiałego",50.349608,18.236575,Kędzierzyn-Koźle,Kędzierzyn-Koźle,kędzierzyńsko-kozielski,OPOLSKIE,ul. Bolesława Śmiałego 5
PM2.5,3844,2024-01-27 18:00:00,8.10686,568,pył zawieszony PM2.5,PM2.5,PM2.5,69,568,"Kędzierzyn-Koźle, ul. Śmiałego",50.349608,18.236575,Kędzierzyn-Koźle,Kędzierzyn-Koźle,kędzierzyńsko-kozielski,OPOLSKIE,ul. Bolesława Śmiałego 5
SO2,3847,2024-01-27 18:00:00,4.80128,568,dwutlenek siarki,SO2,SO2,1,568,"Kędzierzyn-Koźle, ul. Śmiałego",50.349608,18.236575,Kędzierzyn-Koźle,Kędzierzyn-Koźle,kędzierzyńsko-kozielski,OPOLSKIE,ul. Bolesława Śmiałego 5
PM10,3902,2024-01-27 18:00:00,13.391,584,pył zawieszony PM10,PM10,PM10,3,584,"Olesno, ul. Słowackiego",50.876983,18.416878,Olesno,Olesno,oleski,OPOLSKIE,ul. Słowackiego
PM10,3970,2024-01-27 18:00:00,14.785,600,pył zawieszony PM10,PM10,PM10,3,600,"Zdzieszowice, ul. Piastów",50.423533,18.120739,Zdzieszowice,Zdzieszowice,krapkowicki,OPOLSKIE,ul. Piastów 6
PM2.5,27333,2024-01-27 18:00:00,10.7863,8976,pył zawieszony PM2.5,PM2.5,PM2.5,69,8976,"Nysa, ul. Rodziewiczówny",50.458989,17.331906,Nysa,Nysa,nyski,OPOLSKIE,ul. Rodziewiczówny 1
PM10,21683,2024-01-27 18:00:00,16.4164,8976,pył zawieszony PM10,PM10,PM10,3,8976,"Nysa, ul. Rodziewiczówny",50.458989,17.331906,Nysa,Nysa,nyski,OPOLSKIE,ul. Rodziewiczówny 1
PM10,26926,2024-01-27 18:00:00,16.2095,10018,pył zawieszony PM10,PM10,PM10,3,10018,"Głubczyce, ul. Ratuszowa",50.200778,17.83051,Głubczyce,Głubczyce,głubczycki,OPOLSKIE,ul. Ratuszowa 9
PM2.5,25941,2024-01-27 18:00:00,8.54815,16181,pył zawieszony PM2.5,PM2.5,PM2.5,69,16181,"Strzelce Opolskie, ul. Kard. Wyszyńskiego",50.509334,18.288206,Strzelce Opolskie,Strzelce Opolskie,strzelecki,OPOLSKIE,ul. Kardynała Wyszyńskiego 12
PM10,25940,2024-01-27 18:00:00,12.0153,16181,pył zawieszony PM10,PM10,PM10,3,16181,"Strzelce Opolskie, ul. Kard. Wyszyńskiego",50.509334,18.288206,Strzelce Opolskie,Strzelce Opolskie,strzelecki,OPOLSKIE,ul. Kardynała Wyszyńskiego 12
PM10,26935,2024-01-27 18:00:00,7.7698,16413,pył zawieszony PM10,PM10,PM10,3,16413,"Brzeg, ul. Poprzeczna",50.849509,17.462579,Brzeg,Brzeg,brzeski,OPOLSKIE,ul. Poprzeczna 1
SO2,4391,2024-01-27 18:00:00,1.7601,671,dwutlenek siarki,SO2,SO2,1,671,"Rzeszów, ul. Rejtana",50.024242,22.010575,Rzeszów,Rzeszów,Rzeszów,PODKARPACKIE,Rejtana
PM2.5,20277,2024-01-27 18:00:00,10.6582,10125,pył zawieszony PM2.5,PM2.5,PM2.5,69,10125,"Rzeszów, ul. Piłsudskiego",50.040675,22.004656,Rzeszów,Rzeszów,Rzeszów,PODKARPACKIE,Piłsudskiego
PM10,16344,2024-01-27 18:00:00,10.8802,10125,pył zawieszony PM10,PM10,PM10,3,10125,"Rzeszów, ul. Piłsudskiego",50.040675,22.004656,Rzeszów,Rzeszów,Rzeszów,PODKARPACKIE,Piłsudskiego
PM10,28486,2024-01-27 18:00:00,10.6609,17159,pył zawieszony PM10,PM10,PM10,3,17159,"Rzeszów, ul. Słocińska",50.024856,22.047937,Rzeszów,Rzeszów,Rzeszów,PODKARPACKIE,Słocińska 4
PM2.5,28487,2024-01-27 18:00:00,7.84623,17159,pył zawieszony PM2.5,PM2.5,PM2.5,69,17159,"Rzeszów, ul. Słocińska",50.024856,22.047937,Rzeszów,Rzeszów,Rzeszów,PODKARPACKIE,Słocińska 4
PM10,28488,2024-01-27 18:00:00,4.86062,17179,pył zawieszony PM10,PM10,PM10,3,17179,"Rzeszów, ul. Starzyńskiego",50.060381,21.980511,Rzeszów,Rzeszów,Rzeszów,PODKARPACKIE,Starzyńskiego 17
PM2.5,28489,2024-01-27 18:00:00,4.58234,17179,pył zawieszony PM2.5,PM2.5,PM2.5,69,17179,"Rzeszów, ul. Starzyńskiego",50.060381,21.980511,Rzeszów,Rzeszów,Rzeszów,PODKARPACKIE,Starzyńskiego 17
PM10,20236,2024-01-27 18:00:00,25.1726,631,pył zawieszony PM10,PM10,PM10,3,631,"Jarosław, ul. Pruchnicka",50.012083,22.674772,Jarosław,Jarosław,jarosławski,PODKARPACKIE,Pruchnicka
PM2.5,20218,2024-01-27 18:00:00,21.3276,631,pył zawieszony PM2.5,PM2.5,PM2.5,69,631,"Jarosław, ul. Pruchnicka",50.012083,22.674772,Jarosław,Jarosław,jarosławski,PODKARPACKIE,Pruchnicka
PM10,14416,2024-01-27 18:00:00,11.7402,659,pył zawieszony PM10,PM10,PM10,3,659,"Nisko, ul. Szklarniowa",50.529892,22.112467,Nisko,Nisko,niżański,PODKARPACKIE,Szklarniowa
PM2.5,25910,2024-01-27 18:00:00,11.713,659,pył zawieszony PM2.5,PM2.5,PM2.5,69,659,"Nisko, ul. Szklarniowa",50.529892,22.112467,Nisko,Nisko,niżański,PODKARPACKIE,Szklarniowa
PM10,4336,2024-01-27 18:00:00,13.4521,665,pył zawieszony PM10,PM10,PM10,3,665,"Przemyśl, ul. Grunwaldzka",49.784339,22.756239,Przemyśl,Przemyśl,Przemyśl,PODKARPACKIE,Grunwaldzka
PM2.5,4338,2024-01-27 18:00:00,12.8976,665,pył zawieszony PM2.5,PM2.5,PM2.5,69,665,"Przemyśl, ul. Grunwaldzka",49.784339,22.756239,Przemyśl,Przemyśl,Przemyśl,PODKARPACKIE,Grunwaldzka
SO2,4339,2024-01-27 18:00:00,1.79846,665,dwutlenek siarki,SO2,SO2,1,665,"Przemyśl, ul. Grunwaldzka",49.784339,22.756239,Przemyśl,Przemyśl,Przemyśl,PODKARPACKIE,Grunwaldzka
PM10,5721,2024-01-27 18:00:00,67.2964,870,pył zawieszony PM10,PM10,PM10,3,870," Gołdap, ul. Jaćwieska",54.305908,22.307681,Gołdap,Gołdap,gołdapski,WARMIŃSKO-MAZURSKIE,ul. Jaćwieska 17
SO2,16396,2024-01-27 18:00:00,0.17614,882,dwutlenek siarki,SO2,SO2,1,882,"Diabla Góra, Puszcza Borecka",54.124819,22.038056,Diabla Góra,Kruklanki,giżycki,WARMIŃSKO-MAZURSKIE,Diabla Góra
SO2,16214,2024-01-27 18:00:00,9.08693,10005,dwutlenek siarki,SO2,SO2,1,10005,"Ełk, ul. Piłsudskiego",53.828389,22.348338,Ełk,Ełk,ełcki,WARMIŃSKO-MAZURSKIE,ul. Piłsudskiego 27
PM10,16173,2024-01-27 18:00:00,7.72354,10005,pył zawieszony PM10,PM10,PM10,3,10005,"Ełk, ul. Piłsudskiego",53.828389,22.348338,Ełk,Ełk,ełcki,WARMIŃSKO-MAZURSKIE,ul. Piłsudskiego 27
PM2.5,27606,2024-01-27 18:00:00,7.57246,10005,pył zawieszony PM2.5,PM2.5,PM2.5,69,10005,"Ełk, ul. Piłsudskiego",53.828389,22.348338,Ełk,Ełk,ełcki,WARMIŃSKO-MAZURSKIE,ul. Piłsudskiego 27
PM10,16178,2024-01-27 18:00:00,4.40944,10030,pył zawieszony PM10,PM10,PM10,3,10030,"Ostróda, ul. Piłsudskiego",53.694587,19.969041,Ostróda,Ostróda,ostródzki,WARMIŃSKO-MAZURSKIE,Piłsudskiego 4
PM2.5,29516,2024-01-27 18:00:00,7.1841,17741,pył zawieszony PM2.5,PM2.5,PM2.5,69,17741,"Działdowo, ul. Polna",53.230042,20.168666,Działdowo,Działdowo,działdowski,WARMIŃSKO-MAZURSKIE,Polna 11
PM10,29514,2024-01-27 18:00:00,9.66936,17741,pył zawieszony PM10,PM10,PM10,3,17741,"Działdowo, ul. Polna",53.230042,20.168666,Działdowo,Działdowo,działdowski,WARMIŃSKO-MAZURSKIE,Polna 11
PM10,6085,2024-01-27 18:00:00,15.8254,944,pył zawieszony PM10,PM10,PM10,3,944,"Poznań, ul. Dąbrowskiego",52.420319,16.877289,Poznań,Poznań,Poznań,WIELKOPOLSKIE,ul. Dąbrowskiego 169
PM2.5,20176,2024-01-27 18:00:00,13.703,944,pył zawieszony PM2.5,PM2.5,PM2.5,69,944,"Poznań, ul. Dąbrowskiego",52.420319,16.877289,Poznań,Poznań,Poznań,WIELKOPOLSKIE,ul. Dąbrowskiego 169
PM10,26996,2024-01-27 18:00:00,12.0301,16493,pył zawieszony PM10,PM10,PM10,3,16493,Poznań ul. Szwajcarska,52.390879,16.998053,Poznań,Poznań,Poznań,WIELKOPOLSKIE,ul. Szwajcarska
PM2.5,26997,2024-01-27 18:00:00,8.01853,16493,pył zawieszony PM2.5,PM2.5,PM2.5,69,16493,Poznań ul. Szwajcarska,52.390879,16.998053,Poznań,Poznań,Poznań,WIELKOPOLSKIE,ul. Szwajcarska
SO2,6168,2024-01-27 18:00:00,4.01977,952,dwutlenek siarki,SO2,SO2,1,952,"Kalisz, ul. Wyszyńskiego",51.74795,18.049063,Kalisz,Kalisz,Kalisz,WIELKOPOLSKIE,ul. Wyszyńskiego
PM2.5,6165,2024-01-27 18:00:00,13.1603,952,pył zawieszony PM2.5,PM2.5,PM2.5,69,952,"Kalisz, ul. Wyszyńskiego",51.74795,18.049063,Kalisz,Kalisz,Kalisz,WIELKOPOLSKIE,ul. Wyszyńskiego
PM10,14972,2024-01-27 18:00:00,15.1859,952,pył zawieszony PM10,PM10,PM10,3,952,"Kalisz, ul. Wyszyńskiego",51.74795,18.049063,Kalisz,Kalisz,Kalisz,WIELKOPOLSKIE,ul. Wyszyńskiego
PM10,5904,2024-01-27 18:00:00,11.823,902,pył zawieszony PM10,PM10,PM10,3,902,"Konin, ul. Wyszyńskiego",52.22565,18.268927,Konin,Konin,Konin,WIELKOPOLSKIE,ul. Wyszyńskiego 3
PM10,14893,2024-01-27 18:00:00,11.8984,920,pył zawieszony PM10,PM10,PM10,3,920,"Pila, ul. Kusocińskiego",53.154408,16.759572,Piła,Piła,pilski,WIELKOPOLSKIE,ul. Kusocińskiego 10A
SO2,6108,2024-01-27 18:00:00,2.89265,946,dwutlenek siarki,SO2,SO2,1,946,"Piaski, Krzyżówka",52.501318,17.773175,Krzyżówka,Witkowo,gnieźnieński,WIELKOPOLSKIE,Piaski 10
PM10,14892,2024-01-27 18:00:00,16.0567,950,pył zawieszony PM10,PM10,PM10,3,950,"Borówiec, ul. Drapałka",52.27672,17.074187,Borówiec,Kórnik,poznański,WIELKOPOLSKIE,ul. Drapałka 4
PM10,21686,2024-01-27 18:00:00,20.9857,9218,pył zawieszony PM10,PM10,PM10,3,9218,"Pleszew, Al. Mickiewicza",51.884922,17.791106,Pleszew,Pleszew,pleszewski,WIELKOPOLSKIE,al. Mickiewicza
SO2,17945,2024-01-27 18:00:00,1.5419,10834,dwutlenek siarki,SO2,SO2,1,10834,"Koziegłowy, os.Leśne",52.449295,16.999634,Koziegłowy,Czerwonak,poznański,WIELKOPOLSKIE,osiedle Leśne 22
PM10,17958,2024-01-27 18:00:00,14.7248,10834,pył zawieszony PM10,PM10,PM10,3,10834,"Koziegłowy, os.Leśne",52.449295,16.999634,Koziegłowy,Czerwonak,poznański,WIELKOPOLSKIE,osiedle Leśne 22
PM10,26998,2024-01-27 18:00:00,25.387,16495,pył zawieszony PM10,PM10,PM10,3,16495,"Mosina, ul. Czereśniowa",52.241497,16.865125,Mosina,Mosina,poznański,WIELKOPOLSKIE,ul. Czereśniowa 4
PM10,29267,2024-01-27 18:00:00,23.1984,17438,pył zawieszony PM10,PM10,PM10,3,17438,"Kościan, ul. Maya",52.090436,16.636381,Kościan,Kościan,kościański,WIELKOPOLSKIE,Maya
PM2.5,29268,2024-01-27 18:00:00,19.2594,17438,pył zawieszony PM2.5,PM2.5,PM2.5,69,17438,"Kościan, ul. Maya",52.090436,16.636381,Kościan,Kościan,kościański,WIELKOPOLSKIE,Maya
PM10,6352,2024-01-27 18:00:00,17.9807,986,pył zawieszony PM10,PM10,PM10,3,986,"Szczecin, ul. Andrzejewskiego",53.380975,14.663347,Szczecin,Szczecin,Szczecin,ZACHODNIOPOMORSKIE,ul. Andrzejewskiego 23
PM2.5,6354,2024-01-27 18:00:00,11.8002,986,pył zawieszony PM2.5,PM2.5,PM2.5,69,986,"Szczecin, ul. Andrzejewskiego",53.380975,14.663347,Szczecin,Szczecin,Szczecin,ZACHODNIOPOMORSKIE,ul. Andrzejewskiego 23
PM10,6382,2024-01-27 18:00:00,16.4622,987,pył zawieszony PM10,PM10,PM10,3,987,"Szczecin, ul. Piłsudskiego",53.432169,14.5539,Szczecin,Szczecin,Szczecin,ZACHODNIOPOMORSKIE,ul. Piłsudskiego 1
PM2.5,6383,2024-01-27 18:00:00,14.83,987,pył zawieszony PM2.5,PM2.5,PM2.5,69,987,"Szczecin, ul. Piłsudskiego",53.432169,14.5539,Szczecin,Szczecin,Szczecin,ZACHODNIOPOMORSKIE,ul. Piłsudskiego 1
SO2,6385,2024-01-27 18:00:00,0.58816,987,dwutlenek siarki,SO2,SO2,1,987,"Szczecin, ul. Piłsudskiego",53.432169,14.5539,Szczecin,Szczecin,Szczecin,ZACHODNIOPOMORSKIE,ul. Piłsudskiego 1
SO2,6400,2024-01-27 18:00:00,2.82176,989,dwutlenek siarki,SO2,SO2,1,989,Szczecin_Łączna,53.470889,14.55625,Szczecin,Szczecin,Szczecin,ZACHODNIOPOMORSKIE,ul. Łączna
SO2,5290,2024-01-27 18:00:00,4.32643,805,dwutlenek siarki,SO2,SO2,1,805,"Dąbrowa Górnicza, ul. Tysiąclecia",50.329111,19.231222,Dąbrowa Górnicza,Dąbrowa Górnicza,Dąbrowa Górnicza,ŚLĄSKIE,ul. Tysiąclecia 25 a
PM10,5349,2024-01-27 18:00:00,28.1165,813,pył zawieszony PM10,PM10,PM10,3,813,"Katowice, ul. Plebiscytowa/A4",50.246795,19.019469,Katowice,Katowice,Katowice,ŚLĄSKIE,Al. Górnośląska
PM2.5,25931,2024-01-27 18:00:00,21.7611,813,pył zawieszony PM2.5,PM2.5,PM2.5,69,813,"Katowice, ul. Plebiscytowa/A4",50.246795,19.019469,Katowice,Katowice,Katowice,ŚLĄSKIE,Al. Górnośląska
PM10,5376,2024-01-27 18:00:00,24.4892,814,pył zawieszony PM10,PM10,PM10,3,814,"Katowice, ul. Kossutha",50.264611,18.975028,Katowice,Katowice,Katowice,ŚLĄSKIE,ul. Kossutha 6
PM2.5,5378,2024-01-27 18:00:00,19.1652,814,pył zawieszony PM2.5,PM2.5,PM2.5,69,814,"Katowice, ul. Kossutha",50.264611,18.975028,Katowice,Katowice,Katowice,ŚLĄSKIE,ul. Kossutha 6
SO2,5382,2024-01-27 18:00:00,6.80168,814,dwutlenek siarki,SO2,SO2,1,814,"Katowice, ul. Kossutha",50.264611,18.975028,Katowice,Katowice,Katowice,ŚLĄSKIE,ul. Kossutha 6
PM10,5480,2024-01-27 18:00:00,16.1899,837,pył zawieszony PM10,PM10,PM10,3,837,"Sosnowiec, ul. Lubelska",50.285956,19.184399,Sosnowiec,Sosnowiec,Sosnowiec,ŚLĄSKIE,ul. Lubelska 51
PM10,5505,2024-01-27 18:00:00,21.1728,841,pył zawieszony PM10,PM10,PM10,3,841,"Tychy, ul. Tołstoja",50.099903,18.990236,Tychy,Tychy,Tychy,ŚLĄSKIE,ul. Tołstoja 1
SO2,5508,2024-01-27 18:00:00,3.9557,841,dwutlenek siarki,SO2,SO2,1,841,"Tychy, ul. Tołstoja",50.099903,18.990236,Tychy,Tychy,Tychy,ŚLĄSKIE,ul. Tołstoja 1
PM10,5466,2024-01-27 18:00:00,9.78539,834,pył zawieszony PM10,PM10,PM10,3,834,"Rybnik, ul. Borki",50.111181,18.516139,Rybnik,Rybnik,Rybnik,ŚLĄSKIE,ul. Borki 37 d
SO2,5470,2024-01-27 18:00:00,4.12176,834,dwutlenek siarki,SO2,SO2,1,834,"Rybnik, ul. Borki",50.111181,18.516139,Rybnik,Rybnik,Rybnik,ŚLĄSKIE,ul. Borki 37 d
SO2,17439,2024-01-27 18:00:00,0.99623,10554,dwutlenek siarki,SO2,SO2,1,10554,"Żory, Os. Gen. Władysława Sikorskiego",50.029416,18.689527,Żory,Żory,Żory,ŚLĄSKIE,ul. Sikorskiego 52
PM2.5,21228,2024-01-27 18:00:00,13.6192,11855,pył zawieszony PM2.5,PM2.5,PM2.5,69,11855,"Jastrzębie-Zdrój, Al.J.Piłsudskiego/Harcerska",49.952544,18.607953,Jastrzębie-Zdrój,Jastrzębie-Zdrój,Jastrzębie-Zdrój,ŚLĄSKIE,Aleja Józefa Piłsudskiego/Harcerska 3
SO2,5171,2024-01-27 18:00:00,3.45161,789,dwutlenek siarki,SO2,SO2,1,789,"Bielsko-Biała, ul. Kossak-Szczuckiej",49.813464,19.027318,Bielsko-Biała,Bielsko-Biała,Bielsko-Biała,ŚLĄSKIE,ul. Kossak-Szczuckiej 19
SO2,5260,2024-01-27 18:00:00,0.76208,800,dwutlenek siarki,SO2,SO2,1,800,"Częstochowa, ul. Baczyńskiego",50.836389,19.130111,Częstochowa,Częstochowa,Częstochowa,ŚLĄSKIE,ul. Baczyńskiego 2
SO2,5516,2024-01-27 18:00:00,3.89993,842,dwutlenek siarki,SO2,SO2,1,842,"Ustroń, ul. Sanatoryjna",49.719731,18.826722,Ustroń,Ustroń,cieszyński,ŚLĄSKIE,ul. Sanatoryjna 7
SO2,5550,2024-01-27 18:00:00,3.02392,845,dwutlenek siarki,SO2,SO2,1,845,"Wodzisław Śląski, ul. Gałczyńskiego",50.007629,18.455548,Wodzisław Śląski,Wodzisław Śląski,wodzisławski,ŚLĄSKIE,ul. Gałczyńskiego 1
SO2,5623,2024-01-27 18:00:00,1.96118,853,dwutlenek siarki,SO2,SO2,1,853,"Złoty Potok, Leśniczówka",50.710889,19.458797,Złoty Potok,Janów,częstochowski,ŚLĄSKIE,Leśniczówka Kamienna Góra
SO2,14915,2024-01-27 18:00:00,17.7285,856,dwutlenek siarki,SO2,SO2,1,856,"Żywiec, ul. Kopernika",49.671602,19.234446,Żywiec,Żywiec,żywiecki,ŚLĄSKIE,ul. Kopernika 83 a
SO2,21303,2024-01-27 18:00:00,2.23835,11278,dwutlenek siarki,SO2,SO2,1,11278,"Lubliniec, ul. ks. Szymały",50.675693,18.682065,Lubliniec,Lubliniec,lubliniecki,ŚLĄSKIE,ul. Ks. Płk. Jana Szymały 3
PM2.5,21083,2024-01-27 18:00:00,14.9298,11457,pył zawieszony PM2.5,PM2.5,PM2.5,69,11457,"Goczałkowice Zdrój, ul. Parkowa",49.93785,18.975594,Goczałkowice-Zdrój,Goczałkowice-Zdrój,pszczyński,ŚLĄSKIE,ul. Parkowa
PM10,20681,2024-01-27 18:00:00,17.335,11457,pył zawieszony PM10,PM10,PM10,3,11457,"Goczałkowice Zdrój, ul. Parkowa",49.93785,18.975594,Goczałkowice-Zdrój,Goczałkowice-Zdrój,pszczyński,ŚLĄSKIE,ul. Parkowa
SO2,21128,2024-01-27 18:00:00,8.07827,11794,dwutlenek siarki,SO2,SO2,1,11794,"Racibórz, Wojska Polskiego",50.091142,18.216261,Racibórz,Racibórz,raciborski,ŚLĄSKIE,ul. Wojska Polskiego 8
PM10,21129,2024-01-27 18:00:00,12.1581,11794,pył zawieszony PM10,PM10,PM10,3,11794,"Racibórz, Wojska Polskiego",50.091142,18.216261,Racibórz,Racibórz,raciborski,ŚLĄSKIE,ul. Wojska Polskiego 8
PM2.5,21130,2024-01-27 18:00:00,10.8253,11794,pył zawieszony PM2.5,PM2.5,PM2.5,69,11794,"Racibórz, Wojska Polskiego",50.091142,18.216261,Racibórz,Racibórz,raciborski,ŚLĄSKIE,ul. Wojska Polskiego 8
PM10,19749,2024-01-27 18:00:00,8.1,11195,pył zawieszony PM10,PM10,PM10,3,11195,"Kielce, ul. Targowa",50.878998,20.633692,Kielce,Kielce,Kielce,ŚWIĘTOKRZYSKIE,ul. Targowa 3
PM2.5,19753,2024-01-27 18:00:00,7.9,11195,pył zawieszony PM2.5,PM2.5,PM2.5,69,11195,"Kielce, ul. Targowa",50.878998,20.633692,Kielce,Kielce,Kielce,ŚWIĘTOKRZYSKIE,ul. Targowa 3
SO2,19756,2024-01-27 18:00:00,3.0,11195,dwutlenek siarki,SO2,SO2,1,11195,"Kielce, ul. Targowa",50.878998,20.633692,Kielce,Kielce,Kielce,ŚWIĘTOKRZYSKIE,ul. Targowa 3
PM10,26010,2024-01-27 18:00:00,2.8,16196,pył zawieszony PM10,PM10,PM10,3,16196,"Kielce, ul. Warszawska 108",50.886014,20.642858,Kielce,Kielce,Kielce,ŚWIĘTOKRZYSKIE,ul. Warszawska 108
PM10,27027,2024-01-27 18:00:00,5.68,16497,pył zawieszony PM10,PM10,PM10,3,16497,"Kielce, ul. Jurajska",50.887606,20.579965,Kielce,Kielce,Kielce,ŚWIĘTOKRZYSKIE,ul. Jurajska 7
PM10,5085,2024-01-27 18:00:00,9.1,769,pył zawieszony PM10,PM10,PM10,3,769,"Nowiny, ul. Parkowa",50.823108,20.533506,Nowiny,Nowiny,kielecki,ŚWIĘTOKRZYSKIE,ul. Parkowa
PM10,5115,2024-01-27 18:00:00,10.7,778,pył zawieszony PM10,PM10,PM10,3,778,"Połaniec, ul. Ruszczańska",50.429014,21.277367,Połaniec,Połaniec,staszowski,ŚWIĘTOKRZYSKIE,ul. Ruszczańska 23
PM2.5,5116,2024-01-27 18:00:00,10.2,778,pył zawieszony PM2.5,PM2.5,PM2.5,69,778,"Połaniec, ul. Ruszczańska",50.429014,21.277367,Połaniec,Połaniec,staszowski,ŚWIĘTOKRZYSKIE,ul. Ruszczańska 23
SO2,5118,2024-01-27 18:00:00,4.0,778,dwutlenek siarki,SO2,SO2,1,778,"Połaniec, ul. Ruszczańska",50.429014,21.277367,Połaniec,Połaniec,staszowski,ŚWIĘTOKRZYSKIE,ul. Ruszczańska 23
PM10,20310,2024-01-27 18:00:00,10.5,785,pył zawieszony PM10,PM10,PM10,3,785,"Starachowice, ul. Złota",51.050611,21.084175,Starachowice,Starachowice,starachowicki,ŚWIĘTOKRZYSKIE,ul. Złota
PM2.5,20311,2024-01-27 18:00:00,6.9,785,pył zawieszony PM2.5,PM2.5,PM2.5,69,785,"Starachowice, ul. Złota",51.050611,21.084175,Starachowice,Starachowice,starachowicki,ŚWIĘTOKRZYSKIE,ul. Złota
SO2,21047,2024-01-27 18:00:00,1.1,11754,dwutlenek siarki,SO2,SO2,1,11754,"Gołuchów, Ujęcie Wody",50.621482,20.614057,Gołuchów,Kije,pińczowski,ŚWIĘTOKRZYSKIE,Ujęcie Wody
PM10,26004,2024-01-27 18:00:00,3.9,11754,pył zawieszony PM10,PM10,PM10,3,11754,"Gołuchów, Ujęcie Wody",50.621482,20.614057,Gołuchów,Kije,pińczowski,ŚWIĘTOKRZYSKIE,Ujęcie Wody
PM10,25995,2024-01-27 18:00:00,4.6,12138,pył zawieszony PM10,PM10,PM10,3,12138,"Łagów, ul. Zapłotnia",50.778479,21.081224,Łagów,Łagów,kielecki,ŚWIĘTOKRZYSKIE,ul. Zapłotnia 2
PM2.5,25997,2024-01-27 18:00:00,4.4,12138,pył zawieszony PM2.5,PM2.5,PM2.5,69,12138,"Łagów, ul. Zapłotnia",50.778479,21.081224,Łagów,Łagów,kielecki,ŚWIĘTOKRZYSKIE,ul. Zapłotnia 2
SO2,29553,2024-01-27 18:00:00,12.0,17758,dwutlenek siarki,SO2,SO2,1,17758,"Skarżysko-Kamienna, ul. 1 Maja",51.115842,20.891593,Skarżysko-Kamienna,Skarżysko-Kamienna,skarżyski,ŚWIĘTOKRZYSKIE,ul. 1 Maja 82
PM2.5,29556,2024-01-27 18:00:00,5.2,17758,pył zawieszony PM2.5,PM2.5,PM2.5,69,17758,"Skarżysko-Kamienna, ul. 1 Maja",51.115842,20.891593,Skarżysko-Kamienna,Skarżysko-Kamienna,skarżyski,ŚWIĘTOKRZYSKIE,ul. 1 Maja 82
PM10,29550,2024-01-27 18:00:00,8.7,17758,pył zawieszony PM10,PM10,PM10,3,17758,"Skarżysko-Kamienna, ul. 1 Maja",51.115842,20.891593,Skarżysko-Kamienna,Skarżysko-Kamienna,skarżyski,ŚWIĘTOKRZYSKIE,ul. 1 Maja 82
PM10,5766,2024-01-27 18:00:00,3.70329,877,pył zawieszony PM10,PM10,PM10,3,877," Olsztyn, ul. Puszkina",53.789233,20.486075,Olsztyn,Olsztyn,Olsztyn,WARMIŃSKO-MAZURSKIE,ul. Puszkina 16
PM2.5,5768,2024-01-27 18:00:00,3.57138,877,pył zawieszony PM2.5,PM2.5,PM2.5,69,877," Olsztyn, ul. Puszkina",53.789233,20.486075,Olsztyn,Olsztyn,Olsztyn,WARMIŃSKO-MAZURSKIE,ul. Puszkina 16
SO2,5770,2024-01-27 18:00:00,3.73287,877,dwutlenek siarki,SO2,SO2,1,877," Olsztyn, ul. Puszkina",53.789233,20.486075,Olsztyn,Olsztyn,Olsztyn,WARMIŃSKO-MAZURSKIE,ul. Puszkina 16
PM10,5683,2024-01-27 18:00:00,10.5467,861,pył zawieszony PM10,PM10,PM10,3,861,"Elbląg, ul. Bażyńskiego",54.167847,19.410942,Elbląg,Elbląg,Elbląg,WARMIŃSKO-MAZURSKIE,ul. Bażyńskiego 6
SO2,5686,2024-01-27 18:00:00,0.44156,861,dwutlenek siarki,SO2,SO2,1,861,"Elbląg, ul. Bażyńskiego",54.167847,19.410942,Elbląg,Elbląg,Elbląg,WARMIŃSKO-MAZURSKIE,ul. Bażyńskiego 6
PM2.5,20691,2024-01-27 18:00:00,9.09389,861,pył zawieszony PM2.5,PM2.5,PM2.5,69,861,"Elbląg, ul. Bażyńskiego",54.167847,19.410942,Elbląg,Elbląg,Elbląg,WARMIŃSKO-MAZURSKIE,ul. Bażyńskiego 6
PM2.5,20796,2024-01-27 18:00:00,26.7,11554,pył zawieszony PM2.5,PM2.5,PM2.5,69,11554,"Łask, ul. Narutowicza",51.589208,19.131433,Łask,Łask,łaski,ŁÓDZKIE,ul. Narutowicza 28
PM10,20778,2024-01-27 18:00:00,30.2,11554,pył zawieszony PM10,PM10,PM10,3,11554,"Łask, ul. Narutowicza",51.589208,19.131433,Łask,Łask,łaski,ŁÓDZKIE,ul. Narutowicza 28
PM2.5,20846,2024-01-27 18:00:00,19.0,11616,pył zawieszony PM2.5,PM2.5,PM2.5,69,11616,"Kutno, ul. 1 Maja",52.231908,19.353689,Kutno,Kutno,kutnowski,ŁÓDZKIE,ul. 1 Maja 7
PM10,20847,2024-01-27 18:00:00,21.0,11616,pył zawieszony PM10,PM10,PM10,3,11616,"Kutno, ul. 1 Maja",52.231908,19.353689,Kutno,Kutno,kutnowski,ŁÓDZKIE,ul. 1 Maja 7
PM10,2750,2024-01-27 18:00:00,12.5933,400,pył zawieszony PM10,PM10,PM10,3,400,"Kraków, Aleja Krasińskiego",50.057678,19.926189,Kraków,Kraków,Kraków,MAŁOPOLSKIE,al. Krasińskiego
PM2.5,2752,2024-01-27 18:00:00,9.59703,400,pył zawieszony PM2.5,PM2.5,PM2.5,69,400,"Kraków, Aleja Krasińskiego",50.057678,19.926189,Kraków,Kraków,Kraków,MAŁOPOLSKIE,al. Krasińskiego
SO2,2774,2024-01-27 18:00:00,3.63427,401,dwutlenek siarki,SO2,SO2,1,401,"Kraków, ul. Bujaka",50.010575,19.949189,Kraków,Kraków,Kraków,MAŁOPOLSKIE,ul. Bujaka
PM10,2792,2024-01-27 18:00:00,9.06056,402,pył zawieszony PM10,PM10,PM10,3,402,"Kraków, ul. Bulwarowa",50.069308,20.053492,Kraków,Kraków,Kraków,MAŁOPOLSKIE,ul. Bulwarowa
PM2.5,2794,2024-01-27 18:00:00,8.34549,402,pył zawieszony PM2.5,PM2.5,PM2.5,69,402,"Kraków, ul. Bulwarowa",50.069308,20.053492,Kraków,Kraków,Kraków,MAŁOPOLSKIE,ul. Bulwarowa
SO2,2797,2024-01-27 18:00:00,1.41694,402,dwutlenek siarki,SO2,SO2,1,402,"Kraków, ul. Bulwarowa",50.069308,20.053492,Kraków,Kraków,Kraków,MAŁOPOLSKIE,ul. Bulwarowa
SO2,3073,2024-01-27 18:00:00,8.69188,444,dwutlenek siarki,SO2,SO2,1,444,"Tarnów, ul. Bitwy pod Studziankami",50.020169,21.004167,Tarnów,Tarnów,Tarnów,MAŁOPOLSKIE,ul. Bitwy pod Studziankami
PM2.5,16494,2024-01-27 18:00:00,7.46618,10120,pył zawieszony PM2.5,PM2.5,PM2.5,69,10120,"Tarnów, ul. Ks. Romana Sitko",50.018253,20.992578,Tarnów,Tarnów,Tarnów,MAŁOPOLSKIE,ul. Ks. Romana Sitko
PM10,16457,2024-01-27 18:00:00,9.40361,10120,pył zawieszony PM10,PM10,PM10,3,10120,"Tarnów, ul. Ks. Romana Sitko",50.018253,20.992578,Tarnów,Tarnów,Tarnów,MAŁOPOLSKIE,ul. Ks. Romana Sitko
SO2,2944,2024-01-27 18:00:00,2.29129,426,dwutlenek siarki,SO2,SO2,1,426,"Nowy Sącz, ul. Nadbrzeżna",49.619281,20.714403,Nowy Sącz,Nowy Sącz,Nowy Sącz,MAŁOPOLSKIE,ul. Nadbrzeżna
PM10,20324,2024-01-27 18:00:00,18.0745,9173,pył zawieszony PM10,PM10,PM10,3,9173,"Dębica, ul.Grottgera",50.054786,21.416256,Dębica,Dębica,dębicki,PODKARPACKIE,Grottgera 3
PM2.5,20325,2024-01-27 18:00:00,16.7493,9173,pył zawieszony PM2.5,PM2.5,PM2.5,69,9173,"Dębica, ul.Grottgera",50.054786,21.416256,Dębica,Dębica,dębicki,PODKARPACKIE,Grottgera 3
SO2,14751,2024-01-27 18:00:00,10.3164,9175,dwutlenek siarki,SO2,SO2,1,9175,"Krempna, Ośrodek edukacyjno-muzealny MPN",49.511297,21.498606,Krempna,Krempna,jasielski,PODKARPACKIE,59
PM10,17184,2024-01-27 18:00:00,7.66867,10414,pył zawieszony PM10,PM10,PM10,3,10414,"Rymanów Zdrój, ul. Parkowa",49.546539,21.851006,Rymanów-Zdrój,Rymanów,krośnieński,PODKARPACKIE,Parkowa 5
PM2.5,17185,2024-01-27 18:00:00,7.63978,10414,pył zawieszony PM2.5,PM2.5,PM2.5,69,10414,"Rymanów Zdrój, ul. Parkowa",49.546539,21.851006,Rymanów-Zdrój,Rymanów,krośnieński,PODKARPACKIE,Parkowa 5
SO2,17265,2024-01-27 18:00:00,6.08795,10438,dwutlenek siarki,SO2,SO2,1,10438,"Mielec, ul. Biernackiego",50.299128,21.440942,Mielec,Mielec,mielecki,PODKARPACKIE,Biernackiego
PM10,17271,2024-01-27 18:00:00,10.1485,10438,pył zawieszony PM10,PM10,PM10,3,10438,"Mielec, ul. Biernackiego",50.299128,21.440942,Mielec,Mielec,mielecki,PODKARPACKIE,Biernackiego
PM2.5,17272,2024-01-27 18:00:00,8.84703,10438,pył zawieszony PM2.5,PM2.5,PM2.5,69,10438,"Mielec, ul. Biernackiego",50.299128,21.440942,Mielec,Mielec,mielecki,PODKARPACKIE,Biernackiego
PM10,21638,2024-01-27 18:00:00,6.17539,12057,pył zawieszony PM10,PM10,PM10,3,12057,"Boguchwała, ul. Angermana",49.981786,21.934094,Boguchwała,Boguchwała,rzeszowski,PODKARPACKIE,Kaludiusza Angermana
PM2.5,21639,2024-01-27 18:00:00,6.07101,12057,pył zawieszony PM2.5,PM2.5,PM2.5,69,12057,"Boguchwała, ul. Angermana",49.981786,21.934094,Boguchwała,Boguchwała,rzeszowski,PODKARPACKIE,Kaludiusza Angermana
PM10,4024,2024-01-27 18:00:00,8.43,609,pył zawieszony PM10,PM10,PM10,3,609,"Białystok, ul. Warszawska",53.129306,23.181744,Białystok,Białystok,Białystok,PODLASKIE,ul. Warszawska 75 A
SO2,19716,2024-01-27 18:00:00,3.9,11174,dwutlenek siarki,SO2,SO2,1,11174,"Białystok, ul. 42 Pułku Piechoty",53.144122,23.216322,Białystok,Białystok,Białystok,PODLASKIE,ul. 42 Pułku Piechoty 117
PM10,25908,2024-01-27 18:00:00,39.6,11174,pył zawieszony PM10,PM10,PM10,3,11174,"Białystok, ul. 42 Pułku Piechoty",53.144122,23.216322,Białystok,Białystok,Białystok,PODLASKIE,ul. 42 Pułku Piechoty 117
PM2.5,25909,2024-01-27 18:00:00,38.1,11174,pył zawieszony PM2.5,PM2.5,PM2.5,69,11174,"Białystok, ul. 42 Pułku Piechoty",53.144122,23.216322,Białystok,Białystok,Białystok,PODLASKIE,ul. 42 Pułku Piechoty 117
PM2.5,26323,2024-01-27 18:00:00,15.1,11814,pył zawieszony PM2.5,PM2.5,PM2.5,69,11814,"Białystok, al.Piłsudskiego",53.135286,23.161325,Białystok,Białystok,Białystok,PODLASKIE,Al. Józefa Piłsudskiego 34
PM10,21243,2024-01-27 18:00:00,17.7,11814,pył zawieszony PM10,PM10,PM10,3,11814,"Białystok, al.Piłsudskiego",53.135286,23.161325,Białystok,Białystok,Białystok,PODLASKIE,Al. Józefa Piłsudskiego 34
PM10,4079,2024-01-27 18:00:00,29.1,618,pył zawieszony PM10,PM10,PM10,3,618,"Łomża, ul. Sikorskiego",53.181394,22.054381,Łomża,Łomża,Łomża,PODLASKIE,ul. Sikorskiego 48/94
SO2,4082,2024-01-27 18:00:00,2.4,618,dwutlenek siarki,SO2,SO2,1,618,"Łomża, ul. Sikorskiego",53.181394,22.054381,Łomża,Łomża,Łomża,PODLASKIE,ul. Sikorskiego 48/94
PM2.5,16220,2024-01-27 18:00:00,24.4,9994,pył zawieszony PM2.5,PM2.5,PM2.5,69,9994,"Grajewo, ul. Wojska Polskiego",53.639793,22.470274,Grajewo,Grajewo,grajewski,PODLASKIE,ul. Wojska Polskiego 74
PM10,16130,2024-01-27 18:00:00,25.4,9994,pył zawieszony PM10,PM10,PM10,3,9994,"Grajewo, ul. Wojska Polskiego",53.639793,22.470274,Grajewo,Grajewo,grajewski,PODLASKIE,ul. Wojska Polskiego 74
PM2.5,19697,2024-01-27 18:00:00,64.6,11154,pył zawieszony PM2.5,PM2.5,PM2.5,69,11154,"Suwałki, ul. Pułaskiego 26",54.115897,22.938464,Suwałki,Suwałki,Suwałki,PODLASKIE,ul. Pułaskiego 26
PM10,21323,2024-01-27 18:00:00,27.0,11916,pył zawieszony PM10,PM10,PM10,3,11916,"Augustów, Uzdrowisko",53.85255,22.984686,Augustów,Augustów,augustowski,PODLASKIE,Uzdrowisko
PM2.5,21324,2024-01-27 18:00:00,26.5,11916,pył zawieszony PM2.5,PM2.5,PM2.5,69,11916,"Augustów, Uzdrowisko",53.85255,22.984686,Augustów,Augustów,augustowski,PODLASKIE,Uzdrowisko
PM10,4706,2024-01-27 18:00:00,5.57076,731,pył zawieszony PM10,PM10,PM10,3,731,"Gdańsk, ul. Wyzwolenia",54.400833,18.657497,Gdańsk,Gdańsk,Gdańsk,POMORSKIE,ul. Wyzwolenia
SO2,4707,2024-01-27 18:00:00,5.64503,731,dwutlenek siarki,SO2,SO2,1,731,"Gdańsk, ul. Wyzwolenia",54.400833,18.657497,Gdańsk,Gdańsk,Gdańsk,POMORSKIE,ul. Wyzwolenia
PM2.5,27667,2024-01-27 18:00:00,5.33683,731,pył zawieszony PM2.5,PM2.5,PM2.5,69,731,"Gdańsk, ul. Wyzwolenia",54.400833,18.657497,Gdańsk,Gdańsk,Gdańsk,POMORSKIE,ul. Wyzwolenia
PM10,4715,2024-01-27 18:00:00,12.4528,732,pył zawieszony PM10,PM10,PM10,3,732,"Gdynia, ul. Porębskiego",54.560836,18.493331,Gdynia,Gdynia,Gdynia,POMORSKIE,ul. Porębskiego
SO2,4717,2024-01-27 18:00:00,2.71022,732,dwutlenek siarki,SO2,SO2,1,732,"Gdynia, ul. Porębskiego",54.560836,18.493331,Gdynia,Gdynia,Gdynia,POMORSKIE,ul. Porębskiego
PM2.5,27567,2024-01-27 18:00:00,11.4067,732,pył zawieszony PM2.5,PM2.5,PM2.5,69,732,"Gdynia, ul. Porębskiego",54.560836,18.493331,Gdynia,Gdynia,Gdynia,POMORSKIE,ul. Porębskiego
PM10,4761,2024-01-27 18:00:00,14.7036,736,pył zawieszony PM10,PM10,PM10,3,736,"Gdańsk, ul. Leczkowa",54.380279,18.620274,Gdańsk,Gdańsk,Gdańsk,POMORSKIE,ul. Leczkowa
PM2.5,4762,2024-01-27 18:00:00,13.0966,736,pył zawieszony PM2.5,PM2.5,PM2.5,69,736,"Gdańsk, ul. Leczkowa",54.380279,18.620274,Gdańsk,Gdańsk,Gdańsk,POMORSKIE,ul. Leczkowa
SO2,4764,2024-01-27 18:00:00,2.57258,736,dwutlenek siarki,SO2,SO2,1,736,"Gdańsk, ul. Leczkowa",54.380279,18.620274,Gdańsk,Gdańsk,Gdańsk,POMORSKIE,ul. Leczkowa
PM10,26219,2024-01-27 18:00:00,10.4758,16242,pył zawieszony PM10,PM10,PM10,3,16242,"Sopot, ul. Bitwy Pod Płowcami",54.43451,18.57884,Sopot,Sopot,Sopot,POMORSKIE,ul. Bitwy pod Płowcami
PM2.5,26221,2024-01-27 18:00:00,8.81766,16242,pył zawieszony PM2.5,PM2.5,PM2.5,69,16242,"Sopot, ul. Bitwy Pod Płowcami",54.43451,18.57884,Sopot,Sopot,Sopot,POMORSKIE,ul. Bitwy pod Płowcami
PM10,4817,2024-01-27 18:00:00,19.7985,740,pył zawieszony PM10,PM10,PM10,3,740,"Kościerzyna, ul. Targowa",54.120694,17.975861,Kościerzyna,Kościerzyna,kościerski,POMORSKIE,ul. Targowa
PM2.5,4819,2024-01-27 18:00:00,14.6885,740,pył zawieszony PM2.5,PM2.5,PM2.5,69,740,"Kościerzyna, ul. Targowa",54.120694,17.975861,Kościerzyna,Kościerzyna,kościerski,POMORSKIE,ul. Targowa
SO2,4848,2024-01-27 18:00:00,3.38717,741,dwutlenek siarki,SO2,SO2,1,741,"Malbork, ul. Mickiewicza",54.031247,19.032899,Malbork,Malbork,malborski,POMORSKIE,ul. Mickiewicza
PM10,16070,2024-01-27 18:00:00,22.5527,742,pył zawieszony PM10,PM10,PM10,3,742,"Lębork, ul. Malczewskiego",54.546167,17.746194,Lębork,Lębork,lęborski,POMORSKIE,ul. Malczewskiego
PM2.5,25925,2024-01-27 18:00:00,16.3571,742,pył zawieszony PM2.5,PM2.5,PM2.5,69,742,"Lębork, ul. Malczewskiego",54.546167,17.746194,Lębork,Lębork,lęborski,POMORSKIE,ul. Malczewskiego
SO2,4898,2024-01-27 18:00:00,2.34449,743,dwutlenek siarki,SO2,SO2,1,743,Liniewko Kościerskie,54.104111,18.182972,Liniewko Kościerskie,Nowa Karczma,kościerski,POMORSKIE,
SO2,3026,2024-01-27 18:00:00,0.93877,437,dwutlenek siarki,SO2,SO2,1,437,"Skawina, os. Ogrody",49.971047,19.830422,Skawina,Skawina,krakowski,MAŁOPOLSKIE,os. Ogrody
SO2,3058,2024-01-27 18:00:00,2.30016,443,dwutlenek siarki,SO2,SO2,1,443,Szymbark,49.633714,21.116833,Szymbark,Gorlice,gorlicki,MAŁOPOLSKIE,Szymbark 430
SO2,3127,2024-01-27 18:00:00,2.89053,449,dwutlenek siarki,SO2,SO2,1,449,"Trzebinia, os. Związku Walki Młodych",50.159406,19.477464,Trzebinia,Trzebinia,chrzanowski,MAŁOPOLSKIE,os. Widokowe (dawne os. ZWM)
PM10,16498,2024-01-27 18:00:00,8.01632,10124,pył zawieszony PM10,PM10,PM10,3,10124,"Sucha Beskidzka, ul. Nieszczyńskiej",49.743131,19.600339,Sucha Beskidzka,Sucha Beskidzka,suski,MAŁOPOLSKIE,ul. Nieszczyńskiej
SO2,27834,2024-01-27 18:00:00,1.55377,16894,dwutlenek siarki,SO2,SO2,1,16894,"Nowy Targ, al. Tysiąclecia ",49.476675,20.034878,Nowy Targ,Nowy Targ,nowotarski,MAŁOPOLSKIE,al. Tysiąclecia
PM10,28426,2024-01-27 18:00:00,5.43806,17118,pył zawieszony PM10,PM10,PM10,3,17118,"Wysowa-Zdrój, Park Zdrojowy",49.440175,21.178087,Uście Gorlickie Wysowa,Uście Gorlickie,gorlicki,MAŁOPOLSKIE,Wysowa
PM10,28432,2024-01-27 18:00:00,9.22689,17138,pył zawieszony PM10,PM10,PM10,3,17138,"Muszyna, Lodowisko",49.350042,20.890522,Muszyna,Muszyna,nowosądecki,MAŁOPOLSKIE,Aleja Zdrojowa
PM10,3584,2024-01-27 18:00:00,9.9,530,pył zawieszony PM10,PM10,PM10,3,530,"Warszawa, al. Niepodległości",52.219298,21.004724,Warszawa,Warszawa,Warszawa,MAZOWIECKIE,al. Niepodległości 227/233
PM2.5,3585,2024-01-27 18:00:00,7.4,530,pył zawieszony PM2.5,PM2.5,PM2.5,69,530,"Warszawa, al. Niepodległości",52.219298,21.004724,Warszawa,Warszawa,Warszawa,MAZOWIECKIE,al. Niepodległości 227/233
PM10,3654,2024-01-27 18:00:00,7.63,538,pył zawieszony PM10,PM10,PM10,3,538,"Warszawa, ul. Tołstoja",52.285073,20.933018,Warszawa,Warszawa,Warszawa,MAZOWIECKIE,ul. Tołstoja 2
PM2.5,18038,2024-01-27 18:00:00,7.38,538,pył zawieszony PM2.5,PM2.5,PM2.5,69,538,"Warszawa, ul. Tołstoja",52.285073,20.933018,Warszawa,Warszawa,Warszawa,MAZOWIECKIE,ul. Tołstoja 2
PM10,3730,2024-01-27 18:00:00,6.7,550,pył zawieszony PM10,PM10,PM10,3,550,"Warszawa, ul. Wokalna",52.160772,21.033819,Warszawa,Warszawa,Warszawa,MAZOWIECKIE,ul. Wokalna 1
PM2.5,3731,2024-01-27 18:00:00,5.5,550,pył zawieszony PM2.5,PM2.5,PM2.5,69,550,"Warszawa, ul. Wokalna",52.160772,21.033819,Warszawa,Warszawa,Warszawa,MAZOWIECKIE,ul. Wokalna 1
PM10,3764,2024-01-27 18:00:00,8.5,552,pył zawieszony PM10,PM10,PM10,3,552,"Warszawa, ul. Kondratowicza",52.290864,21.042458,Warszawa,Warszawa,Warszawa,MAZOWIECKIE,ul. Kondratowicza 8
PM2.5,14688,2024-01-27 18:00:00,7.1,552,pył zawieszony PM2.5,PM2.5,PM2.5,69,552,"Warszawa, ul. Kondratowicza",52.290864,21.042458,Warszawa,Warszawa,Warszawa,MAZOWIECKIE,ul. Kondratowicza 8
PM10,18200,2024-01-27 18:00:00,7.0,10955,pył zawieszony PM10,PM10,PM10,3,10955,"Warszawa, ul. Chrościckiego",52.207742,20.906073,Warszawa,Warszawa,Warszawa,MAZOWIECKIE,ul. Chrościckiego 16/18
PM2.5,18201,2024-01-27 18:00:00,6.5,10955,pył zawieszony PM2.5,PM2.5,PM2.5,69,10955,"Warszawa, ul. Chrościckiego",52.207742,20.906073,Warszawa,Warszawa,Warszawa,MAZOWIECKIE,ul. Chrościckiego 16/18
SO2,20411,2024-01-27 18:00:00,0.8,10955,dwutlenek siarki,SO2,SO2,1,10955,"Warszawa, ul. Chrościckiego",52.207742,20.906073,Warszawa,Warszawa,Warszawa,MAZOWIECKIE,ul. Chrościckiego 16/18
PM2.5,18198,2024-01-27 18:00:00,12.9,10956,pył zawieszony PM2.5,PM2.5,PM2.5,69,10956,"Warszawa, ul. Bajkowa",52.188474,21.176233,Warszawa,Warszawa,Warszawa,MAZOWIECKIE,ul. Bajkowa 17/21
PM10,18199,2024-01-27 18:00:00,16.4,10956,pył zawieszony PM10,PM10,PM10,3,10956,"Warszawa, ul. Bajkowa",52.188474,21.176233,Warszawa,Warszawa,Warszawa,MAZOWIECKIE,ul. Bajkowa 17/21
PM10,3429,2024-01-27 18:00:00,6.4,501,pył zawieszony PM10,PM10,PM10,3,501,"Płock, ul. Reja",52.550938,19.709791,Płock,Płock,Płock,MAZOWIECKIE,ul. Mikołaja Reja 28
SO2,3434,2024-01-27 18:00:00,9.3,501,dwutlenek siarki,SO2,SO2,1,501,"Płock, ul. Reja",52.550938,19.709791,Płock,Płock,Płock,MAZOWIECKIE,ul. Mikołaja Reja 28
PM2.5,14376,2024-01-27 18:00:00,5.1,501,pył zawieszony PM2.5,PM2.5,PM2.5,69,501,"Płock, ul. Reja",52.550938,19.709791,Płock,Płock,Płock,MAZOWIECKIE,ul. Mikołaja Reja 28
PM10,3497,2024-01-27 18:00:00,19.5,515,pył zawieszony PM10,PM10,PM10,3,515,"Radom, ul. Tochtermana",51.399084,21.147474,Radom,Radom,Radom,MAZOWIECKIE,ul. Tochtermana 1
SO2,3502,2024-01-27 18:00:00,0.9,515,dwutlenek siarki,SO2,SO2,1,515,"Radom, ul. Tochtermana",51.399084,21.147474,Radom,Radom,Radom,MAZOWIECKIE,ul. Tochtermana 1
PM2.5,14377,2024-01-27 18:00:00,14.8,515,pył zawieszony PM2.5,PM2.5,PM2.5,69,515,"Radom, ul. Tochtermana",51.399084,21.147474,Radom,Radom,Radom,MAZOWIECKIE,ul. Tochtermana 1
PM10,3204,2024-01-27 18:00:00,9.81,460,pył zawieszony PM10,PM10,PM10,3,460,"Belsk Duży, IGF PAN",51.835242,20.791912,Belsk Duży,Grójec,grójecki,MAZOWIECKIE,Osiedle PAN 1
SO2,3205,2024-01-27 18:00:00,1.081246,460,dwutlenek siarki,SO2,SO2,1,460,"Belsk Duży, IGF PAN",51.835242,20.791912,Belsk Duży,Grójec,grójecki,MAZOWIECKIE,Osiedle PAN 1
PM10,20461,2024-01-27 18:00:00,11.82,471,pył zawieszony PM10,PM10,PM10,3,471,"Legionowo, ul. Zegrzyńska",52.407578,20.955928,Legionowo,Legionowo,legionowski,MAZOWIECKIE,ul. Zegrzyńska 38
PM2.5,14378,2024-01-27 18:00:00,11.71,471,pył zawieszony PM2.5,PM2.5,PM2.5,69,471,"Legionowo, ul. Zegrzyńska",52.407578,20.955928,Legionowo,Legionowo,legionowski,MAZOWIECKIE,ul. Zegrzyńska 38
PM10,17225,2024-01-27 18:00:00,8.6,485,pył zawieszony PM10,PM10,PM10,3,485,"Otwock, ul. Brzozowa",52.115725,21.237297,Otwock,Otwock,otwocki,MAZOWIECKIE,ul. Brzozowa 2
PM2.5,16044,2024-01-27 18:00:00,8.5,485,pył zawieszony PM2.5,PM2.5,PM2.5,69,485,"Otwock, ul. Brzozowa",52.115725,21.237297,Otwock,Otwock,otwocki,MAZOWIECKIE,ul. Brzozowa 2
SO2,16051,2024-01-27 18:00:00,6.4,485,dwutlenek siarki,SO2,SO2,1,485,"Otwock, ul. Brzozowa",52.115725,21.237297,Otwock,Otwock,otwocki,MAZOWIECKIE,ul. Brzozowa 2
PM10,20462,2024-01-27 18:00:00,10.7,488,pył zawieszony PM10,PM10,PM10,3,488,"Piastów, ul. Pułaskiego",52.191728,20.837489,Piastów,Piastów,pruszkowski,MAZOWIECKIE,ul. Pułaskiego 6/8
PM2.5,14779,2024-01-27 18:00:00,10.5,488,pył zawieszony PM2.5,PM2.5,PM2.5,69,488,"Piastów, ul. Pułaskiego",52.191728,20.837489,Piastów,Piastów,pruszkowski,MAZOWIECKIE,ul. Pułaskiego 6/8
PM10,3526,2024-01-27 18:00:00,24.3,517,pył zawieszony PM10,PM10,PM10,3,517,"Siedlce, ul. Konarskiego",52.172145,22.282001,Siedlce,Siedlce,Siedlce,MAZOWIECKIE,ul. Konarskiego 11
PM2.5,3528,2024-01-27 18:00:00,20.7,517,pył zawieszony PM2.5,PM2.5,PM2.5,69,517,"Siedlce, ul. Konarskiego",52.172145,22.282001,Siedlce,Siedlce,Siedlce,MAZOWIECKIE,ul. Konarskiego 11
SO2,28895,2024-01-27 18:00:00,2.1,9798,dwutlenek siarki,SO2,SO2,1,9798,"Nakło nad Notecią, ul. Św. Wawrzyńca",53.136681,17.591539,Nakło nad Notecią,Nakło nad Notecią,nakielski,KUJAWSKO-POMORSKIE,ul. Świętego Wawrzyńca
PM10,25983,2024-01-27 18:00:00,12.7,9798,pył zawieszony PM10,PM10,PM10,3,9798,"Nakło nad Notecią, ul. Św. Wawrzyńca",53.136681,17.591539,Nakło nad Notecią,Nakło nad Notecią,nakielski,KUJAWSKO-POMORSKIE,ul. Świętego Wawrzyńca
PM2.5,25984,2024-01-27 18:00:00,10.3,9798,pył zawieszony PM2.5,PM2.5,PM2.5,69,9798,"Nakło nad Notecią, ul. Św. Wawrzyńca",53.136681,17.591539,Nakło nad Notecią,Nakło nad Notecią,nakielski,KUJAWSKO-POMORSKIE,ul. Świętego Wawrzyńca
PM10,21509,2024-01-27 18:00:00,8.5,12038,pył zawieszony PM10,PM10,PM10,3,12038,"Świecie, al. Jana Pawła II",53.40758,18.428751,Świecie,Świecie,świecki,KUJAWSKO-POMORSKIE,al. Jana Pawła II 8
PM2.5,21510,2024-01-27 18:00:00,6.4,12038,pył zawieszony PM2.5,PM2.5,PM2.5,69,12038,"Świecie, al. Jana Pawła II",53.40758,18.428751,Świecie,Świecie,świecki,KUJAWSKO-POMORSKIE,al. Jana Pawła II 8
PM10,1900,2024-01-27 18:00:00,12.2,266,pył zawieszony PM10,PM10,PM10,3,266,"Lublin, ul. Obywatelska",51.259431,22.569133,Lublin,Lublin,Lublin,LUBELSKIE,ul. Obywatelska 13
SO2,1902,2024-01-27 18:00:00,2.2,266,dwutlenek siarki,SO2,SO2,1,266,"Lublin, ul. Obywatelska",51.259431,22.569133,Lublin,Lublin,Lublin,LUBELSKIE,ul. Obywatelska 13
PM2.5,16472,2024-01-27 18:00:00,11.8,266,pył zawieszony PM2.5,PM2.5,PM2.5,69,266,"Lublin, ul. Obywatelska",51.259431,22.569133,Lublin,Lublin,Lublin,LUBELSKIE,ul. Obywatelska 13
PM10,20419,2024-01-27 18:00:00,28.28,236,pył zawieszony PM10,PM10,PM10,3,236,"Biała Podlaska, ul. Orzechowa",52.029194,23.149389,Biała Podlaska,Biała Podlaska,Biała Podlaska,LUBELSKIE,ul. Orzechowa
PM10,27126,2024-01-27 18:00:00,5.87,275,pył zawieszony PM10,PM10,PM10,3,275,"Radzyń Podlaski, ul. Sitkowskiego",51.78,22.625944,Radzyń Podlaski,Radzyń Podlaski,radzyński,LUBELSKIE,ul. Sitkowskiego 1b
SO2,2008,2024-01-27 18:00:00,2.6,285,dwutlenek siarki,SO2,SO2,1,285,"Zamość, ul. Hrubieszowska",50.716628,23.290247,Zamość,Zamość,Zamość,LUBELSKIE,ul. Hrubieszowska 69A
PM10,16744,2024-01-27 18:00:00,11.3,285,pył zawieszony PM10,PM10,PM10,3,285,"Zamość, ul. Hrubieszowska",50.716628,23.290247,Zamość,Zamość,Zamość,LUBELSKIE,ul. Hrubieszowska 69A
PM2.5,26316,2024-01-27 18:00:00,10.2,285,pył zawieszony PM2.5,PM2.5,PM2.5,69,285,"Zamość, ul. Hrubieszowska",50.716628,23.290247,Zamość,Zamość,Zamość,LUBELSKIE,ul. Hrubieszowska 69A
SO2,18041,2024-01-27 18:00:00,2.1304,10874,dwutlenek siarki,SO2,SO2,1,10874,"Florianka, RPN",50.551894,22.982861,Florianka,Józefów,biłgorajski,LUBELSKIE,
PM10,20426,2024-01-27 18:00:00,1.9,11360,pył zawieszony PM10,PM10,PM10,3,11360,"Chełm, ul. Połaniecka",51.122147,23.473075,Chełm,Chełm,Chełm,LUBELSKIE,ul. Połaniecka
PM10,21787,2024-01-27 18:00:00,8.5,12100,pył zawieszony PM10,PM10,PM10,3,12100,"Łuków, Bulwar 100-lecia Odzyskania Niepodległości ",51.930734,22.372502,Łuków,Łuków,łukowski,LUBELSKIE,Bulwar 100-lecia Odzyskania Niepodległości 
PM2.5,21791,2024-01-27 18:00:00,8.3,12100,pył zawieszony PM2.5,PM2.5,PM2.5,69,12100,"Łuków, Bulwar 100-lecia Odzyskania Niepodległości ",51.930734,22.372502,Łuków,Łuków,łukowski,LUBELSKIE,Bulwar 100-lecia Odzyskania Niepodległości 
PM10,2421,2024-01-27 18:00:00,11.8387,361,pył zawieszony PM10,PM10,PM10,3,361,Gorzów Wlkp. ul. Kosynierów Gdyńskich,52.738214,15.228667,Gorzów Wielkopolski,Gorzów Wielkopolski,Gorzów Wielkopolski,LUBUSKIE,ul. Kosynierów Gdyńskich
SO2,2425,2024-01-27 18:00:00,4.66239,361,dwutlenek siarki,SO2,SO2,1,361,Gorzów Wlkp. ul. Kosynierów Gdyńskich,52.738214,15.228667,Gorzów Wielkopolski,Gorzów Wielkopolski,Gorzów Wielkopolski,LUBUSKIE,ul. Kosynierów Gdyńskich
PM2.5,26165,2024-01-27 18:00:00,7.78141,361,pył zawieszony PM2.5,PM2.5,PM2.5,69,361,Gorzów Wlkp. ul. Kosynierów Gdyńskich,52.738214,15.228667,Gorzów Wielkopolski,Gorzów Wielkopolski,Gorzów Wielkopolski,LUBUSKIE,ul. Kosynierów Gdyńskich
SO2,2668,2024-01-27 18:00:00,2.28686,387,dwutlenek siarki,SO2,SO2,1,387,Zielona Góra ul. Krótka,51.939783,15.518861,Zielona Góra,Zielona Góra,Zielona Góra,LUBUSKIE,ul. Krótka
PM10,20232,2024-01-27 18:00:00,8.60283,11294,pył zawieszony PM10,PM10,PM10,3,11294,"Zielona Góra,ul.Wyszyńskiego",51.936249,15.481077,Zielona Góra,Zielona Góra,Zielona Góra,LUBUSKIE,Wyszyńskiego
SO2,2510,2024-01-27 18:00:00,2.63047,374,dwutlenek siarki,SO2,SO2,1,374,Smolary Bytnickie,52.172222,15.206667,Smolary Bytnickie,Bytnica,krośnieński,LUBUSKIE,Smolary Bytnickie 45A
PM10,2563,2024-01-27 18:00:00,14.5494,379,pył zawieszony PM10,PM10,PM10,3,379,Wschowa ul. Kazimierza Wielkiego,51.799722,16.3175,Wschowa,Wschowa,wschowski,LUBUSKIE,ul. Kazimierza Wielkiego
SO2,2566,2024-01-27 18:00:00,6.46823,379,dwutlenek siarki,SO2,SO2,1,379,Wschowa ul. Kazimierza Wielkiego,51.799722,16.3175,Wschowa,Wschowa,wschowski,LUBUSKIE,ul. Kazimierza Wielkiego
PM2.5,19721,2024-01-27 18:00:00,9.91133,379,pył zawieszony PM2.5,PM2.5,PM2.5,69,379,Wschowa ul. Kazimierza Wielkiego,51.799722,16.3175,Wschowa,Wschowa,wschowski,LUBUSKIE,ul. Kazimierza Wielkiego
SO2,2601,2024-01-27 18:00:00,4.01069,382,dwutlenek siarki,SO2,SO2,1,382,"Żary, ul. Szymanowskiego ",51.642656,15.127808,Żary,Żary,żarski,LUBUSKIE,ul. Szymanowskiego 8
PM10,853,2024-01-27 18:00:00,11.0,145,pył zawieszony PM10,PM10,PM10,3,145,"Toruń, ul. Wały gen. Sikorskiego",53.012475,18.605681,Toruń,Toruń,Toruń,KUJAWSKO-POMORSKIE,ul. Wały Gen. Sikorskiego 12
PM10,1405,2024-01-27 18:00:00,9.4,206,pył zawieszony PM10,PM10,PM10,3,206,"Toruń, ul. Dziewulskiego",53.028647,18.666103,Toruń,Toruń,Toruń,KUJAWSKO-POMORSKIE,ul. Dziewulskiego 1
SO2,1409,2024-01-27 18:00:00,1.8,206,dwutlenek siarki,SO2,SO2,1,206,"Toruń, ul. Dziewulskiego",53.028647,18.666103,Toruń,Toruń,Toruń,KUJAWSKO-POMORSKIE,ul. Dziewulskiego 1
PM10,1426,2024-01-27 18:00:00,14.8,208,pył zawieszony PM10,PM10,PM10,3,208,"Toruń, ul. Przy Kaszowniku",53.017628,18.612808,Toruń,Toruń,Toruń,KUJAWSKO-POMORSKIE,ul. Przy Kaszowniku
PM2.5,21163,2024-01-27 18:00:00,11.7,208,pył zawieszony PM2.5,PM2.5,PM2.5,69,208,"Toruń, ul. Przy Kaszowniku",53.017628,18.612808,Toruń,Toruń,Toruń,KUJAWSKO-POMORSKIE,ul. Przy Kaszowniku
PM10,1544,2024-01-27 18:00:00,16.5,225,pył zawieszony PM10,PM10,PM10,3,225,"Włocławek, ul. Okrzei",52.658467,19.059314,Włocławek,Włocławek,Włocławek,KUJAWSKO-POMORSKIE,ul. Okrzei
PM2.5,19698,2024-01-27 18:00:00,15.5,225,pył zawieszony PM2.5,PM2.5,PM2.5,69,225,"Włocławek, ul. Okrzei",52.658467,19.059314,Włocławek,Włocławek,Włocławek,KUJAWSKO-POMORSKIE,ul. Okrzei
PM10,20302,2024-01-27 18:00:00,7.9,9791,pył zawieszony PM10,PM10,PM10,3,9791,"Włocławek, ul. Kaliska",52.637394,19.044486,Włocławek,Włocławek,Włocławek,KUJAWSKO-POMORSKIE,ul. Kaliska 108 A
SO2,21264,2024-01-27 18:00:00,1.8,9791,dwutlenek siarki,SO2,SO2,1,9791,"Włocławek, ul. Kaliska",52.637394,19.044486,Włocławek,Włocławek,Włocławek,KUJAWSKO-POMORSKIE,ul. Kaliska 108 A
PM10,812,2024-01-27 18:00:00,20.13,142,pył zawieszony PM10,PM10,PM10,3,142,"Grudziądz, ul. Piłsudskiego",53.49355,18.762139,Grudziądz,Grudziądz,Grudziądz,KUJAWSKO-POMORSKIE,ul. Piłsudskiego 51
PM10,6238,2024-01-27 18:00:00,23.0509,966,pył zawieszony PM10,PM10,PM10,3,966,"Koszalin, ul. Armii Krajowej",54.193986,16.172544,Koszalin,Koszalin,Koszalin,ZACHODNIOPOMORSKIE,ul. Armii Krajowej
SO2,26305,2024-01-27 18:00:00,0.5,11336,dwutlenek siarki,SO2,SO2,1,11336,"Koszalin, ul. Chopina",54.194114,16.211672,Koszalin,Koszalin,Koszalin,ZACHODNIOPOMORSKIE,ul. Chopina 42
SO2,6218,2024-01-27 18:00:00,3.06243,961,dwutlenek siarki,SO2,SO2,1,961,Widuchowa,53.122325,14.382245,Widuchowa,Widuchowa,gryfiński,ZACHODNIOPOMORSKIE,ul. Bulwary Rybackie 1
PM10,6322,2024-01-27 18:00:00,18.2748,983,pył zawieszony PM10,PM10,PM10,3,983,"Szczecinek, ul. Przemysłowa",53.698902,16.704556,Szczecinek,Szczecinek,szczecinecki,ZACHODNIOPOMORSKIE,ul. Przemysłowa 5
SO2,6324,2024-01-27 18:00:00,2.77709,983,dwutlenek siarki,SO2,SO2,1,983,"Szczecinek, ul. Przemysłowa",53.698902,16.704556,Szczecinek,Szczecinek,szczecinecki,ZACHODNIOPOMORSKIE,ul. Przemysłowa 5
PM2.5,29522,2024-01-27 18:00:00,13.7772,10934,pył zawieszony PM2.5,PM2.5,PM2.5,69,10934,"Kołobrzeg, ul. Żółkiewskiego",54.179324,15.596342,Kołobrzeg,Kołobrzeg,kołobrzeski,ZACHODNIOPOMORSKIE,ul. Żółkiewskiego
PM10,29523,2024-01-27 18:00:00,25.4393,10934,pył zawieszony PM10,PM10,PM10,3,10934,"Kołobrzeg, ul. Żółkiewskiego",54.179324,15.596342,Kołobrzeg,Kołobrzeg,kołobrzeski,ZACHODNIOPOMORSKIE,ul. Żółkiewskiego
PM2.5,28476,2024-01-27 18:00:00,11.6759,17158,pył zawieszony PM2.5,PM2.5,PM2.5,69,17158,"Dąbki, ul. Sztormowa",54.377492,16.310728,Dąbki,Darłowo,sławieński,ZACHODNIOPOMORSKIE,Sztormowa
PM10,28477,2024-01-27 18:00:00,18.7161,17158,pył zawieszony PM10,PM10,PM10,3,17158,"Dąbki, ul. Sztormowa",54.377492,16.310728,Dąbki,Darłowo,sławieński,ZACHODNIOPOMORSKIE,Sztormowa
