[
  {
    "key": "SO2",
    "id_x": "672",
    "values": [
      {
        "date": "2024-01-27 12:00:00",
        "value": 3.12181
      }
    ]
  },
  {
    "key": "SO2",
    "id_x": "297",
    "values": [
      {
        "date": "2024-01-27 12:00:00",
        "value": 3.03536
      }
    ]
  },
  {
    "key": "SO2",
    "id_x": "621",
    "values": [
      {
        "date": "2024-01-27 12:00:00",
        "value": 4.91098
      }
    ]
  },
  {
    "key": "SO2",
    "id_x": "450",
    "values": [
      {
        "date": "2024-01-27 12:00:00",
        "value": 6.72167
      }
    ]
  },
  {
    "key": "SO2",
    "id_x": "14733",
    "values": [
      {
        "date": "2024-01-27 12:00:00",
        "value": 6.02285
      }
    ]
  },
  {
    "key": "SO2",
    "id_x": "998",
    "values": [
      {
        "date": "2024-01-27 12:00:00",
        "value": 3.0
      }
    ]
  },
  {
    "key": "SO2",
    "id_x": "2088",
    "values": [
      {
        "date": "2024-01-27 12:00:00",
        "value": 2.3
      }
    ]
  },
  {
    "key": "SO2",
    "id_x": "2382",
    "values": [
      {
        "date": "2024-01-27 12:00:00",
        "value": 5.7
      }
    ]
  },
  {
    "key": "SO2",
    "id_x": "2039",
    "values": [
      {
        "date": "2024-01-27 12:00:00",
        "value": 1.5
      }
    ]
  },
  {
    "key": "SO2",
    "id_x": "2222",
    "values": [
      {
        "date": "2024-01-27 12:00:00",
        "value": 2.7
      }
    ]
  },
  {
    "key": "SO2",
    "id_x": "16633",
    "values": [
      {
        "date": "2024-01-27 12:00:00",
        "value": 6.74
      }
    ]
  },
  {
    "key": "SO2",
    "id_x": "16043",
    "values": [
      {
        "date": "2024-01-27 12:00:00",
        "value": 1.7
      }
    ]
  },
  {
    "key": "SO2",
    "id_x": "20365",
    "values": [
      {
        "date": "2024-01-27 12:00:00",
        "value": 4.1
      }
    ]
  },
  {
    "key": "SO2",
    "id_x": "16149",
    "values": [
      {
        "date": "2024-01-27 12:00:00",
        "value": 2.53765
      }
    ]
  },
  {
    "key": "SO2",
    "id_x": "3847",
    "values": [
      {
        "date": "2024-01-27 12:00:00",
        "value": 3.4181
      }
    ]
  },
  {
    "key": "SO2",
    "id_x": "4391",
    "values": [
      {
        "date": "2024-01-27 12:00:00",
        "value": 1.21204
      }
    ]
  },
  {
    "key": "SO2",
    "id_x": "4339",
    "values": [
      {
        "date": "2024-01-27 12:00:00",
        "value": 1.33296
      }
    ]
  },
  {
    "key": "SO2",
    "id_x": "16396",
    "values": [
      {
        "date": "2024-01-27 12:00:00",
        "value": 0.46168
      }
    ]
  },
  {
    "key": "SO2",
    "id_x": "16214",
    "values": [
      {
        "date": "2024-01-27 12:00:00",
        "value": 9.80676
      }
    ]
  },
  {
    "key": "SO2",
    "id_x": "6168",
    "values": [
      {
        "date": "2024-01-27 12:00:00",
        "value": 6.11077
      }
    ]
  },
  {
    "key": "SO2",
    "id_x": "5984",
    "values": [
      {
        "date": "2024-01-27 12:00:00",
        "value": 1.35741
      }
    ]
  },
  {
    "key": "SO2",
    "id_x": "6108",
    "values": [
      {
        "date": "2024-01-27 12:00:00",
        "value": 2.47924
      }
    ]
  },
  {
    "key": "SO2",
    "id_x": "17945",
    "values": [
      {
        "date": "2024-01-27 12:00:00",
        "value": 2.13949
      }
    ]
  },
  {
    "key": "SO2",
    "id_x": "6385",
    "values": [
      {
        "date": "2024-01-27 12:00:00",
        "value": 0.5
      }
    ]
  },
  {
    "key": "SO2",
    "id_x": "6400",
    "values": [
      {
        "date": "2024-01-27 12:00:00",
        "value": 2.568
      }
    ]
  },
  {
    "key": "SO2",
    "id_x": "5290",
    "values": [
      {
        "date": "2024-01-27 12:00:00",
        "value": 2.9402
      }
    ]
  },
  {
    "key": "SO2",
    "id_x": "5382",
    "values": [
      {
        "date": "2024-01-27 12:00:00",
        "value": 2.5007
      }
    ]
  },
  {
    "key": "SO2",
    "id_x": "5508",
    "values": [
      {
        "date": "2024-01-27 12:00:00",
        "value": 2.28432
      }
    ]
  },
  {
    "key": "SO2",
    "id_x": "5470",
    "values": [
      {
        "date": "2024-01-27 12:00:00",
        "value": 5.49965
      }
    ]
  },
  {
    "key": "SO2",
    "id_x": "17439",
    "values": [
      {
        "date": "2024-01-27 12:00:00",
        "value": 1.8715
      }
    ]
  },
  {
    "key": "SO2",
    "id_x": "5171",
    "values": [
      {
        "date": "2024-01-27 12:00:00",
        "value": 0.98776
      }
    ]
  },
  {
    "key": "SO2",
    "id_x": "5516",
    "values": [
      {
        "date": "2024-01-27 12:00:00",
        "value": 4.45095
      }
    ]
  },
  {
    "key": "SO2",
    "id_x": "5550",
    "values": [
      {
        "date": "2024-01-27 12:00:00",
        "value": 3.40629
      }
    ]
  },
  {
    "key": "SO2",
    "id_x": "5623",
    "values": [
      {
        "date": "2024-01-27 12:00:00",
        "value": 1.02877
      }
    ]
  },
  {
    "key": "SO2",
    "id_x": "14915",
    "values": [
      {
        "date": "2024-01-27 12:00:00",
        "value": 10.1725
      }
    ]
  },
  {
    "key": "SO2",
    "id_x": "21303",
    "values": [
      {
        "date": "2024-01-27 12:00:00",
        "value": 5.83266
      }
    ]
  },
  {
    "key": "SO2",
    "id_x": "21128",
    "values": [
      {
        "date": "2024-01-27 12:00:00",
        "value": 7.85919
      }
    ]
  },
  {
    "key": "SO2",
    "id_x": "19756",
    "values": [
      {
        "date": "2024-01-27 12:00:00",
        "value": 1.8
      }
    ]
  },
  {
    "key": "SO2",
    "id_x": "5118",
    "values": [
      {
        "date": "2024-01-27 12:00:00",
        "value": 3.0
      }
    ]
  },
  {
    "key": "SO2",
    "id_x": "21047",
    "values": [
      {
        "date": "2024-01-27 12:00:00",
        "value": 1.3
      }
    ]
  },
  {
    "key": "SO2",
    "id_x": "29553",
    "values": [
      {
        "date": "2024-01-27 12:00:00",
        "value": 14.7
      }
    ]
  },
  {
    "key": "SO2",
    "id_x": "5770",
    "values": [
      {
        "date": "2024-01-27 12:00:00",
        "value": 7.29431
      }
    ]
  },
  {
    "key": "SO2",
    "id_x": "5686",
    "values": [
      {
        "date": "2024-01-27 12:00:00",
        "value": 0.53503
      }
    ]
  },
  {
    "key": "SO2",
    "id_x": "2774",
    "values": [
      {
        "date": "2024-01-27 12:00:00",
        "value": 2.89019
      }
    ]
  },
  {
    "key": "SO2",
    "id_x": "2797",
    "values": [
      {
        "date": "2024-01-27 12:00:00",
        "value": 0.8471
      }
    ]
  },
  {
    "key": "SO2",
    "id_x": "3073",
    "values": [
      {
        "date": "2024-01-27 12:00:00",
        "value": 12.2349
      }
    ]
  },
  {
    "key": "SO2",
    "id_x": "2944",
    "values": [
      {
        "date": "2024-01-27 12:00:00",
        "value": 1.96397
      }
    ]
  },
  {
    "key": "SO2",
    "id_x": "14751",
    "values": [
      {
        "date": "2024-01-27 12:00:00",
        "value": 12.7798
      }
    ]
  },
  {
    "key": "SO2",
    "id_x": "17265",
    "values": [
      {
        "date": "2024-01-27 12:00:00",
        "value": 5.31521
      }
    ]
  },
  {
    "key": "SO2",
    "id_x": "19716",
    "values": [
      {
        "date": "2024-01-27 12:00:00",
        "value": 4.4
      }
    ]
  },
  {
    "key": "SO2",
    "id_x": "4082",
    "values": [
      {
        "date": "2024-01-27 12:00:00",
        "value": 2.5
      }
    ]
  },
  {
    "key": "SO2",
    "id_x": "4707",
    "values": [
      {
        "date": "2024-01-27 12:00:00",
        "value": 5.60629
      }
    ]
  },
  {
    "key": "SO2",
    "id_x": "4717",
    "values": [
      {
        "date": "2024-01-27 12:00:00",
        "value": 2.0685
      }
    ]
  },
  {
    "key": "SO2",
    "id_x": "4764",
    "values": [
      {
        "date": "2024-01-27 12:00:00",
        "value": 1.7079
      }
    ]
  },
  {
    "key": "SO2",
    "id_x": "4848",
    "values": [
      {
        "date": "2024-01-27 12:00:00",
        "value": 4.07801
      }
    ]
  },
  {
    "key": "SO2",
    "id_x": "4898",
    "values": [
      {
        "date": "2024-01-27 12:00:00",
        "value": 1.98687
      }
    ]
  },
  {
    "key": "SO2",
    "id_x": "3026",
    "values": [
      {
        "date": "2024-01-27 12:00:00",
        "value": 0.71696
      }
    ]
  },
  {
    "key": "SO2",
    "id_x": "3058",
    "values": [
      {
        "date": "2024-01-27 12:00:00",
        "value": 2.60532
      }
    ]
  },
  {
    "key": "SO2",
    "id_x": "3127",
    "values": [
      {
        "date": "2024-01-27 12:00:00",
        "value": 1.68836
      }
    ]
  },
  {
    "key": "SO2",
    "id_x": "27834",
    "values": [
      {
        "date": "2024-01-27 12:00:00",
        "value": 1.0819
      }
    ]
  },
  {
    "key": "SO2",
    "id_x": "20411",
    "values": [
      {
        "date": "2024-01-27 12:00:00",
        "value": 0.8
      }
    ]
  },
  {
    "key": "SO2",
    "id_x": "3418",
    "values": [
      {
        "date": "2024-01-27 12:00:00",
        "value": 3.72
      }
    ]
  },
  {
    "key": "SO2",
    "id_x": "3434",
    "values": [
      {
        "date": "2024-01-27 12:00:00",
        "value": 2.6
      }
    ]
  },
  {
    "key": "SO2",
    "id_x": "3502",
    "values": [
      {
        "date": "2024-01-27 12:00:00",
        "value": 0.7
      }
    ]
  },
  {
    "key": "SO2",
    "id_x": "3205",
    "values": [
      {
        "date": "2024-01-27 12:00:00",
        "value": 0.929375
      }
    ]
  },
  {
    "key": "SO2",
    "id_x": "16051",
    "values": [
      {
        "date": "2024-01-27 12:00:00",
        "value": 5.0
      }
    ]
  },
  {
    "key": "SO2",
    "id_x": "28895",
    "values": [
      {
        "date": "2024-01-27 12:00:00",
        "value": 1.5
      }
    ]
  },
  {
    "key": "SO2",
    "id_x": "1902",
    "values": [
      {
        "date": "2024-01-27 12:00:00",
        "value": 2.3
      }
    ]
  },
  {
    "key": "SO2",
    "id_x": "14348",
    "values": [
      {
        "date": "2024-01-27 12:00:00",
        "value": 3.38
      }
    ]
  },
  {
    "key": "SO2",
    "id_x": "2008",
    "values": [
      {
        "date": "2024-01-27 12:00:00",
        "value": 2.5
      }
    ]
  },
  {
    "key": "SO2",
    "id_x": "18041",
    "values": [
      {
        "date": "2024-01-27 12:00:00",
        "value": 1.99725
      }
    ]
  },
  {
    "key": "SO2",
    "id_x": "2425",
    "values": [
      {
        "date": "2024-01-27 12:00:00",
        "value": 5.24685
      }
    ]
  },
  {
    "key": "SO2",
    "id_x": "2668",
    "values": [
      {
        "date": "2024-01-27 12:00:00",
        "value": 1.95141
      }
    ]
  },
  {
    "key": "SO2",
    "id_x": "2510",
    "values": [
      {
        "date": "2024-01-27 12:00:00",
        "value": 2.4592
      }
    ]
  },
  {
    "key": "SO2",
    "id_x": "2566",
    "values": [
      {
        "date": "2024-01-27 12:00:00",
        "value": 6.55986
      }
    ]
  },
  {
    "key": "SO2",
    "id_x": "2601",
    "values": [
      {
        "date": "2024-01-27 12:00:00",
        "value": 3.51194
      }
    ]
  },
  {
    "key": "SO2",
    "id_x": "1409",
    "values": [
      {
        "date": "2024-01-27 12:00:00",
        "value": 1.7
      }
    ]
  },
  {
    "key": "SO2",
    "id_x": "21264",
    "values": [
      {
        "date": "2024-01-27 12:00:00",
        "value": 1.4
      }
    ]
  },
  {
    "key": "SO2",
    "id_x": "1650",
    "values": [
      {
        "date": "2024-01-27 12:00:00",
        "value": 0.2
      }
    ]
  },
  {
    "key": "SO2",
    "id_x": "26305",
    "values": [
      {
        "date": "2024-01-27 12:00:00",
        "value": 0.5
      }
    ]
  },
  {
    "key": "SO2",
    "id_x": "6218",
    "values": [
      {
        "date": "2024-01-27 12:00:00",
        "value": 2.60251
      }
    ]
  },
  {
    "key": "SO2",
    "id_x": "6324",
    "values": [
      {
        "date": "2024-01-27 12:00:00",
        "value": 5.57735
      }
    ]
  }
]