{
    "gitlaburl": "https://gitlab.example.com",
    "container_path": "registry.gitlab.example.com/pipelinecoe/containers",
    "base_container_path": "registry.access.redhat.com/ubi8/ubi:latest",
    "buildah": "registry.access.redhat.com/ubi8/buildah:latest",
    "parent_id": "",
    "tags": "",
    "registry": "",
    "registry_user": "",
    "registry_password": "",
    "image_path": "",
    "visibility": "",
    "git_user_name": "",
    "git_user_email": "",
    "git_user_gpgsigningkey": "",
    "custom_commit_message": ""
}
