M. Main and W. Savitch                Data Structures and Other Objects Using C++          Addison-Wesley     2011  T
K. Dattatri                           C++ Effective Object-Oriented Software Construction  Prentice Hall      2000  T
B. Stroustrup                         Programming Principles and Practice Using C++        Addison-Wesley     2014  T
B. Stroustrup                         The C++ Programming Language                         Addison-Wesley     2013  R
W. Savitch                            Problem Solving with C++                             Pearson            2015  T
W. R. Stevens                         Unix Network Programming                             Prentice Hall      1990  D
A. Aho, J. Hopcroft and J. Ullman     Data Structures and Algorithms                       Addison-Wesley     1987  D
J. Lewis, P. DePasquale and J. Chase  Java Foundations                                     Pearson            2014  N
H. Lewis and C. Papadimitriou         Elements of the Theory of Computation                Prentice Hall      1981  R
A. Gilat                              Matlab An Introduction with Applications             Wiley              2015  N
S. Attaway                            Matlab A Practical Introduction                      Elsevier           2012  D
M. Weiss                              Data Structures and Algorithm Analysis in C++        Pearson            2014  R
