---
source: src/app/contexts/docker_compose/services/non_consensus_node.rs
expression: service

---
command:
  - "--base-path"
  - /xand/validator
  - "--no-mdns"
  - "--unsafe-ws-external"
  - "--unsafe-rpc-external"
  - "--rpc-cors"
  - all
  - "--prometheus-external"
  - "--execution"
  - NativeElseWasm
  - "--public-addr"
  - multi-address-dns
environment:
  BOOTNODE_URL_VEC: blah
  CONSENSUS_NODE: "false"
  EMIT_METRICS: "true"
  NODE_NAME: the-name
  TELEMETRY_URL: "ws://substrate-telemetry:1024 0"
  XAND_HUMAN_LOGGING: "true"
expose:
  - "8933"
  - "9944"
  - "30333"
  - "10044"
image: "some-image:1.1.1"
networks:
  xand: {}
ports:
  - "1234:10044"
volumes:
  - "./dummy/root/dir/xand/chainspec/chainSpecModified.json:/xand/chainspec/chainSpecModified.json"
  - "./dummy/root/dir/xand/validator:/xand/validator/"
  - "./dummy/root/dir/xand/keypairs:/xand/keypairs"
  - "./dummy/root/dir/xand-api/initial-keys:/etc/xand-keys"
  - "./dummy/root/dir/xand-api/key-management:/xand/keys"

